aries-dev mailing list archives

Site index · List index
Message view « Date » · « Thread »
Top « Date » · « Thread »
From Apache Jenkins Server <jenk...@builds.apache.org>
Subject Build failed in Jenkins: AriesWithSnapshotDependencies #579
Date Mon, 06 Oct 2014 20:44:45 GMT
See <https://builds.apache.org/job/AriesWithSnapshotDependencies/579/changes>

Changes:

[jbonofre] [ARIES-1257] Fix the update-method callback in blueprint-cm

------------------------------------------
[...truncated 17426 lines...]
Downloaded: http://repo1.maven.org/maven2/org/apache/openjpa/openjpa/2.3.0/openjpa-2.3.0.jar
(4587 KB at 4254.8 KB/sec)
[INFO] ------------------------------------------------------------------------
[INFO] Reactor Summary:
[INFO] 
[INFO] Aries :: Parent POM ............................... SUCCESS [1.558s]
[INFO] Aries Maven EBA Plugin ............................ SUCCESS [12.100s]
[INFO] Apache Aries Unit Test Support .................... SUCCESS [2.735s]
[INFO] Apache Aries Test Support ......................... SUCCESS [0.025s]
[INFO] Apache Aries Util classes compiled under r 42 framework  SUCCESS [6.998s]
[INFO] Apache Aries Util ................................. SUCCESS [9.305s]
[INFO] Apache Aries Util ................................. SUCCESS [0.025s]
[INFO] Apache Aries Proxy API ............................ SUCCESS [0.959s]
[INFO] Apache Aries Proxy Service ........................ SUCCESS [5.675s]
[INFO] Apache Aries Proxy Bundle ......................... SUCCESS [0.541s]
[INFO] Apache Aries Proxy iTests ......................... SUCCESS [22.564s]
[INFO] Apache Aries Class Proxy .......................... SUCCESS [0.022s]
[INFO] Apache Aries Quiesce API .......................... SUCCESS [0.232s]
[INFO] Apache Aries Quiesce Manager ...................... SUCCESS [0.501s]
[INFO] Aries Quiesce Manager iTests ...................... SUCCESS [5.572s]
[INFO] Apache Aries Quiesce .............................. SUCCESS [0.039s]
[INFO] Apache Aries Blueprint API ........................ SUCCESS [0.561s]
[INFO] Apache Aries Blueprint Parser ..................... SUCCESS [0.608s]
[INFO] Apache Aries Blueprint Core ....................... SUCCESS [5.323s]
[INFO] Apache Aries Blueprint CM ......................... SUCCESS [4.314s]
[INFO] Apache Aries Blueprint Bundle ..................... SUCCESS [2.403s]
[INFO] Apache Aries Blueprint Compatiblity Fragment Bundle  SUCCESS [0.381s]
[INFO] Apache Aries Blueprint Core Compatiblity Fragment Bundle  SUCCESS [0.704s]
[INFO] Apache Aries Blueprint no-OSGI .................... SUCCESS [1.222s]
[INFO] Apache Aries Blueprint Web ........................ SUCCESS [1.585s]
[INFO] Apache Aries Blueprint Web OSGI ................... SUCCESS [0.840s]
[INFO] Apache Aries Blueprint JEXL evaluator ............. SUCCESS [0.898s]
[INFO] Apache Aries Blueprint Sample ..................... SUCCESS [0.603s]
[INFO] Apache Aries Blueprint Annotation API ............. SUCCESS [0.225s]
[INFO] Apache Aries Blueprint Annotation Impl ............ SUCCESS [3.812s]
[INFO] Aries :: blueprint :: annotation based authorization  SUCCESS [0.877s]
[INFO] Apache Aries Blueprint Sample for Testing Annotation  SUCCESS [0.471s]
[INFO] Apache Aries Blueprint Sample Fragment for Testing Annotation  SUCCESS [0.452s]
[INFO] Apache Aries Blueprint WAR Sample ................. SUCCESS [2.018s]
[INFO] Apache Aries Blueprint Test Bundle A .............. SUCCESS [0.757s]
[INFO] Apache Aries Blueprint Test Bundle B .............. SUCCESS [0.911s]
[INFO] Apache Aries Blueprint Test Quiesce Bundle ........ SUCCESS [0.452s]
[INFO] Apache Aries Blueprint iTests ..................... SUCCESS [6.004s]
[INFO] Apache Aries Blueprint ............................ SUCCESS [0.018s]
[INFO] Apache Aries JNDI API ............................. SUCCESS [0.254s]
[INFO] Apache Aries JNDI Core ............................ SUCCESS [1.135s]
[INFO] Apache Aries JNDI URL Handler ..................... SUCCESS [0.656s]
[INFO] Apache Aries JNDI RMI Handler ..................... SUCCESS [0.497s]
[INFO] Apache Aries JNDI Bundle .......................... SUCCESS [1.093s]
[INFO] Apache Aries JNDI Support for Legacy Runtimes ..... SUCCESS [0.220s]
[INFO] Apache Aries JNDI "business logic" test bundle for Aries jndi-url iTests  SUCCESS [0.516s]
[INFO] Apache Aries JNDI Test Bundle for Aries jndi-url iTests  SUCCESS [0.533s]
[INFO] Apache Aries JNDI iTests for jndi-url ............. SUCCESS [9.708s]
[INFO] Apache Aries JNDI ................................. SUCCESS [0.014s]
[INFO] Apache Aries Transaction Manager .................. SUCCESS [8.530s]
[INFO] Apache Aries Transaction Blueprint ................ SUCCESS [0.414s]
[INFO] Apache Aries Transaction Enlisting JDBC Datasource  SUCCESS [6.825s]
[INFO] Apache Aries JMS Pool ............................. SUCCESS [2.265s]
[INFO] Apache Aries Transaction Test Datasource Configuration  SUCCESS [1.577s]
[INFO] Apache Aries Transaction Test Bundle .............. SUCCESS [0.574s]
[INFO] Apache Aries Transaction Integration Tests ........ SUCCESS [0.971s]
[INFO] Apache Aries Transaction - reactor pom ............ SUCCESS [0.015s]
[INFO] Apache Aries Web Url handler ...................... SUCCESS [0.652s]
[INFO] Apache Aries Web integration tests ................ SUCCESS [1.588s]
[INFO] Apache Aries Web Component ........................ SUCCESS [0.016s]
[INFO] Apache Aries Application API ...................... SUCCESS [0.559s]
[INFO] Apache Aries Application Utils .................... SUCCESS [0.741s]
[INFO] Apache Aries Application Bundle ................... SUCCESS [3.981s]
[INFO] Apache Aries Application Converters ............... SUCCESS [1.396s]
[INFO] Apache Aries Application Default local platform ... SUCCESS [0.260s]
[INFO] Apache Aries Application Deployment Management .... SUCCESS [0.305s]
[INFO] Apache Aries Application Installer ................ SUCCESS [1.334s]
[INFO] Apache Aries Application itests sample application interface  SUCCESS [0.555s]
[INFO] Apache Aries Application integration tests ........ SUCCESS [7.618s]
[INFO] Apache Aries Application Management ............... SUCCESS [0.326s]
[INFO] Apache Aries Application Modelling ................ SUCCESS [0.452s]
[INFO] Apache Aries Application Modelling Standalone ..... SUCCESS [34.743s]
[INFO] Apache Aries Application Modelling tests .......... SUCCESS [1.293s]
[INFO] Apache Aries Application No-op Resolver ........... SUCCESS [0.177s]
[INFO] Apache Aries Application OBR Resolver ............. SUCCESS [0.390s]
[INFO] Apache Aries Application Resolve CM Transform ..... SUCCESS [0.209s]
[INFO] Apache Aries Application Resolve CM Transform iTests  SUCCESS [0.552s]
[INFO] Apache Aries Application Runtime .................. SUCCESS [0.223s]
[INFO] Apache Aries Isolated Application Runtime ......... SUCCESS [0.236s]
[INFO] Apache Aries Bundle Framework provider ............ SUCCESS [0.273s]
[INFO] Apache Aries Bundle Framework Manager provider .... SUCCESS [0.275s]
[INFO] Apache Aries repository generator tool ............ SUCCESS [4.343s]
[INFO] Apache Aries Bundle Repository provider ........... SUCCESS [0.235s]
[INFO] Application distribution .......................... SUCCESS [2.491s]
[INFO] Application distribution for isolated application support  SUCCESS [0.944s]
[INFO] Apache Aries Application .......................... SUCCESS [0.016s]
[INFO] Apache Aries Subsystem API ........................ SUCCESS [1.850s]
[INFO] Apache Aries Subsystem Core ....................... SUCCESS [5.147s]
[INFO] Apache Aries Subsystem OBR ........................ SUCCESS [0.607s]
[INFO] Apache Aries Subsystem iTests interfaces bundle ... SUCCESS [0.159s]
[INFO] Apache Aries Subsystem iTests ..................... SUCCESS [10.651s]
[INFO] Apache Aries Subsystems Bundle .................... SUCCESS [2.007s]
[INFO] Apache Aries Subsystem ............................ SUCCESS [0.051s]
[INFO] Aries EJB Modelling Integration ................... SUCCESS [10.861s]
[INFO] Aries EJB Modelling iTests ........................ SUCCESS [13.951s]
[INFO] Aries OpenEJB Runtime Extender .................... SUCCESS [0.982s]
[INFO] Aries EJB Extender iTests ......................... SUCCESS [7.021s]
[INFO] Aries EJB Component ............................... SUCCESS [0.013s]
[INFO] Apache Aries JMX API .............................. SUCCESS [0.372s]
[INFO] Apache Aries JMX Blueprint API .................... SUCCESS [0.301s]
[INFO] Apache Aries JMX Core ............................. SUCCESS [1.509s]
[INFO] Apache Aries JMX Core via Whiteboards ............. SUCCESS [0.792s]
[INFO] Apache Aries Whiteboard support for JMX DynamicMBean services  SUCCESS [3.005s]
[INFO] Apache Aries JMX Blueprint Core ................... SUCCESS [4.840s]
[INFO] Apache Aries JMX Bundle ........................... SUCCESS [1.758s]
[INFO] Apache Aries JMX Blueprint Bundle ................. SUCCESS [1.007s]
[INFO] Apache Aries JMX integration tests ................ SUCCESS [0.614s]
[INFO] Apache Aries JMX .................................. SUCCESS [0.012s]
[INFO] Aries JPA Container API ........................... SUCCESS [0.703s]
[INFO] Aries JPA Container ............................... SUCCESS [2.479s]
[INFO] Aries JPA Container Managed Contexts .............. SUCCESS [1.133s]
[INFO] Aries JPA Container blueprint integration for Aries blueprint  SUCCESS [0.920s]
[INFO] Test Bundle for Aries JPA Container iTests ........ SUCCESS [3.837s]
[INFO] Test Bundle for Aries JPA Container advanced iTests  SUCCESS [0.470s]
[INFO] Test Bundle for Aries JPA Blueprint iTests ........ SUCCESS [0.473s]
[INFO] Aries JPA iTests .................................. FAILURE [9.892s]
[INFO] Aries JPA Component ............................... SKIPPED
[INFO] Apache Aries SPI Fly Core (internal module) ....... SKIPPED
[INFO] Apache Aries SPI Fly Weaver (internal module) ..... SKIPPED
[INFO] Apache Aries SPI Fly Dynamic Weaving Bundle ....... SKIPPED
[INFO] Apache Aries SPI Fly Static Weaving Tool .......... SKIPPED
[INFO] Apache Aries SPI Fly Static Weaving Bundle ........ SKIPPED
[INFO] Apache Aries SPI Fly Examples ..................... SKIPPED
[INFO] Apache Aries Example SPI Interface ................ SKIPPED
[INFO] Apache Aries Example SPI Provider Jar 1 ........... SKIPPED
[INFO] Apache Aries Example SPI Provider Bundle 1 ........ SKIPPED
[INFO] Apache Aries Example SPI Provider Bundle 2 ........ SKIPPED
[INFO] Apache Aries Example SPI Client Jar 1 ............. SKIPPED
[INFO] Apache Aries Example SPI Client Bundle 1 .......... SKIPPED
[INFO] Apache Aries Example SPI Client Bundle 2 .......... SKIPPED
[INFO] Apache Aries Example SPI Provider Consumer Bundle . SKIPPED
[INFO] Apache Aries Example Resource Provider Bundle ..... SKIPPED
[INFO] Apache Aries Example Resource Client Bundle ....... SKIPPED
[INFO] Apache Aries SPI Fly .............................. SKIPPED
[INFO] Apache Aries Samples .............................. SKIPPED
[INFO] Apache Aries blog sample .......................... SKIPPED
[INFO] Apache Aries blog sample API ...................... SKIPPED
[INFO] Apache Aries blog sample transaction enlisting JDBC datasource  SKIPPED
[INFO] Apache Aries blog sample assembly ................. SKIPPED
[INFO] Apache Aries blog sample .......................... SKIPPED
[INFO] Apache Aries blog sample web component ............ SKIPPED
[INFO] Apache Aries blog sample persistence .............. SKIPPED
[INFO] Apache Aries Blog Sample EBA using JDBC ........... SKIPPED
[INFO] Apache Aries blog sample persistence .............. SKIPPED
[INFO] Apache Aries Blog Sample EBA using JPA ............ SKIPPED
[INFO] Apache Aries blog sample commenting EJB ........... SKIPPED
[INFO] Apache Aries Blog sample iTests ................... SKIPPED
[INFO] AriesTrader :: Performance Benchmark Sample ....... SKIPPED
[INFO] AriesTrader :: Modules ............................ SKIPPED
[INFO] AriesTrader :: Modules - Util ..................... SKIPPED
[INFO] AriesTrader :: Modules - API ...................... SKIPPED
[INFO] AriesTrader :: Modules - Core ..................... SKIPPED
[INFO] AriesTrader :: Modules - Web ...................... SKIPPED
[INFO] AriesTrader :: Modules - Beans .................... SKIPPED
[INFO] AriesTrader :: Modules - Entities ................. SKIPPED
[INFO] AriesTrader :: Modules - Derby DataSource ......... SKIPPED
[INFO] AriesTrader :: Modules - Persist JDBC ............. SKIPPED
[INFO] AriesTrader :: Modules - Persist JPA App Managed .. SKIPPED
[INFO] AriesTrader :: Modules - Persist JPA Container Managed  SKIPPED
[INFO] AriesTrader :: Assemblies ......................... SKIPPED
[INFO] AriesTrader :: Assemblies - EBA - JDBC ............ SKIPPED
[INFO] AriesTrader :: Assemblies - EBA - ALL ............. SKIPPED
[INFO] Equinox test harness that can be used to install sample EBAs  SKIPPED
[INFO] Apache Aries Blueprint samples .................... SKIPPED
[INFO] Apache Aries Blueprint HelloWorld ................. SKIPPED
[INFO] Apache Aries Blueprint HelloWorld API ............. SKIPPED
[INFO] Apache Aries Blueprint HelloWorldServer ........... SKIPPED
[INFO] Apache Aries Blueprint HelloWorldClient ........... SKIPPED
[INFO] Apache Aries Blueprint HelloWorld Assembly ........ SKIPPED
[INFO] Apache Aries Blueprint HelloWorld EBA ............. SKIPPED
[INFO] Apache Aries Blueprint sample iTests .............. SKIPPED
[INFO] Apache Aries Blueprint Sample - ID Verifier ....... SKIPPED
[INFO] Apache Aries Blueprint Sample - ID Verifier API ... SKIPPED
[INFO] Apache Aries Blueprint Sample - ID Verifier Server  SKIPPED
[INFO] Apache Aries Blueprint Sample - ID Verifier Client  SKIPPED
[INFO] Apache Aries Blueprint Sample - ID Verifier Assembly  SKIPPED
[INFO] Apache Aries Twitter sample ....................... SKIPPED
[INFO] Apache Aries Bundlise Twitter4j ................... SKIPPED
[INFO] Apache Aries Twitter bundle ....................... SKIPPED
[INFO] Apache Aries Twitter EBA .......................... SKIPPED
[INFO] Apache Aries Twitter sample integration tests ..... SKIPPED
[INFO] Aries Maven ESA Plugin ............................ SKIPPED
[INFO] Apache Aries ...................................... SKIPPED
[INFO] ------------------------------------------------------------------------
[INFO] BUILD FAILURE
[INFO] ------------------------------------------------------------------------
[INFO] Total time: 5:00.244s
[INFO] Finished at: Mon Oct 06 20:44:41 UTC 2014
[INFO] Final Memory: 132M/589M
[INFO] ------------------------------------------------------------------------
[ERROR] Failed to execute goal on project org.apache.aries.jpa.container.itest: Could not
resolve dependencies for project org.apache.aries.jpa:org.apache.aries.jpa.container.itest:jar:1.0.1-SNAPSHOT:
The following artifacts could not be resolved: org.apache.aries.jpa:org.apache.aries.jpa.container.context:jar:1.0.3-SNAPSHOT,
org.apache.aries.jpa:org.apache.aries.jpa.blueprint.aries:jar:1.0.3-SNAPSHOT: Could not find
artifact org.apache.aries.jpa:org.apache.aries.jpa.container.context:jar:1.0.3-SNAPSHOT in
codehaus.snapshots (http://snapshots.repository.codehaus.org) -> [Help 1]
org.apache.maven.lifecycle.LifecycleExecutionException: Failed to execute goal on project
org.apache.aries.jpa.container.itest: Could not resolve dependencies for project org.apache.aries.jpa:org.apache.aries.jpa.container.itest:jar:1.0.1-SNAPSHOT:
The following artifacts could not be resolved: org.apache.aries.jpa:org.apache.aries.jpa.container.context:jar:1.0.3-SNAPSHOT,
org.apache.aries.jpa:org.apache.aries.jpa.blueprint.aries:jar:1.0.3-SNAPSHOT: Could not find
artifact org.apache.aries.jpa:org.apache.aries.jpa.container.context:jar:1.0.3-SNAPSHOT in
codehaus.snapshots (http://snapshots.repository.codehaus.org)
	at org.apache.maven.lifecycle.internal.LifecycleDependencyResolver.getDependencies(LifecycleDependencyResolver.java:196)
	at org.apache.maven.lifecycle.internal.LifecycleDependencyResolver.resolveProjectDependencies(LifecycleDependencyResolver.java:108)
	at org.apache.maven.lifecycle.internal.MojoExecutor.ensureDependenciesAreResolved(MojoExecutor.java:258)
	at org.apache.maven.lifecycle.internal.MojoExecutor.execute(MojoExecutor.java:201)
	at org.apache.maven.lifecycle.internal.MojoExecutor.execute(MojoExecutor.java:153)
	at org.apache.maven.lifecycle.internal.MojoExecutor.execute(MojoExecutor.java:145)
	at org.apache.maven.lifecycle.internal.LifecycleModuleBuilder.buildProject(LifecycleModuleBuilder.java:84)
	at org.apache.maven.lifecycle.internal.LifecycleModuleBuilder.buildProject(LifecycleModuleBuilder.java:59)
	at org.apache.maven.lifecycle.internal.LifecycleStarter.singleThreadedBuild(LifecycleStarter.java:183)
	at org.apache.maven.lifecycle.internal.LifecycleStarter.execute(LifecycleStarter.java:161)
	at org.apache.maven.DefaultMaven.doExecute(DefaultMaven.java:319)
	at org.apache.maven.DefaultMaven.execute(DefaultMaven.java:156)
	at org.apache.maven.cli.MavenCli.execute(MavenCli.java:537)
	at org.apache.maven.cli.MavenCli.doMain(MavenCli.java:196)
	at org.apache.maven.cli.MavenCli.main(MavenCli.java:141)
	at sun.reflect.NativeMethodAccessorImpl.invoke0(Native Method)
	at sun.reflect.NativeMethodAccessorImpl.invoke(NativeMethodAccessorImpl.java:57)
	at sun.reflect.DelegatingMethodAccessorImpl.invoke(DelegatingMethodAccessorImpl.java:43)
	at java.lang.reflect.Method.invoke(Method.java:606)
	at org.codehaus.plexus.classworlds.launcher.Launcher.launchEnhanced(Launcher.java:290)
	at org.codehaus.plexus.classworlds.launcher.Launcher.launch(Launcher.java:230)
	at org.codehaus.plexus.classworlds.launcher.Launcher.mainWithExitCode(Launcher.java:409)
	at org.codehaus.plexus.classworlds.launcher.Launcher.main(Launcher.java:352)
Caused by: org.apache.maven.project.DependencyResolutionException: Could not resolve dependencies
for project org.apache.aries.jpa:org.apache.aries.jpa.container.itest:jar:1.0.1-SNAPSHOT:
The following artifacts could not be resolved: org.apache.aries.jpa:org.apache.aries.jpa.container.context:jar:1.0.3-SNAPSHOT,
org.apache.aries.jpa:org.apache.aries.jpa.blueprint.aries:jar:1.0.3-SNAPSHOT: Could not find
artifact org.apache.aries.jpa:org.apache.aries.jpa.container.context:jar:1.0.3-SNAPSHOT in
codehaus.snapshots (http://snapshots.repository.codehaus.org)
	at org.apache.maven.project.DefaultProjectDependenciesResolver.resolve(DefaultProjectDependenciesResolver.java:170)
	at org.apache.maven.lifecycle.internal.LifecycleDependencyResolver.getDependencies(LifecycleDependencyResolver.java:171)
	... 22 more
Caused by: org.sonatype.aether.resolution.DependencyResolutionException: The following artifacts
could not be resolved: org.apache.aries.jpa:org.apache.aries.jpa.container.context:jar:1.0.3-SNAPSHOT,
org.apache.aries.jpa:org.apache.aries.jpa.blueprint.aries:jar:1.0.3-SNAPSHOT: Could not find
artifact org.apache.aries.jpa:org.apache.aries.jpa.container.context:jar:1.0.3-SNAPSHOT in
codehaus.snapshots (http://snapshots.repository.codehaus.org)
	at org.sonatype.aether.impl.internal.DefaultRepositorySystem.resolveDependencies(DefaultRepositorySystem.java:412)
	at org.apache.maven.project.DefaultProjectDependenciesResolver.resolve(DefaultProjectDependenciesResolver.java:164)
	... 23 more
Caused by: org.sonatype.aether.resolution.ArtifactResolutionException: The following artifacts
could not be resolved: org.apache.aries.jpa:org.apache.aries.jpa.container.context:jar:1.0.3-SNAPSHOT,
org.apache.aries.jpa:org.apache.aries.jpa.blueprint.aries:jar:1.0.3-SNAPSHOT: Could not find
artifact org.apache.aries.jpa:org.apache.aries.jpa.container.context:jar:1.0.3-SNAPSHOT in
codehaus.snapshots (http://snapshots.repository.codehaus.org)
	at org.sonatype.aether.impl.internal.DefaultArtifactResolver.resolve(DefaultArtifactResolver.java:541)
	at org.sonatype.aether.impl.internal.DefaultArtifactResolver.resolveArtifacts(DefaultArtifactResolver.java:220)
	at org.sonatype.aether.impl.internal.DefaultRepositorySystem.resolveDependencies(DefaultRepositorySystem.java:395)
	... 24 more
Caused by: org.sonatype.aether.transfer.ArtifactNotFoundException: Could not find artifact
org.apache.aries.jpa:org.apache.aries.jpa.container.context:jar:1.0.3-SNAPSHOT in codehaus.snapshots
(http://snapshots.repository.codehaus.org)
	at org.sonatype.aether.connector.wagon.WagonRepositoryConnector$4.wrap(WagonRepositoryConnector.java:945)
	at org.sonatype.aether.connector.wagon.WagonRepositoryConnector$4.wrap(WagonRepositoryConnector.java:940)
	at org.sonatype.aether.connector.wagon.WagonRepositoryConnector$GetTask.flush(WagonRepositoryConnector.java:695)
	at org.sonatype.aether.connector.wagon.WagonRepositoryConnector$GetTask.flush(WagonRepositoryConnector.java:689)
	at org.sonatype.aether.connector.wagon.WagonRepositoryConnector.get(WagonRepositoryConnector.java:445)
	at org.sonatype.aether.impl.internal.DefaultArtifactResolver.resolve(DefaultArtifactResolver.java:460)
	... 26 more
[ERROR] 
[ERROR] Re-run Maven using the -X switch to enable full debug logging.
[ERROR] 
[ERROR] For more information about the errors and possible solutions, please read the following
articles:
[ERROR] [Help 1] http://cwiki.apache.org/confluence/display/MAVEN/DependencyResolutionException
[ERROR] 
[ERROR] After correcting the problems, you can resume the build with the command
[ERROR]   mvn <goals> -rf :org.apache.aries.jpa.container.itest
Build step 'Invoke top-level Maven targets' marked build as failure

Mime
View raw message