aries-dev mailing list archives

Site index · List index
Message view « Date » · « Thread »
Top « Date » · « Thread »
From Apache Jenkins Server <jenk...@builds.apache.org>
Subject Build failed in Jenkins: AriesWithSnapshotDependencies #571
Date Wed, 01 Oct 2014 11:52:37 GMT
See <https://builds.apache.org/job/AriesWithSnapshotDependencies/571/changes>

Changes:

[cschneider] ARIES-1234 Remove jpa20 module

------------------------------------------
[...truncated 6603 lines...]
A         subsystem/subsystem-itests/src/test/bundles/tb1/org/apache/aries/subsystem/itests/tb1/Empty.java
A         subsystem/subsystem-itests/src/test/bundles/tb2
A         subsystem/subsystem-itests/src/test/bundles/tb2/org
A         subsystem/subsystem-itests/src/test/bundles/tb2/org/apache
A         subsystem/subsystem-itests/src/test/bundles/tb2/org/apache/aries
A         subsystem/subsystem-itests/src/test/bundles/tb2/org/apache/aries/subsystem
A         subsystem/subsystem-itests/src/test/bundles/tb2/org/apache/aries/subsystem/itests
A         subsystem/subsystem-itests/src/test/bundles/tb2/org/apache/aries/subsystem/itests/tb2
A         subsystem/subsystem-itests/src/test/bundles/tb2/org/apache/aries/subsystem/itests/tb2/Empty.java
A         subsystem/subsystem-itests/src/test/bundles/tb2/META-INF
A         subsystem/subsystem-itests/src/test/bundles/tb2/META-INF/MANIFEST.MF
A         subsystem/subsystem-itests/src/test/bundles/tb3
A         subsystem/subsystem-itests/src/test/bundles/tb3/META-INF
A         subsystem/subsystem-itests/src/test/bundles/tb3/META-INF/MANIFEST.MF
A         subsystem/subsystem-itests/src/test/bundles/tb3/org
A         subsystem/subsystem-itests/src/test/bundles/tb3/org/apache
A         subsystem/subsystem-itests/src/test/bundles/tb3/org/apache/aries
A         subsystem/subsystem-itests/src/test/bundles/tb3/org/apache/aries/subsystem
A         subsystem/subsystem-itests/src/test/bundles/tb3/org/apache/aries/subsystem/itests
A         subsystem/subsystem-itests/src/test/bundles/tb3/org/apache/aries/subsystem/itests/tb3
A         subsystem/subsystem-itests/src/test/bundles/tb3/org/apache/aries/subsystem/itests/tb3/Empty.java
A         subsystem/subsystem-itests/src/test/bundles/core.fragment
A         subsystem/subsystem-itests/src/test/bundles/core.fragment/META-INF
A         subsystem/subsystem-itests/src/test/bundles/core.fragment/META-INF/MANIFEST.MF
A         subsystem/subsystem-itests/src/test/classes
A         subsystem/subsystem-itests/src/test/classes/a
A         subsystem/subsystem-itests/src/test/classes/a/A.java
A         subsystem/subsystem-itests/src/test/classes/b
A         subsystem/subsystem-itests/src/test/classes/b/B.java
A         subsystem/subsystem-itests/src/test/java
A         subsystem/subsystem-itests/src/test/java/org
A         subsystem/subsystem-itests/src/test/java/org/ops4j
A         subsystem/subsystem-itests/src/test/java/org/ops4j/pax
A         subsystem/subsystem-itests/src/test/java/org/ops4j/pax/runner
A         subsystem/subsystem-itests/src/test/java/org/ops4j/pax/runner/platform
A         subsystem/subsystem-itests/src/test/java/org/ops4j/pax/runner/platform/equinox
A         subsystem/subsystem-itests/src/test/java/org/ops4j/pax/runner/platform/equinox/internal
A         subsystem/subsystem-itests/src/test/java/org/apache
A         subsystem/subsystem-itests/src/test/java/org/apache/aries
A         subsystem/subsystem-itests/src/test/java/org/apache/aries/subsystem
A         subsystem/subsystem-itests/src/test/java/org/apache/aries/subsystem/ctt
A         subsystem/subsystem-itests/src/test/java/org/apache/aries/subsystem/ctt/itests
A         subsystem/subsystem-itests/src/test/java/org/apache/aries/subsystem/ctt/itests/SubsystemDependency_4ATest.java
A         subsystem/subsystem-itests/src/test/java/org/apache/aries/subsystem/ctt/itests/SubsystemDependency_4BTest.java
A         subsystem/subsystem-itests/src/test/java/org/apache/aries/subsystem/ctt/itests/SubsystemDependency_4CTest.java
A         subsystem/subsystem-itests/src/test/java/org/apache/aries/subsystem/ctt/itests/SubsystemDependency_4DTest.java
A         subsystem/subsystem-itests/src/test/java/org/apache/aries/subsystem/ctt/itests/SubsystemDependency_4E1Test.java
A         subsystem/subsystem-itests/src/test/java/org/apache/aries/subsystem/ctt/itests/SubsystemDependency_4E2Test.java
A         subsystem/subsystem-itests/src/test/java/org/apache/aries/subsystem/ctt/itests/SubsystemDependencyTestBase.java
A         subsystem/subsystem-itests/src/test/java/org/apache/aries/subsystem/itests
A         subsystem/subsystem-itests/src/test/java/org/apache/aries/subsystem/itests/FeatureTest.java
A         subsystem/subsystem-itests/src/test/java/org/apache/aries/subsystem/itests/OptionalDependenciesTest.java
A         subsystem/subsystem-itests/src/test/java/org/apache/aries/subsystem/itests/BundleEventHookTest.java
A         subsystem/subsystem-itests/src/test/java/org/apache/aries/subsystem/itests/util
A         subsystem/subsystem-itests/src/test/java/org/apache/aries/subsystem/itests/util/TestCapability.java
A         subsystem/subsystem-itests/src/test/java/org/apache/aries/subsystem/itests/util/RepositoryDescriptorGenerator.java
A         subsystem/subsystem-itests/src/test/java/org/apache/aries/subsystem/itests/util/RepositoryGenerator.java
A         subsystem/subsystem-itests/src/test/java/org/apache/aries/subsystem/itests/util/BundleInfoImpl.java
A         subsystem/subsystem-itests/src/test/java/org/apache/aries/subsystem/itests/util/TestResource.java
A         subsystem/subsystem-itests/src/test/java/org/apache/aries/subsystem/itests/util/Manve2Repository.java
A         subsystem/subsystem-itests/src/test/java/org/apache/aries/subsystem/itests/util/TestRepositoryContent.java
A         subsystem/subsystem-itests/src/test/java/org/apache/aries/subsystem/itests/util/ContentImpl.java
A         subsystem/subsystem-itests/src/test/java/org/apache/aries/subsystem/itests/util/GenericMetadataWrapper.java
A         subsystem/subsystem-itests/src/test/java/org/apache/aries/subsystem/itests/util/TestRepository.java
A         subsystem/subsystem-itests/src/test/java/org/apache/aries/subsystem/itests/util/Utils.java
A         subsystem/subsystem-itests/src/test/java/org/apache/aries/subsystem/itests/DependencyLifeCycleTest.java
A         subsystem/subsystem-itests/src/test/java/org/apache/aries/subsystem/itests/SubsystemTest.java
A         subsystem/subsystem-itests/src/test/java/org/apache/aries/subsystem/itests/ServiceDependencyTest.java
A         subsystem/subsystem-itests/src/test/java/org/apache/aries/subsystem/itests/CompositeTest.java
A         subsystem/subsystem-itests/src/test/java/org/apache/aries/subsystem/itests/RootSubsystemTest.java
A         subsystem/subsystem-itests/src/test/java/org/apache/aries/subsystem/itests/obr
A         subsystem/subsystem-itests/src/test/java/org/apache/aries/subsystem/itests/obr/felix
A         subsystem/subsystem-itests/src/test/java/org/apache/aries/subsystem/itests/obr/felix/FelixResourceAdapter.java
A         subsystem/subsystem-itests/src/test/java/org/apache/aries/subsystem/itests/obr/felix/OsgiRequirementAdapter.java
A         subsystem/subsystem-itests/src/test/java/org/apache/aries/subsystem/itests/obr/felix/OsgiCapabilityAdapter.java
A         subsystem/subsystem-itests/src/test/java/org/apache/aries/subsystem/itests/obr/felix/FelixRepositoryAdapter.java
A         subsystem/subsystem-itests/src/test/java/org/apache/aries/subsystem/itests/obr/felix/RepositoryAdminRepository.java
A         subsystem/subsystem-itests/src/test/java/org/apache/aries/subsystem/itests/obr/felix/FelixRequirementAdapter.java
A         subsystem/subsystem-itests/src/test/java/org/apache/aries/subsystem/itests/obr/felix/FelixCapabilityAdapter.java
A         subsystem/subsystem-itests/src/test/java/org/apache/aries/subsystem/itests/obr/felix/OsgiResourceAdapter.java
A         subsystem/subsystem-itests/src/test/java/org/apache/aries/subsystem/itests/obr/felix/FelixProperty.java
A         subsystem/subsystem-itests/src/test/java/org/apache/aries/subsystem/itests/NoRequirementFilterTest.java
AU        subsystem/subsystem-itests/src/test/java/org/apache/aries/subsystem/itests/ApplicationTest.java
A         subsystem/subsystem-itests/src/test/java/org/apache/aries/subsystem/itests/ResolutionTest.java
A         subsystem/subsystem-itests/src/test/java/org/apache/aries/subsystem/itests/BlueprintTest.java
A         subsystem/subsystem-itests/src/test/java/org/apache/aries/subsystem/itests/InstallTest.java
A         subsystem/subsystem-itests/src/test/java/org/apache/aries/subsystem/itests/ProvisionPolicyTest.java
A         subsystem/subsystem-itests/src/test/java/org/apache/aries/subsystem/itests/HelloWorldTest.java
AU        subsystem/subsystem-itests/src/test/java/org/apache/aries/subsystem/itests/SharedResourceTest.java
A         subsystem/subsystem-itests/src/test/java/org/apache/aries/subsystem/itests/BundleStartLevelTest.java
A         subsystem/subsystem-itests/src/test/java/org/apache/aries/subsystem/itests/DynamicImportTest.java
A         subsystem/subsystem-itests/src/test/java/org/apache/aries/subsystem/itests/BasicTest.java
A         subsystem/subsystem-itests/src/test/java/org/apache/aries/subsystem/itests/AriesSubsystemTest.java
A         subsystem/subsystem-itests/src/test/java/org/apache/aries/subsystem/itests/AutostartTest.java
A         subsystem/subsystem-itests/src/test/java/org/apache/aries/subsystem/itests/Header.java
A         subsystem/subsystem-itests/src/test/java/org/apache/aries/subsystem/itests/ModelledResourceManagerTest.java
A         subsystem/subsystem-itests/src/test/java/org/apache/aries/subsystem/itests/UnmanagedBundleTest.java
A         subsystem/subsystem-itests/src/test/resources
A         subsystem/subsystem-itests/src/test/resources/feature1
A         subsystem/subsystem-itests/src/test/resources/feature1/OSGI-INF
A         subsystem/subsystem-itests/src/test/resources/feature1/OSGI-INF/SUBSYSTEM.MF
A         subsystem/subsystem-itests/src/test/resources/emptySubsystem
A         subsystem/subsystem-itests/src/test/resources/emptySubsystem/OSGI-INF
A         subsystem/subsystem-itests/src/test/resources/emptySubsystem/OSGI-INF/SUBSYSTEM.MF
A         subsystem/subsystem-itests/src/test/resources/feature2
A         subsystem/subsystem-itests/src/test/resources/feature2/OSGI-INF
A         subsystem/subsystem-itests/src/test/resources/feature2/OSGI-INF/SUBSYSTEM.MF
A         subsystem/subsystem-itests/src/test/resources/feature3
A         subsystem/subsystem-itests/src/test/resources/feature3/OSGI-INF
A         subsystem/subsystem-itests/src/test/resources/feature3/OSGI-INF/SUBSYSTEM.MF
A         subsystem/subsystem-itests/src/test/resources/dynamicImport
A         subsystem/subsystem-itests/src/test/resources/dynamicImport/OSGI-INF
A         subsystem/subsystem-itests/src/test/resources/dynamicImport/OSGI-INF/SUBSYSTEM.MF
A         subsystem/subsystem-itests/src/test/resources/META-INF
A         subsystem/subsystem-itests/src/test/resources/META-INF/platform-equinox
A         subsystem/subsystem-itests/src/test/resources/META-INF/platform-equinox/definition-3.8.0.V20110621.xml
A         subsystem/subsystem-itests/src/test/resources/META-INF/platform-equinox/definition-3.8.0.V20120529-1548.xml
A         subsystem/subsystem-itests/src/test/resources/META-INF/platform-equinox/definition-3.7.0.V20110110.xml
A         subsystem/subsystem-itests/src/test/resources/META-INF/platform-equinox/definition-3.7.0.V20110221.xml
A         subsystem/subsystem-itests/src/test/resources/META-INF/platform-equinox/definition-3.8.0-SNAPSHOT.xml
A         subsystem/subsystem-itests/src/test/resources/compositeDir
A         subsystem/subsystem-itests/src/test/resources/compositeDir/OSGI-INF
A         subsystem/subsystem-itests/src/test/resources/compositeDir/OSGI-INF/SUBSYSTEM.MF
A         subsystem/subsystem-itests/src/test/resources/compositeDir/a.jar
A         subsystem/subsystem-itests/src/test/resources/compositeDir/a.jar/META-INF
A         subsystem/subsystem-itests/src/test/resources/compositeDir/a.jar/META-INF/MANIFEST.MF
A         subsystem/subsystem-itests/src/test/resources/compositeDir/a.jar/a
A         subsystem/subsystem-itests/src/test/resources/compositeDir/applicationDir
A         subsystem/subsystem-itests/src/test/resources/compositeDir/applicationDir/featureDir
A         subsystem/subsystem-itests/src/test/resources/compositeDir/applicationDir/featureDir/OSGI-INF
A         subsystem/subsystem-itests/src/test/resources/compositeDir/applicationDir/featureDir/OSGI-INF/SUBSYSTEM.MF
A         subsystem/subsystem-itests/src/test/resources/compositeDir/applicationDir/featureDir/a.jar
A         subsystem/subsystem-itests/src/test/resources/compositeDir/applicationDir/featureDir/a.jar/META-INF
A         subsystem/subsystem-itests/src/test/resources/compositeDir/applicationDir/featureDir/a.jar/META-INF/MANIFEST.MF
A         subsystem/subsystem-itests/src/test/resources/compositeDir/applicationDir/featureDir/a.jar/a
A         subsystem/subsystem-itests/src/test/resources/compositeDir/applicationDir/featureDir/b.jar
A         subsystem/subsystem-itests/src/test/resources/compositeDir/applicationDir/featureDir/b.jar/META-INF
A         subsystem/subsystem-itests/src/test/resources/compositeDir/applicationDir/featureDir/b.jar/META-INF/MANIFEST.MF
A         subsystem/subsystem-itests/src/test/resources/compositeDir/applicationDir/featureDir/b.jar/b
A         subsystem/subsystem-itests/src/test/resources/compositeDir/applicationDir/OSGI-INF
A         subsystem/subsystem-itests/src/test/resources/compositeDir/applicationDir/OSGI-INF/SUBSYSTEM.MF
A         subsystem/subsystem-itests/src/test/resources/compositeDir/applicationDir/b.jar
A         subsystem/subsystem-itests/src/test/resources/compositeDir/applicationDir/b.jar/META-INF
A         subsystem/subsystem-itests/src/test/resources/compositeDir/applicationDir/b.jar/META-INF/MANIFEST.MF
A         subsystem/subsystem-itests/src/test/resources/compositeDir/applicationDir/b.jar/b
A         subsystem/subsystem-itests/src/test/resources/composite1
A         subsystem/subsystem-itests/src/test/resources/composite1/OSGI-INF
A         subsystem/subsystem-itests/src/test/resources/composite1/OSGI-INF/SUBSYSTEM.MF
A         subsystem/subsystem-itests/src/test/resources/hello
A         subsystem/subsystem-itests/src/test/resources/hello/OSGI-INF
A         subsystem/subsystem-itests/src/test/resources/hello/OSGI-INF/SUBSYSTEM.MF
A         subsystem/subsystem-itests/src/test/resources/application1
A         subsystem/subsystem-itests/src/test/resources/application1/OSGI-INF
A         subsystem/subsystem-itests/src/test/resources/application1/OSGI-INF/SUBSYSTEM.MF
A         subsystem/subsystem-itests/src/test/resources/blueprint
A         subsystem/subsystem-itests/src/test/resources/blueprint/OSGI-INF
A         subsystem/subsystem-itests/src/test/resources/blueprint/OSGI-INF/SUBSYSTEM.MF
A         subsystem/subsystem-itests/src/test/resources/emptyFeature
A         subsystem/subsystem-itests/src/test/resources/emptyFeature/OSGI-INF
A         subsystem/subsystem-itests/src/test/resources/emptyFeature/OSGI-INF/SUBSYSTEM.MF
A         subsystem/subsystem-itests/src/test/resources/OSGI-INF
A         subsystem/subsystem-itests/src/test/resources/OSGI-INF/blueprint
A         subsystem/subsystem-itests/src/test/resources/OSGI-INF/blueprint/blueprint.xml
AU        subsystem/subsystem-itests/pom.xml
A         subsystem/pom.xml
A         subsystem/subsystem-executor
A         subsystem/subsystem-executor/src
A         subsystem/subsystem-executor/src/test
A         subsystem/subsystem-executor/src/test/java
A         subsystem/subsystem-executor/src/test/java/org
A         subsystem/subsystem-executor/src/test/java/org/apache
A         subsystem/subsystem-executor/src/test/java/org/apache/aries
A         subsystem/subsystem-executor/src/test/java/org/apache/aries/subsystem
A         subsystem/subsystem-executor/src/test/java/org/apache/aries/subsystem/executor
A         subsystem/subsystem-executor/src/main
A         subsystem/subsystem-executor/src/main/java
A         subsystem/subsystem-executor/src/main/java/org
A         subsystem/subsystem-executor/src/main/java/org/apache
A         subsystem/subsystem-executor/src/main/java/org/apache/aries
A         subsystem/subsystem-executor/src/main/java/org/apache/aries/subsystem
A         subsystem/subsystem-executor/src/main/java/org/apache/aries/subsystem/executor
A         subsystem/subsystem-executor/src/main/java/org/apache/aries/subsystem/executor/SimpleExecutor.java
A         subsystem/subsystem-executor/src/main/java/org/apache/aries/subsystem/executor/Activator.java
A         subsystem/subsystem-executor/pom.xml
 U        .
At revision 1628678
[aries-current-snapshots] $ /home/jenkins/jenkins-slave/tools/hudson.tasks.Maven_MavenInstallation/Maven_3.0.3/bin/mvn
-Dmaven.repo.local=<https://builds.apache.org/job/AriesWithSnapshotDependencies/ws/.repository>
-U -cpu -e -B -f parent/pom.xml clean install
[INFO] Error stacktraces are turned on.
[WARNING] Command line option -cpu is deprecated and will be removed in future Maven versions.
[INFO] Scanning for projects...
[INFO]                                                                         
[INFO] ------------------------------------------------------------------------
[INFO] Building Aries :: Parent POM 2.0.1-SNAPSHOT
[INFO] ------------------------------------------------------------------------
[INFO] 
[INFO] --- maven-clean-plugin:2.5:clean (default-clean) @ parent ---
[INFO] 
[INFO] --- maven-enforcer-plugin:1.3.1:enforce (default) @ parent ---
[INFO] 
[INFO] --- maven-remote-resources-plugin:1.5:process (default) @ parent ---
[INFO] 
[INFO] --- maven-site-plugin:3.3:attach-descriptor (attach-descriptor) @ parent ---
[INFO] 
[INFO] --- org.apache.aries.versioning.plugin:0.3.0:version-check (default-verify) @ parent
---
[INFO] 
[INFO] --- ianal-maven-plugin:1.0-alpha-1:verify-legal-files (default) @ parent ---
[INFO] 
[INFO] --- maven-install-plugin:2.5.1:install (default-install) @ parent ---
[INFO] Installing /x1/jenkins/jenkins-slave/workspace/AriesWithSnapshotDependencies/aries-current-snapshots/parent/pom.xml
to <https://builds.apache.org/job/AriesWithSnapshotDependencies/ws/.repository/org/apache/aries/parent/2.0.1-SNAPSHOT/parent-2.0.1-SNAPSHOT.pom>
[INFO] ------------------------------------------------------------------------
[INFO] BUILD SUCCESS
[INFO] ------------------------------------------------------------------------
[INFO] Total time: 24.434s
[INFO] Finished at: Wed Oct 01 11:52:27 UTC 2014
[INFO] Final Memory: 14M/110M
[INFO] ------------------------------------------------------------------------
[aries-current-snapshots] $ /home/jenkins/jenkins-slave/tools/hudson.tasks.Maven_MavenInstallation/Maven_3.0.3/bin/mvn
-Dmaven.repo.local=<https://builds.apache.org/job/AriesWithSnapshotDependencies/ws/.repository>
-U -cpu -e -B -Dmaven.test.skip=true clean install
[INFO] Error stacktraces are turned on.
[WARNING] Command line option -cpu is deprecated and will be removed in future Maven versions.
[INFO] Scanning for projects...
[ERROR] The build could not read 1 project -> [Help 1]
org.apache.maven.project.ProjectBuildingException: Some problems were encountered while processing
the POMs:
[ERROR] Child module /x1/jenkins/jenkins-slave/workspace/AriesWithSnapshotDependencies/aries-current-snapshots/jpa20/pom.xml
of /x1/jenkins/jenkins-slave/workspace/AriesWithSnapshotDependencies/aries-current-snapshots/pom.xml
does not exist @ 

	at org.apache.maven.project.DefaultProjectBuilder.build(DefaultProjectBuilder.java:339)
	at org.apache.maven.DefaultMaven.collectProjects(DefaultMaven.java:632)
	at org.apache.maven.DefaultMaven.getProjectsForMavenReactor(DefaultMaven.java:581)
	at org.apache.maven.DefaultMaven.doExecute(DefaultMaven.java:233)
	at org.apache.maven.DefaultMaven.execute(DefaultMaven.java:156)
	at org.apache.maven.cli.MavenCli.execute(MavenCli.java:537)
	at org.apache.maven.cli.MavenCli.doMain(MavenCli.java:196)
	at org.apache.maven.cli.MavenCli.main(MavenCli.java:141)
	at sun.reflect.NativeMethodAccessorImpl.invoke0(Native Method)
	at sun.reflect.NativeMethodAccessorImpl.invoke(NativeMethodAccessorImpl.java:57)
	at sun.reflect.DelegatingMethodAccessorImpl.invoke(DelegatingMethodAccessorImpl.java:43)
	at java.lang.reflect.Method.invoke(Method.java:606)
	at org.codehaus.plexus.classworlds.launcher.Launcher.launchEnhanced(Launcher.java:290)
	at org.codehaus.plexus.classworlds.launcher.Launcher.launch(Launcher.java:230)
	at org.codehaus.plexus.classworlds.launcher.Launcher.mainWithExitCode(Launcher.java:409)
	at org.codehaus.plexus.classworlds.launcher.Launcher.main(Launcher.java:352)
[ERROR]   
[ERROR]   The project org.apache.aries:aries:1.0.0-SNAPSHOT (/x1/jenkins/jenkins-slave/workspace/AriesWithSnapshotDependencies/aries-current-snapshots/pom.xml)
has 1 error
[ERROR]     Child module /x1/jenkins/jenkins-slave/workspace/AriesWithSnapshotDependencies/aries-current-snapshots/jpa20/pom.xml
of /x1/jenkins/jenkins-slave/workspace/AriesWithSnapshotDependencies/aries-current-snapshots/pom.xml
does not exist
[ERROR] 
[ERROR] Re-run Maven using the -X switch to enable full debug logging.
[ERROR] 
[ERROR] For more information about the errors and possible solutions, please read the following
articles:
[ERROR] [Help 1] http://cwiki.apache.org/confluence/display/MAVEN/ProjectBuildingException
Build step 'Invoke top-level Maven targets' marked build as failure

Mime
View raw message