aries-dev mailing list archives

Site index · List index
Message view « Date » · « Thread »
Top « Date » · « Thread »
From Apache Jenkins Server <jenk...@builds.apache.org>
Subject Build failed in Jenkins: Aries-Tx-Control-Trunk-JDK8 #22
Date Wed, 20 Apr 2016 23:39:53 GMT
See <https://builds.apache.org/job/Aries-Tx-Control-Trunk-JDK8/22/changes>

Changes:

[timothyjward] [tx-control] Add an itest using the coordinator to speed up database inserts

[timothyjward] [tx-control] Remove the link to the Coordinator service as per the latest RFC
update

[timothyjward] [tx-control] Add support for read-only transactions

------------------------------------------
[...truncated 4886 lines...]
[INFO] Downloaded: https://repo.maven.apache.org/maven2/org/ops4j/base/ops4j-base-store/1.4.0/ops4j-base-store-1.4.0.jar
(8 KB at 39.1 KB/sec)
[INFO] Downloading: https://repo.maven.apache.org/maven2/com/google/code/findbugs/jsr305/1.3.9/jsr305-1.3.9.jar
[INFO] Downloaded: https://repo.maven.apache.org/maven2/org/ops4j/base/ops4j-base-util-property/1.4.0/ops4j-base-util-property-1.4.0.jar
(6 KB at 30.8 KB/sec)
[INFO] Downloading: https://repo.maven.apache.org/maven2/org/ops4j/base/ops4j-base-exec/1.4.0/ops4j-base-exec-1.4.0.jar
[INFO] Downloaded: https://repo.maven.apache.org/maven2/org/ops4j/pax/exam/pax-exam-container-forked/3.4.0/pax-exam-container-forked-3.4.0.jar
(30 KB at 150.2 KB/sec)
[INFO] Downloading: https://repo.maven.apache.org/maven2/org/ops4j/base/ops4j-base-net/1.4.0/ops4j-base-net-1.4.0.jar
[INFO] Downloaded: https://repo.maven.apache.org/maven2/com/google/code/findbugs/jsr305/1.3.9/jsr305-1.3.9.jar
(33 KB at 150.7 KB/sec)
[INFO] Downloading: https://repo.maven.apache.org/maven2/org/ops4j/base/ops4j-base-monitors/1.4.0/ops4j-base-monitors-1.4.0.jar
[INFO] Downloaded: https://repo.maven.apache.org/maven2/org/ops4j/pax/exam/pax-exam-spi/3.4.0/pax-exam-spi-3.4.0.jar
(65 KB at 299.7 KB/sec)
[INFO] Downloading: https://repo.maven.apache.org/maven2/org/ops4j/base/ops4j-base-io/1.4.0/ops4j-base-io-1.4.0.jar
[INFO] Downloaded: https://repo.maven.apache.org/maven2/org/ops4j/base/ops4j-base-exec/1.4.0/ops4j-base-exec-1.4.0.jar
(9 KB at 39.4 KB/sec)
[INFO] Downloading: https://repo.maven.apache.org/maven2/org/ops4j/base/ops4j-base-spi/1.4.0/ops4j-base-spi-1.4.0.jar
[INFO] Downloaded: https://repo.maven.apache.org/maven2/org/ops4j/base/ops4j-base-net/1.4.0/ops4j-base-net-1.4.0.jar
(12 KB at 49.5 KB/sec)
[INFO] Downloading: https://repo.maven.apache.org/maven2/org/ops4j/pax/swissbox/pax-swissbox-framework/1.7.0/pax-swissbox-framework-1.7.0.jar
[INFO] Downloaded: https://repo.maven.apache.org/maven2/org/ops4j/base/ops4j-base-monitors/1.4.0/ops4j-base-monitors-1.4.0.jar
(8 KB at 31.8 KB/sec)
[INFO] Downloading: https://repo.maven.apache.org/maven2/org/ops4j/pax/swissbox/pax-swissbox-tracker/1.7.0/pax-swissbox-tracker-1.7.0.jar
[INFO] Downloaded: https://repo.maven.apache.org/maven2/org/ops4j/base/ops4j-base-io/1.4.0/ops4j-base-io-1.4.0.jar
(20 KB at 78.9 KB/sec)
[INFO] Downloading: https://repo.maven.apache.org/maven2/org/ops4j/pax/swissbox/pax-swissbox-lifecycle/1.7.0/pax-swissbox-lifecycle-1.7.0.jar
[INFO] Downloaded: https://repo.maven.apache.org/maven2/org/ops4j/base/ops4j-base-spi/1.4.0/ops4j-base-spi-1.4.0.jar
(7 KB at 27.9 KB/sec)
[INFO] Downloading: https://repo.maven.apache.org/maven2/org/ops4j/pax/exam/pax-exam-junit4/3.4.0/pax-exam-junit4-3.4.0.jar
[INFO] Downloaded: https://repo.maven.apache.org/maven2/org/ops4j/pax/swissbox/pax-swissbox-framework/1.7.0/pax-swissbox-framework-1.7.0.jar
(14 KB at 50.1 KB/sec)
[INFO] Downloading: https://repo.maven.apache.org/maven2/org/ops4j/pax/exam/pax-exam-link-mvn/3.4.0/pax-exam-link-mvn-3.4.0.jar
[INFO] Downloaded: https://repo.maven.apache.org/maven2/org/ops4j/pax/swissbox/pax-swissbox-lifecycle/1.7.0/pax-swissbox-lifecycle-1.7.0.jar
(7 KB at 22.5 KB/sec)
[INFO] Downloading: https://repo.maven.apache.org/maven2/org/ops4j/pax/url/pax-url-link/1.6.0/pax-url-link-1.6.0.jar
[INFO] Downloaded: https://repo.maven.apache.org/maven2/org/ops4j/pax/swissbox/pax-swissbox-tracker/1.7.0/pax-swissbox-tracker-1.7.0.jar
(15 KB at 52.0 KB/sec)
[INFO] Downloading: https://repo.maven.apache.org/maven2/org/ops4j/pax/url/pax-url-classpath/1.6.0/pax-url-classpath-1.6.0.jar
[INFO] Downloaded: https://repo.maven.apache.org/maven2/org/ops4j/pax/exam/pax-exam-junit4/3.4.0/pax-exam-junit4-3.4.0.jar
(38 KB at 132.3 KB/sec)
[INFO] Downloading: https://repo.maven.apache.org/maven2/org/ops4j/pax/swissbox/pax-swissbox-optional-jcl/1.7.0/pax-swissbox-optional-jcl-1.7.0.jar
[INFO] Downloaded: https://repo.maven.apache.org/maven2/org/ops4j/pax/exam/pax-exam-link-mvn/3.4.0/pax-exam-link-mvn-3.4.0.jar
(12 KB at 37.1 KB/sec)
[INFO] Downloading: https://repo.maven.apache.org/maven2/org/ops4j/pax/url/pax-url-aether/1.6.0/pax-url-aether-1.6.0.jar
[INFO] Downloaded: https://repo.maven.apache.org/maven2/org/ops4j/pax/url/pax-url-classpath/1.6.0/pax-url-classpath-1.6.0.jar
(9 KB at 26.6 KB/sec)
[INFO] Downloading: https://repo.maven.apache.org/maven2/org/ops4j/pax/url/pax-url-commons/1.6.0/pax-url-commons-1.6.0.jar
[INFO] Downloaded: https://repo.maven.apache.org/maven2/org/ops4j/pax/url/pax-url-link/1.6.0/pax-url-link-1.6.0.jar
(8 KB at 22.5 KB/sec)
[INFO] Downloading: https://repo.maven.apache.org/maven2/org/ops4j/pax/swissbox/pax-swissbox-property/1.7.0/pax-swissbox-property-1.7.0.jar
[INFO] Downloaded: https://repo.maven.apache.org/maven2/org/ops4j/pax/swissbox/pax-swissbox-optional-jcl/1.7.0/pax-swissbox-optional-jcl-1.7.0.jar
(7 KB at 20.0 KB/sec)
[INFO] Downloading: https://repo.maven.apache.org/maven2/org/ops4j/pax/url/pax-url-maven-commons/1.6.0/pax-url-maven-commons-1.6.0.jar
[INFO] Downloaded: https://repo.maven.apache.org/maven2/com/google/guava/guava/12.0/guava-12.0.jar
(1754 KB at 5330.8 KB/sec)
[INFO] Downloading: https://repo.maven.apache.org/maven2/org/ops4j/base/ops4j-base-util-xml/1.4.0/ops4j-base-util-xml-1.4.0.jar
[INFO] Downloaded: https://repo.maven.apache.org/maven2/org/ops4j/pax/url/pax-url-commons/1.6.0/pax-url-commons-1.6.0.jar
(9 KB at 25.5 KB/sec)
[INFO] Downloading: https://repo.maven.apache.org/maven2/org/ops4j/base/ops4j-base-util-collections/1.4.0/ops4j-base-util-collections-1.4.0.jar
[INFO] Downloaded: https://repo.maven.apache.org/maven2/org/ops4j/pax/swissbox/pax-swissbox-property/1.7.0/pax-swissbox-property-1.7.0.jar
(4 KB at 10.9 KB/sec)
[INFO] Downloading: https://repo.maven.apache.org/maven2/org/sonatype/aether/aether-api/1.13.1/aether-api-1.13.1.jar
[INFO] Downloaded: https://repo.maven.apache.org/maven2/org/ops4j/pax/url/pax-url-maven-commons/1.6.0/pax-url-maven-commons-1.6.0.jar
(20 KB at 54.2 KB/sec)
[INFO] Downloading: https://repo.maven.apache.org/maven2/org/sonatype/aether/aether-spi/1.13.1/aether-spi-1.13.1.jar
[INFO] Downloaded: https://repo.maven.apache.org/maven2/org/ops4j/base/ops4j-base-util-xml/1.4.0/ops4j-base-util-xml-1.4.0.jar
(9 KB at 24.2 KB/sec)
[INFO] Downloading: https://repo.maven.apache.org/maven2/org/sonatype/aether/aether-util/1.13.1/aether-util-1.13.1.jar
[INFO] Downloaded: https://repo.maven.apache.org/maven2/org/ops4j/base/ops4j-base-util-collections/1.4.0/ops4j-base-util-collections-1.4.0.jar
(8 KB at 20.1 KB/sec)
[INFO] Downloading: https://repo.maven.apache.org/maven2/org/sonatype/aether/aether-impl/1.13.1/aether-impl-1.13.1.jar
[INFO] Downloaded: https://repo.maven.apache.org/maven2/org/sonatype/aether/aether-spi/1.13.1/aether-spi-1.13.1.jar
(16 KB at 37.8 KB/sec)
[INFO] Downloading: https://repo.maven.apache.org/maven2/org/sonatype/aether/aether-connector-wagon/1.13.1/aether-connector-wagon-1.13.1.jar
[INFO] Downloaded: https://repo.maven.apache.org/maven2/org/sonatype/aether/aether-api/1.13.1/aether-api-1.13.1.jar
(88 KB at 216.2 KB/sec)
[INFO] Downloading: https://repo.maven.apache.org/maven2/org/codehaus/plexus/plexus-classworlds/2.4/plexus-classworlds-2.4.jar
[INFO] Downloaded: https://repo.maven.apache.org/maven2/org/sonatype/aether/aether-util/1.13.1/aether-util-1.13.1.jar
(127 KB at 308.9 KB/sec)
[INFO] Downloading: https://repo.maven.apache.org/maven2/org/sonatype/sisu/sisu-inject-plexus/2.2.3/sisu-inject-plexus-2.2.3.jar
[INFO] Downloaded: https://repo.maven.apache.org/maven2/org/codehaus/plexus/plexus-classworlds/2.4/plexus-classworlds-2.4.jar
(46 KB at 99.0 KB/sec)
[INFO] Downloading: https://repo.maven.apache.org/maven2/org/sonatype/sisu/sisu-inject-bean/2.2.3/sisu-inject-bean-2.2.3.jar
[INFO] Downloaded: https://repo.maven.apache.org/maven2/org/sonatype/aether/aether-impl/1.13.1/aether-impl-1.13.1.jar
(128 KB at 272.2 KB/sec)
[INFO] Downloading: https://repo.maven.apache.org/maven2/org/sonatype/sisu/sisu-guice/3.0.3/sisu-guice-3.0.3-no_aop.jar
[INFO] Downloaded: https://repo.maven.apache.org/maven2/org/sonatype/sisu/sisu-inject-plexus/2.2.3/sisu-inject-plexus-2.2.3.jar
(199 KB at 414.9 KB/sec)
[INFO] Downloading: https://repo.maven.apache.org/maven2/org/apache/maven/maven-aether-provider/3.0.4/maven-aether-provider-3.0.4.jar
[INFO] Downloaded: https://repo.maven.apache.org/maven2/org/apache/maven/maven-aether-provider/3.0.4/maven-aether-provider-3.0.4.jar
(56 KB at 104.9 KB/sec)
[INFO] Downloading: https://repo.maven.apache.org/maven2/org/apache/maven/maven-model/3.0.4/maven-model-3.0.4.jar
[INFO] Downloaded: https://repo.maven.apache.org/maven2/org/sonatype/sisu/sisu-inject-bean/2.2.3/sisu-inject-bean-2.2.3.jar
(256 KB at 483.4 KB/sec)
[INFO] Downloading: https://repo.maven.apache.org/maven2/org/apache/maven/maven-model-builder/3.0.4/maven-model-builder-3.0.4.jar
[INFO] Downloaded: https://repo.maven.apache.org/maven2/org/sonatype/sisu/sisu-guice/3.0.3/sisu-guice-3.0.3-no_aop.jar
(479 KB at 880.3 KB/sec)
[INFO] Downloading: https://repo.maven.apache.org/maven2/org/apache/maven/maven-repository-metadata/3.0.4/maven-repository-metadata-3.0.4.jar
[INFO] Downloaded: https://repo.maven.apache.org/maven2/org/ops4j/pax/url/pax-url-aether/1.6.0/pax-url-aether-1.6.0.jar
(3863 KB at 6835.8 KB/sec)
[INFO] Downloading: https://repo.maven.apache.org/maven2/org/apache/maven/wagon/wagon-provider-api/1.0/wagon-provider-api-1.0.jar
[INFO] Downloaded: https://repo.maven.apache.org/maven2/org/apache/maven/maven-model-builder/3.0.4/maven-model-builder-3.0.4.jar
(148 KB at 258.0 KB/sec)
[INFO] Downloading: https://repo.maven.apache.org/maven2/org/apache/maven/wagon/wagon-file/1.0/wagon-file-1.0.jar
[INFO] Downloaded: https://repo.maven.apache.org/maven2/org/apache/maven/maven-model/3.0.4/maven-model-3.0.4.jar
(160 KB at 277.3 KB/sec)
[INFO] Downloading: https://repo.maven.apache.org/maven2/org/apache/maven/wagon/wagon-http-lightweight/1.0/wagon-http-lightweight-1.0.jar
[INFO] Downloaded: https://repo.maven.apache.org/maven2/org/apache/maven/maven-repository-metadata/3.0.4/maven-repository-metadata-3.0.4.jar
(30 KB at 50.3 KB/sec)
[INFO] Downloading: https://repo.maven.apache.org/maven2/org/apache/maven/wagon/wagon-http-shared/1.0/wagon-http-shared-1.0.jar
[INFO] Downloaded: https://repo.maven.apache.org/maven2/org/apache/maven/wagon/wagon-file/1.0/wagon-file-1.0.jar
(11 KB at 17.9 KB/sec)
[INFO] Downloading: https://repo.maven.apache.org/maven2/commons-io/commons-io/2.0.1/commons-io-2.0.1.jar
[INFO] Downloaded: https://repo.maven.apache.org/maven2/org/apache/maven/wagon/wagon-provider-api/1.0/wagon-provider-api-1.0.jar
(52 KB at 85.6 KB/sec)
[INFO] Downloading: https://repo.maven.apache.org/maven2/org/jsoup/jsoup/1.6.1/jsoup-1.6.1.jar
[INFO] Downloaded: https://repo.maven.apache.org/maven2/org/apache/maven/wagon/wagon-http-lightweight/1.0/wagon-http-lightweight-1.0.jar
(15 KB at 23.7 KB/sec)
[INFO] Downloading: https://repo.maven.apache.org/maven2/org/codehaus/plexus/plexus-container-default/1.5.5/plexus-container-default-1.5.5.jar
[INFO] Downloaded: https://repo.maven.apache.org/maven2/org/apache/maven/wagon/wagon-http-shared/1.0/wagon-http-shared-1.0.jar
(25 KB at 38.6 KB/sec)
[INFO] Downloading: https://repo.maven.apache.org/maven2/commons-httpclient/commons-httpclient/3.1/commons-httpclient-3.1.jar
[INFO] Downloaded: https://repo.maven.apache.org/maven2/commons-io/commons-io/2.0.1/commons-io-2.0.1.jar
(156 KB at 241.1 KB/sec)
[INFO] Downloading: https://repo.maven.apache.org/maven2/commons-codec/commons-codec/1.2/commons-codec-1.2.jar
[INFO] Downloaded: https://repo.maven.apache.org/maven2/org/jsoup/jsoup/1.6.1/jsoup-1.6.1.jar
(275 KB at 417.3 KB/sec)
[INFO] Downloading: https://repo.maven.apache.org/maven2/ch/qos/logback/logback-core/0.9.29/logback-core-0.9.29.jar
[INFO] Downloaded: https://repo.maven.apache.org/maven2/org/sonatype/aether/aether-connector-wagon/1.13.1/aether-connector-wagon-1.13.1.jar
(30 KB at 44.0 KB/sec)
[INFO] Downloading: https://repo.maven.apache.org/maven2/ch/qos/logback/logback-classic/0.9.29/logback-classic-0.9.29.jar
[INFO] Downloaded: https://repo.maven.apache.org/maven2/org/codehaus/plexus/plexus-container-default/1.5.5/plexus-container-default-1.5.5.jar
(212 KB at 319.6 KB/sec)
[INFO] Downloading: https://repo.maven.apache.org/maven2/org/ops4j/pax/tinybundles/tinybundles/2.0.0/tinybundles-2.0.0.jar
[INFO] Downloaded: https://repo.maven.apache.org/maven2/commons-httpclient/commons-httpclient/3.1/commons-httpclient-3.1.jar
(298 KB at 441.3 KB/sec)
[INFO] Downloading: https://repo.maven.apache.org/maven2/biz/aQute/bnd/bndlib/2.1.0/bndlib-2.1.0.jar
[INFO] Downloaded: https://repo.maven.apache.org/maven2/commons-codec/commons-codec/1.2/commons-codec-1.2.jar
(30 KB at 43.3 KB/sec)
[INFO] Downloading: https://repo.maven.apache.org/maven2/javax/inject/javax.inject/1/javax.inject-1.jar
[INFO] Downloaded: https://repo.maven.apache.org/maven2/org/ops4j/pax/tinybundles/tinybundles/2.0.0/tinybundles-2.0.0.jar
(29 KB at 41.5 KB/sec)
[INFO] Downloading: https://repo.maven.apache.org/maven2/org/ops4j/pax/logging/pax-logging-api/1.7.2/pax-logging-api-1.7.2.jar
[INFO] Downloaded: https://repo.maven.apache.org/maven2/ch/qos/logback/logback-classic/0.9.29/logback-classic-0.9.29.jar
(239 KB at 337.6 KB/sec)
[INFO] Downloading: https://repo.maven.apache.org/maven2/org/ops4j/pax/logging/pax-logging-service/1.7.2/pax-logging-service-1.7.2.jar
[INFO] Downloaded: https://repo.maven.apache.org/maven2/javax/inject/javax.inject/1/javax.inject-1.jar
(3 KB at 3.4 KB/sec)
[INFO] Downloaded: https://repo.maven.apache.org/maven2/ch/qos/logback/logback-core/0.9.29/logback-core-0.9.29.jar
(308 KB at 430.6 KB/sec)
[INFO] Downloaded: https://repo.maven.apache.org/maven2/org/ops4j/pax/logging/pax-logging-api/1.7.2/pax-logging-api-1.7.2.jar
(94 KB at 127.0 KB/sec)
[INFO] Downloaded: https://repo.maven.apache.org/maven2/org/ops4j/pax/logging/pax-logging-service/1.7.2/pax-logging-service-1.7.2.jar
(554 KB at 724.9 KB/sec)
[INFO] Downloaded: https://repo.maven.apache.org/maven2/biz/aQute/bnd/bndlib/2.1.0/bndlib-2.1.0.jar
(1356 KB at 1756.4 KB/sec)
[INFO] Downloading: http://repository.apache.org/snapshots/org/apache/aries/testsupport/org.apache.aries.testsupport.unit/2.0.0-SNAPSHOT/org.apache.aries.testsupport.unit-2.0.0-20160419.031557-250.jar
[INFO] Downloaded: http://repository.apache.org/snapshots/org/apache/aries/testsupport/org.apache.aries.testsupport.unit/2.0.0-SNAPSHOT/org.apache.aries.testsupport.unit-2.0.0-20160419.031557-250.jar
(86 KB at 121.6 KB/sec)
[INFO] 
[INFO] --- maven-clean-plugin:2.5:clean (default-clean) @ org.apache.aries.tx-control-itests
---
[INFO] 
[INFO] --- maven-enforcer-plugin:1.3.1:enforce (default) @ org.apache.aries.tx-control-itests
---
[INFO] 
[INFO] --- maven-remote-resources-plugin:1.5:process (default) @ org.apache.aries.tx-control-itests
---
[INFO] 
[INFO] --- depends-maven-plugin:1.2:generate-depends-file (generate-depends-file) @ org.apache.aries.tx-control-itests
---
[INFO] Created: <https://builds.apache.org/job/Aries-Tx-Control-Trunk-JDK8/ws/tx-control-itests/target/classes/META-INF/maven/dependencies.properties>
[INFO] 
[INFO] --- maven-resources-plugin:2.6:resources (default-resources) @ org.apache.aries.tx-control-itests
---
[INFO] Using 'UTF-8' encoding to copy filtered resources.
[INFO] skip non existing resourceDirectory <https://builds.apache.org/job/Aries-Tx-Control-Trunk-JDK8/ws/tx-control-itests/src/main/resources>
[INFO] skip non existing resourceDirectory <https://builds.apache.org/job/Aries-Tx-Control-Trunk-JDK8/ws/tx-control-itests/src/main/filtered-resources>
[INFO] skip non existing resourceDirectory <https://builds.apache.org/job/Aries-Tx-Control-Trunk-JDK8/ws/tx-control-itests/src/main/java>
[INFO] Copying 3 resources
[INFO] 
[INFO] --- maven-compiler-plugin:3.1:compile (default-compile) @ org.apache.aries.tx-control-itests
---
[INFO] No sources to compile
[INFO] 
[INFO] --- maven-resources-plugin:2.6:testResources (default-testResources) @ org.apache.aries.tx-control-itests
---
[INFO] Using 'UTF-8' encoding to copy filtered resources.
[INFO] skip non existing resourceDirectory <https://builds.apache.org/job/Aries-Tx-Control-Trunk-JDK8/ws/tx-control-itests/src/test/resources>
[INFO] skip non existing resourceDirectory <https://builds.apache.org/job/Aries-Tx-Control-Trunk-JDK8/ws/tx-control-itests/src/test/filtered-resources>
[INFO] Copying 3 resources
[INFO] 
[INFO] --- maven-compiler-plugin:3.1:testCompile (default-testCompile) @ org.apache.aries.tx-control-itests
---
[INFO] Changes detected - recompiling the module!
[INFO] Compiling 6 source files to <https://builds.apache.org/job/Aries-Tx-Control-Trunk-JDK8/ws/tx-control-itests/target/test-classes>
[WARNING] Supported source version 'RELEASE_6' from annotation processor 'org.sonatype.guice.bean.scanners.index.SisuIndexAPT6'
less than -source '1.8'
[INFO] 
[INFO] --- maven-surefire-plugin:2.16:test (default-test) @ org.apache.aries.tx-control-itests
---
[WARNING] The parameter forkMode is deprecated since version 2.14. Use forkCount and reuseForks
instead.
[INFO] Surefire report directory: <https://builds.apache.org/job/Aries-Tx-Control-Trunk-JDK8/ws/tx-control-itests/target/surefire-reports>

-------------------------------------------------------
 T E S T S
-------------------------------------------------------

-------------------------------------------------------
 T E S T S
-------------------------------------------------------
Running org.apache.aries.tx.control.itests.SimpleTransactionTest
Tests run: 56, Failures: 0, Errors: 0, Skipped: 0, Time elapsed: 22.381 sec - in org.apache.aries.tx.control.itests.SimpleTransactionTest
Running org.apache.aries.tx.control.itests.SpringJdbcTemplateTransactionTest
Tests run: 16, Failures: 0, Errors: 0, Skipped: 0, Time elapsed: 18.306 sec - in org.apache.aries.tx.control.itests.SpringJdbcTemplateTransactionTest
Running org.apache.aries.tx.control.itests.ExceptionManagementTransactionTest
Tests run: 32, Failures: 0, Errors: 0, Skipped: 0, Time elapsed: 20.525 sec - in org.apache.aries.tx.control.itests.ExceptionManagementTransactionTest
Running org.apache.aries.tx.control.itests.CoordinatorOptimisationTest
Tests run: 8, Failures: 0, Errors: 1, Skipped: 0, Time elapsed: 60.916 sec <<< FAILURE!
- in org.apache.aries.tx.control.itests.CoordinatorOptimisationTest
compareWithAndWithoutCoord:org.apache.aries.tx.control.itests.CoordinatorOptimisationTest.compareWithAndWithoutCoord:Forked:FrameworkFactory[7](org.apache.aries.tx.control.itests.CoordinatorOptimisationTest)
 Time elapsed: 8.471 sec  <<< ERROR!
java.lang.NullPointerException: null
	at org.apache.aries.tx.control.itests.CoordinatorOptimisationTest.compareWithAndWithoutCoord(CoordinatorOptimisationTest.java:84)

Running org.apache.aries.tx.control.itests.XATransactionTest
Tests run: 2, Failures: 0, Errors: 0, Skipped: 0, Time elapsed: 2.941 sec - in org.apache.aries.tx.control.itests.XATransactionTest

Results :

Tests in error: 
  CoordinatorOptimisationTest.compareWithAndWithoutCoord:84 NullPointer

Tests run: 114, Failures: 0, Errors: 1, Skipped: 0

[INFO] ------------------------------------------------------------------------
[INFO] Reactor Summary:
[INFO] 
[INFO] OSGi Transaction Control API ....................... SUCCESS [ 20.278 s]
[INFO] OSGi Transaction Control Service - Common Code ..... SUCCESS [  2.334 s]
[INFO] OSGi Transaction Control Service - Local Transactions SUCCESS [  1.776 s]
[INFO] OSGi Transaction Control Service - XA Transactions . SUCCESS [  2.909 s]
[INFO] OSGi Transaction Control JDBC Resource Provider - Common Code SUCCESS [  1.391 s]
[INFO] OSGi Transaction Control JDBC Resource Provider - Local Transactions SUCCESS [  1.462
s]
[INFO] OSGi Transaction Control JDBC Resource Provider - XA Transactions SUCCESS [  1.563
s]
[INFO] OSGi Transaction Control JPA Resource Provider - Local Transactions SUCCESS [  5.252
s]
[INFO] OSGi Transaction Control JPA Resource Provider - XA Transactions SUCCESS [ 10.367 s]
[INFO] Apache Aries Transaction Control iTests ............ FAILURE [02:28 min]
[INFO] Apache Aries Transaction Control JPA iTests ........ SKIPPED
[INFO] tx-control ......................................... SKIPPED
[INFO] ------------------------------------------------------------------------
[INFO] BUILD FAILURE
[INFO] ------------------------------------------------------------------------
[INFO] Total time: 03:26 min
[INFO] Finished at: 2016-04-20T23:39:49+00:00
[INFO] Final Memory: 78M/855M
[INFO] ------------------------------------------------------------------------
[ERROR] Failed to execute goal org.apache.maven.plugins:maven-surefire-plugin:2.16:test (default-test)
on project org.apache.aries.tx-control-itests: There are test failures.
[ERROR] 
[ERROR] Please refer to <https://builds.apache.org/job/Aries-Tx-Control-Trunk-JDK8/ws/tx-control-itests/target/surefire-reports>
for the individual test results.
[ERROR] -> [Help 1]
org.apache.maven.lifecycle.LifecycleExecutionException: Failed to execute goal org.apache.maven.plugins:maven-surefire-plugin:2.16:test
(default-test) on project org.apache.aries.tx-control-itests: There are test failures.

Please refer to <https://builds.apache.org/job/Aries-Tx-Control-Trunk-JDK8/ws/tx-control-itests/target/surefire-reports>
for the individual test results.
	at org.apache.maven.lifecycle.internal.MojoExecutor.execute(MojoExecutor.java:212)
	at org.apache.maven.lifecycle.internal.MojoExecutor.execute(MojoExecutor.java:153)
	at org.apache.maven.lifecycle.internal.MojoExecutor.execute(MojoExecutor.java:145)
	at org.apache.maven.lifecycle.internal.LifecycleModuleBuilder.buildProject(LifecycleModuleBuilder.java:116)
	at org.apache.maven.lifecycle.internal.LifecycleModuleBuilder.buildProject(LifecycleModuleBuilder.java:80)
	at org.apache.maven.lifecycle.internal.builder.singlethreaded.SingleThreadedBuilder.build(SingleThreadedBuilder.java:51)
	at org.apache.maven.lifecycle.internal.LifecycleStarter.execute(LifecycleStarter.java:120)
	at org.apache.maven.DefaultMaven.doExecute(DefaultMaven.java:355)
	at org.apache.maven.DefaultMaven.execute(DefaultMaven.java:155)
	at org.jvnet.hudson.maven3.launcher.Maven32Launcher.main(Maven32Launcher.java:132)
	at sun.reflect.NativeMethodAccessorImpl.invoke0(Native Method)
	at sun.reflect.NativeMethodAccessorImpl.invoke(NativeMethodAccessorImpl.java:62)
	at sun.reflect.DelegatingMethodAccessorImpl.invoke(DelegatingMethodAccessorImpl.java:43)
	at java.lang.reflect.Method.invoke(Method.java:498)
	at org.codehaus.plexus.classworlds.launcher.Launcher.launchStandard(Launcher.java:330)
	at org.codehaus.plexus.classworlds.launcher.Launcher.launch(Launcher.java:238)
	at jenkins.maven3.agent.Maven32Main.launch(Maven32Main.java:186)
	at sun.reflect.NativeMethodAccessorImpl.invoke0(Native Method)
	at sun.reflect.NativeMethodAccessorImpl.invoke(NativeMethodAccessorImpl.java:62)
	at sun.reflect.DelegatingMethodAccessorImpl.invoke(DelegatingMethodAccessorImpl.java:43)
	at java.lang.reflect.Method.invoke(Method.java:498)
	at hudson.maven.Maven3Builder.call(Maven3Builder.java:136)
	at hudson.maven.Maven3Builder.call(Maven3Builder.java:71)
	at hudson.remoting.UserRequest.perform(UserRequest.java:120)
	at hudson.remoting.UserRequest.perform(UserRequest.java:48)
	at hudson.remoting.Request$2.run(Request.java:326)
	at hudson.remoting.InterceptingExecutorService$1.call(InterceptingExecutorService.java:68)
	at java.util.concurrent.FutureTask.run(FutureTask.java:266)
	at java.util.concurrent.ThreadPoolExecutor.runWorker(ThreadPoolExecutor.java:1142)
	at java.util.concurrent.ThreadPoolExecutor$Worker.run(ThreadPoolExecutor.java:617)
	at java.lang.Thread.run(Thread.java:745)
Caused by: org.apache.maven.plugin.MojoFailureException: There are test failures.

Please refer to <https://builds.apache.org/job/Aries-Tx-Control-Trunk-JDK8/ws/tx-control-itests/target/surefire-reports>
for the individual test results.
	at org.apache.maven.plugin.surefire.SurefireHelper.reportExecution(SurefireHelper.java:82)
	at org.apache.maven.plugin.surefire.SurefirePlugin.handleSummary(SurefirePlugin.java:190)
	at org.apache.maven.plugin.surefire.AbstractSurefireMojo.executeAfterPreconditionsChecked(AbstractSurefireMojo.java:852)
	at org.apache.maven.plugin.surefire.AbstractSurefireMojo.execute(AbstractSurefireMojo.java:720)
	at org.apache.maven.plugin.DefaultBuildPluginManager.executeMojo(DefaultBuildPluginManager.java:132)
	at org.apache.maven.lifecycle.internal.MojoExecutor.execute(MojoExecutor.java:208)
	... 30 more
[ERROR] 
[ERROR] Re-run Maven using the -X switch to enable full debug logging.
[ERROR] 
[ERROR] For more information about the errors and possible solutions, please read the following
articles:
[ERROR] [Help 1] http://cwiki.apache.org/confluence/display/MAVEN/MojoFailureException
[ERROR] 
[ERROR] After correcting the problems, you can resume the build with the command
[ERROR]   mvn <goals> -rf :org.apache.aries.tx-control-itests
[JENKINS] Archiving <https://builds.apache.org/job/Aries-Tx-Control-Trunk-JDK8/ws/pom.xml>
to org.apache.aries.tx-control/tx-control/0.0.1-SNAPSHOT/tx-control-0.0.1-SNAPSHOT.pom
channel stopped

Mime
View raw message