aries-dev mailing list archives

Site index · List index
Message view « Date » · « Thread »
Top « Date » · « Thread »
From Apache Jenkins Server <jenk...@builds.apache.org>
Subject Build failed in Jenkins: Aries-Tx-Control-Trunk-JDK8 #21
Date Thu, 14 Apr 2016 16:30:10 GMT
See <https://builds.apache.org/job/Aries-Tx-Control-Trunk-JDK8/21/changes>

Changes:

[timothyjward] [tx-control] Ensure that EclipseLink usee the non-jta-datasource for sequence
generation

------------------------------------------
[...truncated 2068 lines...]
	at org.apache.maven.surefire.booter.ForkedBooter.invokeProviderInSameClassLoader(ForkedBooter.java:200)
	at org.apache.maven.surefire.booter.ForkedBooter.runSuitesInProcess(ForkedBooter.java:153)
	at org.apache.maven.surefire.booter.ForkedBooter.main(ForkedBooter.java:103)

testNestedTxInnerRollback:org.apache.aries.tx.control.itests.SimpleEclipseLink_2_6_0_Test.testNestedTxInnerRollback:Forked:FrameworkFactory[1](org.apache.aries.tx.control.itests.SimpleEclipseLink_2_6_0_Test)
 Time elapsed: 0.302 sec  <<< ERROR!
java.lang.ClassNotFoundException: org.eclipse.persistence.exceptions.EntityManagerSetupException
(no security manager: RMI class loader disabled)
	at sun.rmi.server.LoaderHandler.loadClass(LoaderHandler.java:396)
	at sun.rmi.server.LoaderHandler.loadClass(LoaderHandler.java:186)
	at java.rmi.server.RMIClassLoader$2.loadClass(RMIClassLoader.java:637)
	at java.rmi.server.RMIClassLoader.loadClass(RMIClassLoader.java:264)
	at sun.rmi.server.MarshalInputStream.resolveClass(MarshalInputStream.java:214)
	at java.io.ObjectInputStream.readNonProxyDesc(ObjectInputStream.java:1613)
	at java.io.ObjectInputStream.readClassDesc(ObjectInputStream.java:1518)
	at java.io.ObjectInputStream.readOrdinaryObject(ObjectInputStream.java:1774)
	at java.io.ObjectInputStream.readObject0(ObjectInputStream.java:1351)
	at java.io.ObjectInputStream.defaultReadFields(ObjectInputStream.java:2000)
	at java.io.ObjectInputStream.defaultReadObject(ObjectInputStream.java:501)
	at java.lang.Throwable.readObject(Throwable.java:914)
	at sun.reflect.GeneratedMethodAccessor4.invoke(Unknown Source)
	at sun.reflect.DelegatingMethodAccessorImpl.invoke(DelegatingMethodAccessorImpl.java:43)
	at java.lang.reflect.Method.invoke(Method.java:498)
	at java.io.ObjectStreamClass.invokeReadObject(ObjectStreamClass.java:1058)
	at java.io.ObjectInputStream.readSerialData(ObjectInputStream.java:1900)
	at java.io.ObjectInputStream.readOrdinaryObject(ObjectInputStream.java:1801)
	at java.io.ObjectInputStream.readObject0(ObjectInputStream.java:1351)
	at java.io.ObjectInputStream.defaultReadFields(ObjectInputStream.java:2000)
	at java.io.ObjectInputStream.defaultReadObject(ObjectInputStream.java:501)
	at java.lang.Throwable.readObject(Throwable.java:914)
	at sun.reflect.GeneratedMethodAccessor4.invoke(Unknown Source)
	at sun.reflect.DelegatingMethodAccessorImpl.invoke(DelegatingMethodAccessorImpl.java:43)
	at java.lang.reflect.Method.invoke(Method.java:498)
	at java.io.ObjectStreamClass.invokeReadObject(ObjectStreamClass.java:1058)
	at java.io.ObjectInputStream.readSerialData(ObjectInputStream.java:1900)
	at java.io.ObjectInputStream.readOrdinaryObject(ObjectInputStream.java:1801)
	at java.io.ObjectInputStream.readObject0(ObjectInputStream.java:1351)
	at java.io.ObjectInputStream.defaultReadFields(ObjectInputStream.java:2000)
	at java.io.ObjectInputStream.defaultReadObject(ObjectInputStream.java:501)
	at java.lang.Throwable.readObject(Throwable.java:914)
	at sun.reflect.GeneratedMethodAccessor4.invoke(Unknown Source)
	at sun.reflect.DelegatingMethodAccessorImpl.invoke(DelegatingMethodAccessorImpl.java:43)
	at java.lang.reflect.Method.invoke(Method.java:498)
	at java.io.ObjectStreamClass.invokeReadObject(ObjectStreamClass.java:1058)
	at java.io.ObjectInputStream.readSerialData(ObjectInputStream.java:1900)
	at java.io.ObjectInputStream.readOrdinaryObject(ObjectInputStream.java:1801)
	at java.io.ObjectInputStream.readObject0(ObjectInputStream.java:1351)
	at java.io.ObjectInputStream.defaultReadFields(ObjectInputStream.java:2000)
	at java.io.ObjectInputStream.readSerialData(ObjectInputStream.java:1924)
	at java.io.ObjectInputStream.readOrdinaryObject(ObjectInputStream.java:1801)
	at java.io.ObjectInputStream.readObject0(ObjectInputStream.java:1351)
	at java.io.ObjectInputStream.readObject(ObjectInputStream.java:371)
	at sun.rmi.transport.StreamRemoteCall.executeCall(StreamRemoteCall.java:245)
	at sun.rmi.server.UnicastRef.invoke(UnicastRef.java:162)
	at java.rmi.server.RemoteObjectInvocationHandler.invokeRemoteMethod(RemoteObjectInvocationHandler.java:227)
	at java.rmi.server.RemoteObjectInvocationHandler.invoke(RemoteObjectInvocationHandler.java:179)
	at com.sun.proxy.$Proxy10.invokeMethodOnService(Unknown Source)
	at org.ops4j.pax.exam.forked.ForkedTestContainer.call(ForkedTestContainer.java:103)
	at org.ops4j.pax.exam.spi.reactors.EagerSingleStagedReactor.invoke(EagerSingleStagedReactor.java:109)
	at org.ops4j.pax.exam.junit.impl.ProbeRunner$2.evaluate(ProbeRunner.java:267)
	at org.junit.runners.BlockJUnit4ClassRunner.runChild(BlockJUnit4ClassRunner.java:76)
	at org.junit.runners.BlockJUnit4ClassRunner.runChild(BlockJUnit4ClassRunner.java:50)
	at org.junit.runners.ParentRunner$3.run(ParentRunner.java:193)
	at org.junit.runners.ParentRunner$1.schedule(ParentRunner.java:52)
	at org.junit.runners.ParentRunner.runChildren(ParentRunner.java:191)
	at org.junit.runners.ParentRunner.access$000(ParentRunner.java:42)
	at org.junit.runners.ParentRunner$2.evaluate(ParentRunner.java:184)
	at org.junit.runners.ParentRunner.run(ParentRunner.java:236)
	at org.ops4j.pax.exam.junit.impl.ProbeRunner.run(ProbeRunner.java:98)
	at org.ops4j.pax.exam.junit.PaxExam.run(PaxExam.java:93)
	at org.apache.maven.surefire.junit4.JUnit4Provider.execute(JUnit4Provider.java:264)
	at org.apache.maven.surefire.junit4.JUnit4Provider.executeTestSet(JUnit4Provider.java:153)
	at org.apache.maven.surefire.junit4.JUnit4Provider.invoke(JUnit4Provider.java:124)
	at org.apache.maven.surefire.booter.ForkedBooter.invokeProviderInSameClassLoader(ForkedBooter.java:200)
	at org.apache.maven.surefire.booter.ForkedBooter.runSuitesInProcess(ForkedBooter.java:153)
	at org.apache.maven.surefire.booter.ForkedBooter.main(ForkedBooter.java:103)

testRequiredInheritsTx:org.apache.aries.tx.control.itests.SimpleEclipseLink_2_6_0_Test.testRequiredInheritsTx:Forked:FrameworkFactory[1](org.apache.aries.tx.control.itests.SimpleEclipseLink_2_6_0_Test)
 Time elapsed: 0.356 sec  <<< ERROR!
java.lang.ClassNotFoundException: org.eclipse.persistence.exceptions.EntityManagerSetupException
(no security manager: RMI class loader disabled)
	at sun.rmi.server.LoaderHandler.loadClass(LoaderHandler.java:396)
	at sun.rmi.server.LoaderHandler.loadClass(LoaderHandler.java:186)
	at java.rmi.server.RMIClassLoader$2.loadClass(RMIClassLoader.java:637)
	at java.rmi.server.RMIClassLoader.loadClass(RMIClassLoader.java:264)
	at sun.rmi.server.MarshalInputStream.resolveClass(MarshalInputStream.java:214)
	at java.io.ObjectInputStream.readNonProxyDesc(ObjectInputStream.java:1613)
	at java.io.ObjectInputStream.readClassDesc(ObjectInputStream.java:1518)
	at java.io.ObjectInputStream.readOrdinaryObject(ObjectInputStream.java:1774)
	at java.io.ObjectInputStream.readObject0(ObjectInputStream.java:1351)
	at java.io.ObjectInputStream.defaultReadFields(ObjectInputStream.java:2000)
	at java.io.ObjectInputStream.defaultReadObject(ObjectInputStream.java:501)
	at java.lang.Throwable.readObject(Throwable.java:914)
	at sun.reflect.GeneratedMethodAccessor4.invoke(Unknown Source)
	at sun.reflect.DelegatingMethodAccessorImpl.invoke(DelegatingMethodAccessorImpl.java:43)
	at java.lang.reflect.Method.invoke(Method.java:498)
	at java.io.ObjectStreamClass.invokeReadObject(ObjectStreamClass.java:1058)
	at java.io.ObjectInputStream.readSerialData(ObjectInputStream.java:1900)
	at java.io.ObjectInputStream.readOrdinaryObject(ObjectInputStream.java:1801)
	at java.io.ObjectInputStream.readObject0(ObjectInputStream.java:1351)
	at java.io.ObjectInputStream.defaultReadFields(ObjectInputStream.java:2000)
	at java.io.ObjectInputStream.defaultReadObject(ObjectInputStream.java:501)
	at java.lang.Throwable.readObject(Throwable.java:914)
	at sun.reflect.GeneratedMethodAccessor4.invoke(Unknown Source)
	at sun.reflect.DelegatingMethodAccessorImpl.invoke(DelegatingMethodAccessorImpl.java:43)
	at java.lang.reflect.Method.invoke(Method.java:498)
	at java.io.ObjectStreamClass.invokeReadObject(ObjectStreamClass.java:1058)
	at java.io.ObjectInputStream.readSerialData(ObjectInputStream.java:1900)
	at java.io.ObjectInputStream.readOrdinaryObject(ObjectInputStream.java:1801)
	at java.io.ObjectInputStream.readObject0(ObjectInputStream.java:1351)
	at java.io.ObjectInputStream.defaultReadFields(ObjectInputStream.java:2000)
	at java.io.ObjectInputStream.defaultReadObject(ObjectInputStream.java:501)
	at java.lang.Throwable.readObject(Throwable.java:914)
	at sun.reflect.GeneratedMethodAccessor4.invoke(Unknown Source)
	at sun.reflect.DelegatingMethodAccessorImpl.invoke(DelegatingMethodAccessorImpl.java:43)
	at java.lang.reflect.Method.invoke(Method.java:498)
	at java.io.ObjectStreamClass.invokeReadObject(ObjectStreamClass.java:1058)
	at java.io.ObjectInputStream.readSerialData(ObjectInputStream.java:1900)
	at java.io.ObjectInputStream.readOrdinaryObject(ObjectInputStream.java:1801)
	at java.io.ObjectInputStream.readObject0(ObjectInputStream.java:1351)
	at java.io.ObjectInputStream.defaultReadFields(ObjectInputStream.java:2000)
	at java.io.ObjectInputStream.readSerialData(ObjectInputStream.java:1924)
	at java.io.ObjectInputStream.readOrdinaryObject(ObjectInputStream.java:1801)
	at java.io.ObjectInputStream.readObject0(ObjectInputStream.java:1351)
	at java.io.ObjectInputStream.readObject(ObjectInputStream.java:371)
	at sun.rmi.transport.StreamRemoteCall.executeCall(StreamRemoteCall.java:245)
	at sun.rmi.server.UnicastRef.invoke(UnicastRef.java:162)
	at java.rmi.server.RemoteObjectInvocationHandler.invokeRemoteMethod(RemoteObjectInvocationHandler.java:227)
	at java.rmi.server.RemoteObjectInvocationHandler.invoke(RemoteObjectInvocationHandler.java:179)
	at com.sun.proxy.$Proxy10.invokeMethodOnService(Unknown Source)
	at org.ops4j.pax.exam.forked.ForkedTestContainer.call(ForkedTestContainer.java:103)
	at org.ops4j.pax.exam.spi.reactors.EagerSingleStagedReactor.invoke(EagerSingleStagedReactor.java:109)
	at org.ops4j.pax.exam.junit.impl.ProbeRunner$2.evaluate(ProbeRunner.java:267)
	at org.junit.runners.BlockJUnit4ClassRunner.runChild(BlockJUnit4ClassRunner.java:76)
	at org.junit.runners.BlockJUnit4ClassRunner.runChild(BlockJUnit4ClassRunner.java:50)
	at org.junit.runners.ParentRunner$3.run(ParentRunner.java:193)
	at org.junit.runners.ParentRunner$1.schedule(ParentRunner.java:52)
	at org.junit.runners.ParentRunner.runChildren(ParentRunner.java:191)
	at org.junit.runners.ParentRunner.access$000(ParentRunner.java:42)
	at org.junit.runners.ParentRunner$2.evaluate(ParentRunner.java:184)
	at org.junit.runners.ParentRunner.run(ParentRunner.java:236)
	at org.ops4j.pax.exam.junit.impl.ProbeRunner.run(ProbeRunner.java:98)
	at org.ops4j.pax.exam.junit.PaxExam.run(PaxExam.java:93)
	at org.apache.maven.surefire.junit4.JUnit4Provider.execute(JUnit4Provider.java:264)
	at org.apache.maven.surefire.junit4.JUnit4Provider.executeTestSet(JUnit4Provider.java:153)
	at org.apache.maven.surefire.junit4.JUnit4Provider.invoke(JUnit4Provider.java:124)
	at org.apache.maven.surefire.booter.ForkedBooter.invokeProviderInSameClassLoader(ForkedBooter.java:200)
	at org.apache.maven.surefire.booter.ForkedBooter.runSuitesInProcess(ForkedBooter.java:153)
	at org.apache.maven.surefire.booter.ForkedBooter.main(ForkedBooter.java:103)

Running org.apache.aries.tx.control.itests.SimpleHibernate_5_0_9_Test
Tests run: 14, Failures: 0, Errors: 0, Skipped: 0, Time elapsed: 32.044 sec - in org.apache.aries.tx.control.itests.SimpleHibernate_5_0_9_Test

Results :

Tests in error: 
  SimpleOpenJPA_2_4_1_Test.testTx:org.apache.aries.tx.control.itests.SimpleOpenJPA_2_4_1_Test.testTx:Forked:FrameworkFactory[1]
» ClassNotFound
  SimpleOpenJPA_2_4_1_Test.testRollback:org.apache.aries.tx.control.itests.SimpleOpenJPA_2_4_1_Test.testRollback:Forked:FrameworkFactory[1]
» ClassNotFound
  SimpleOpenJPA_2_4_1_Test.testNestedTx:org.apache.aries.tx.control.itests.SimpleOpenJPA_2_4_1_Test.testNestedTx:Forked:FrameworkFactory[1]
» ClassNotFound
  SimpleOpenJPA_2_4_1_Test.testNestedTxOuterRollback:org.apache.aries.tx.control.itests.SimpleOpenJPA_2_4_1_Test.testNestedTxOuterRollback:Forked:FrameworkFactory[1]
» ClassNotFound
  SimpleOpenJPA_2_4_1_Test.testNestedTxInnerRollback:org.apache.aries.tx.control.itests.SimpleOpenJPA_2_4_1_Test.testNestedTxInnerRollback:Forked:FrameworkFactory[1]
» ClassNotFound
  SimpleOpenJPA_2_4_1_Test.testRequiredInheritsTx:org.apache.aries.tx.control.itests.SimpleOpenJPA_2_4_1_Test.testRequiredInheritsTx:Forked:FrameworkFactory[1]
» ClassNotFound
  SimpleOpenJPA_2_4_1_Test.testSuspendedTx:org.apache.aries.tx.control.itests.SimpleOpenJPA_2_4_1_Test.testSuspendedTx:Forked:FrameworkFactory[1]
» ClassNotFound
  SimpleEclipseLink_2_6_0_Test.testSuspendedTx:org.apache.aries.tx.control.itests.SimpleEclipseLink_2_6_0_Test.testSuspendedTx:Forked:FrameworkFactory[1]
» ClassNotFound
  SimpleEclipseLink_2_6_0_Test.testTx:org.apache.aries.tx.control.itests.SimpleEclipseLink_2_6_0_Test.testTx:Forked:FrameworkFactory[1]
» ClassNotFound
  SimpleEclipseLink_2_6_0_Test.testRollback:org.apache.aries.tx.control.itests.SimpleEclipseLink_2_6_0_Test.testRollback:Forked:FrameworkFactory[1]
» ClassNotFound
  SimpleEclipseLink_2_6_0_Test.testNestedTx:org.apache.aries.tx.control.itests.SimpleEclipseLink_2_6_0_Test.testNestedTx:Forked:FrameworkFactory[1]
» ClassNotFound
  SimpleEclipseLink_2_6_0_Test.testNestedTxOuterRollback:org.apache.aries.tx.control.itests.SimpleEclipseLink_2_6_0_Test.testNestedTxOuterRollback:Forked:FrameworkFactory[1]
» ClassNotFound
  SimpleEclipseLink_2_6_0_Test.testNestedTxInnerRollback:org.apache.aries.tx.control.itests.SimpleEclipseLink_2_6_0_Test.testNestedTxInnerRollback:Forked:FrameworkFactory[1]
» ClassNotFound
  SimpleEclipseLink_2_6_0_Test.testRequiredInheritsTx:org.apache.aries.tx.control.itests.SimpleEclipseLink_2_6_0_Test.testRequiredInheritsTx:Forked:FrameworkFactory[1]
» ClassNotFound

Tests run: 42, Failures: 0, Errors: 14, Skipped: 0

[INFO] ------------------------------------------------------------------------
[INFO] Reactor Summary:
[INFO] 
[INFO] OSGi Transaction Control API ....................... SUCCESS [ 18.044 s]
[INFO] OSGi Transaction Control Service - Common Code ..... SUCCESS [  3.611 s]
[INFO] OSGi Transaction Control Service - Local Transactions SUCCESS [  8.095 s]
[INFO] OSGi Transaction Control Service - XA Transactions . SUCCESS [  9.715 s]
[INFO] OSGi Transaction Control JDBC Resource Provider - Common Code SUCCESS [  2.007 s]
[INFO] OSGi Transaction Control JDBC Resource Provider - Local Transactions SUCCESS [  8.093
s]
[INFO] OSGi Transaction Control JDBC Resource Provider - XA Transactions SUCCESS [  7.364
s]
[INFO] OSGi Transaction Control JPA Resource Provider - Local Transactions SUCCESS [ 11.779
s]
[INFO] OSGi Transaction Control JPA Resource Provider - XA Transactions SUCCESS [ 25.159 s]
[INFO] Apache Aries Transaction Control iTests ............ SUCCESS [01:21 min]
[INFO] Apache Aries Transaction Control JPA iTests ........ FAILURE [01:03 min]
[INFO] tx-control ......................................... SKIPPED
[INFO] ------------------------------------------------------------------------
[INFO] BUILD FAILURE
[INFO] ------------------------------------------------------------------------
[INFO] Total time: 04:05 min
[INFO] Finished at: 2016-04-14T16:30:13+00:00
[INFO] Final Memory: 72M/925M
[INFO] ------------------------------------------------------------------------
[ERROR] Failed to execute goal org.apache.maven.plugins:maven-surefire-plugin:2.16:test (default-test)
on project org.apache.aries.tx-control-jpa-itests: There are test failures.
[ERROR] 
[ERROR] Please refer to <https://builds.apache.org/job/Aries-Tx-Control-Trunk-JDK8/ws/tx-control-jpa-itests/target/surefire-reports>
for the individual test results.
[ERROR] -> [Help 1]
org.apache.maven.lifecycle.LifecycleExecutionException: Failed to execute goal org.apache.maven.plugins:maven-surefire-plugin:2.16:test
(default-test) on project org.apache.aries.tx-control-jpa-itests: There are test failures.

Please refer to <https://builds.apache.org/job/Aries-Tx-Control-Trunk-JDK8/ws/tx-control-jpa-itests/target/surefire-reports>
for the individual test results.
	at org.apache.maven.lifecycle.internal.MojoExecutor.execute(MojoExecutor.java:212)
	at org.apache.maven.lifecycle.internal.MojoExecutor.execute(MojoExecutor.java:153)
	at org.apache.maven.lifecycle.internal.MojoExecutor.execute(MojoExecutor.java:145)
	at org.apache.maven.lifecycle.internal.LifecycleModuleBuilder.buildProject(LifecycleModuleBuilder.java:116)
	at org.apache.maven.lifecycle.internal.LifecycleModuleBuilder.buildProject(LifecycleModuleBuilder.java:80)
	at org.apache.maven.lifecycle.internal.builder.singlethreaded.SingleThreadedBuilder.build(SingleThreadedBuilder.java:51)
	at org.apache.maven.lifecycle.internal.LifecycleStarter.execute(LifecycleStarter.java:120)
	at org.apache.maven.DefaultMaven.doExecute(DefaultMaven.java:355)
	at org.apache.maven.DefaultMaven.execute(DefaultMaven.java:155)
	at org.jvnet.hudson.maven3.launcher.Maven32Launcher.main(Maven32Launcher.java:132)
	at sun.reflect.NativeMethodAccessorImpl.invoke0(Native Method)
	at sun.reflect.NativeMethodAccessorImpl.invoke(NativeMethodAccessorImpl.java:62)
	at sun.reflect.DelegatingMethodAccessorImpl.invoke(DelegatingMethodAccessorImpl.java:43)
	at java.lang.reflect.Method.invoke(Method.java:498)
	at org.codehaus.plexus.classworlds.launcher.Launcher.launchStandard(Launcher.java:330)
	at org.codehaus.plexus.classworlds.launcher.Launcher.launch(Launcher.java:238)
	at jenkins.maven3.agent.Maven32Main.launch(Maven32Main.java:186)
	at sun.reflect.NativeMethodAccessorImpl.invoke0(Native Method)
	at sun.reflect.NativeMethodAccessorImpl.invoke(NativeMethodAccessorImpl.java:62)
	at sun.reflect.DelegatingMethodAccessorImpl.invoke(DelegatingMethodAccessorImpl.java:43)
	at java.lang.reflect.Method.invoke(Method.java:498)
	at hudson.maven.Maven3Builder.call(Maven3Builder.java:136)
	at hudson.maven.Maven3Builder.call(Maven3Builder.java:71)
	at hudson.remoting.UserRequest.perform(UserRequest.java:120)
	at hudson.remoting.UserRequest.perform(UserRequest.java:48)
	at hudson.remoting.Request$2.run(Request.java:326)
	at hudson.remoting.InterceptingExecutorService$1.call(InterceptingExecutorService.java:68)
	at java.util.concurrent.FutureTask.run(FutureTask.java:266)
	at java.util.concurrent.ThreadPoolExecutor.runWorker(ThreadPoolExecutor.java:1142)
	at java.util.concurrent.ThreadPoolExecutor$Worker.run(ThreadPoolExecutor.java:617)
	at java.lang.Thread.run(Thread.java:745)
Caused by: org.apache.maven.plugin.MojoFailureException: There are test failures.

Please refer to <https://builds.apache.org/job/Aries-Tx-Control-Trunk-JDK8/ws/tx-control-jpa-itests/target/surefire-reports>
for the individual test results.
	at org.apache.maven.plugin.surefire.SurefireHelper.reportExecution(SurefireHelper.java:82)
	at org.apache.maven.plugin.surefire.SurefirePlugin.handleSummary(SurefirePlugin.java:190)
	at org.apache.maven.plugin.surefire.AbstractSurefireMojo.executeAfterPreconditionsChecked(AbstractSurefireMojo.java:852)
	at org.apache.maven.plugin.surefire.AbstractSurefireMojo.execute(AbstractSurefireMojo.java:720)
	at org.apache.maven.plugin.DefaultBuildPluginManager.executeMojo(DefaultBuildPluginManager.java:132)
	at org.apache.maven.lifecycle.internal.MojoExecutor.execute(MojoExecutor.java:208)
	... 30 more
[ERROR] 
[ERROR] Re-run Maven using the -X switch to enable full debug logging.
[ERROR] 
[ERROR] For more information about the errors and possible solutions, please read the following
articles:
[ERROR] [Help 1] http://cwiki.apache.org/confluence/display/MAVEN/MojoFailureException
[ERROR] 
[ERROR] After correcting the problems, you can resume the build with the command
[ERROR]   mvn <goals> -rf :org.apache.aries.tx-control-jpa-itests
[JENKINS] Archiving <https://builds.apache.org/job/Aries-Tx-Control-Trunk-JDK8/ws/pom.xml>
to org.apache.aries.tx-control/tx-control/0.0.1-SNAPSHOT/tx-control-0.0.1-SNAPSHOT.pom
channel stopped

Mime
View raw message