aries-dev mailing list archives

Site index · List index
Message view « Date » · « Thread »
Top « Date » · « Thread »
From Apache Jenkins Server <jenk...@builds.apache.org>
Subject Build failed in Jenkins: Aries-Tx-Control-Trunk-JDK8 #15
Date Wed, 06 Apr 2016 15:19:39 GMT
See <https://builds.apache.org/job/Aries-Tx-Control-Trunk-JDK8/15/changes>

Changes:

[timothyjward] [tx-control] Add JPA integration tests for Hibernate 5.0.9

------------------------------------------
[...truncated 4897 lines...]
[INFO] Downloaded: https://repo.maven.apache.org/maven2/org/ops4j/pax/url/pax-url-commons/2.4.2/pax-url-commons-2.4.2.pom
(3 KB at 58.0 KB/sec)
[INFO] Downloading: http://download.eclipse.org/rt/eclipselink/maven.repo/org/ops4j/pax/swissbox/pax-swissbox-property/1.8.2/pax-swissbox-property-1.8.2.pom
[INFO] Downloading: https://repo.maven.apache.org/maven2/org/ops4j/pax/swissbox/pax-swissbox-property/1.8.2/pax-swissbox-property-1.8.2.pom
[INFO] Downloaded: https://repo.maven.apache.org/maven2/org/ops4j/pax/swissbox/pax-swissbox-property/1.8.2/pax-swissbox-property-1.8.2.pom
(2 KB at 48.2 KB/sec)
[INFO] Downloading: http://download.eclipse.org/rt/eclipselink/maven.repo/org/ops4j/pax/url/pax-url-classpath/2.4.2/pax-url-classpath-2.4.2.pom
[INFO] Downloading: https://repo.maven.apache.org/maven2/org/ops4j/pax/url/pax-url-classpath/2.4.2/pax-url-classpath-2.4.2.pom
[INFO] Downloaded: https://repo.maven.apache.org/maven2/org/ops4j/pax/url/pax-url-classpath/2.4.2/pax-url-classpath-2.4.2.pom
(3 KB at 67.2 KB/sec)
[INFO] Downloading: http://download.eclipse.org/rt/eclipselink/maven.repo/org/ops4j/pax/swissbox/pax-swissbox-optional-jcl/1.8.2/pax-swissbox-optional-jcl-1.8.2.pom
[INFO] Downloading: https://repo.maven.apache.org/maven2/org/ops4j/pax/swissbox/pax-swissbox-optional-jcl/1.8.2/pax-swissbox-optional-jcl-1.8.2.pom
[INFO] Downloaded: https://repo.maven.apache.org/maven2/org/ops4j/pax/swissbox/pax-swissbox-optional-jcl/1.8.2/pax-swissbox-optional-jcl-1.8.2.pom
(2 KB at 43.1 KB/sec)
[INFO] Downloading: http://download.eclipse.org/rt/eclipselink/maven.repo/org/eclipse/persistence/javax.persistence/2.1.1/javax.persistence-2.1.1.jar
[INFO] Downloading: http://download.eclipse.org/rt/eclipselink/maven.repo/org/ops4j/pax/exam/pax-exam/4.8.0/pax-exam-4.8.0.jar
[INFO] Downloading: http://download.eclipse.org/rt/eclipselink/maven.repo/org/ops4j/base/ops4j-base-lang/1.5.0/ops4j-base-lang-1.5.0.jar
[INFO] Downloading: http://download.eclipse.org/rt/eclipselink/maven.repo/org/ops4j/base/ops4j-base-store/1.5.0/ops4j-base-store-1.5.0.jar
[INFO] Downloading: http://download.eclipse.org/rt/eclipselink/maven.repo/org/ops4j/base/ops4j-base-util-property/1.5.0/ops4j-base-util-property-1.5.0.jar
[INFO] Downloading: http://download.eclipse.org/rt/eclipselink/maven.repo/org/ops4j/pax/exam/pax-exam-container-forked/4.8.0/pax-exam-container-forked-4.8.0.jar
[INFO] Downloading: http://download.eclipse.org/rt/eclipselink/maven.repo/org/ops4j/pax/exam/pax-exam-spi/4.8.0/pax-exam-spi-4.8.0.jar
[INFO] Downloading: http://download.eclipse.org/rt/eclipselink/maven.repo/org/ops4j/base/ops4j-base-exec/1.5.0/ops4j-base-exec-1.5.0.jar
[INFO] Downloading: http://download.eclipse.org/rt/eclipselink/maven.repo/org/ops4j/base/ops4j-base-net/1.5.0/ops4j-base-net-1.5.0.jar
[INFO] Downloading: http://download.eclipse.org/rt/eclipselink/maven.repo/org/ops4j/base/ops4j-base-monitors/1.5.0/ops4j-base-monitors-1.5.0.jar
[INFO] Downloading: http://download.eclipse.org/rt/eclipselink/maven.repo/org/ops4j/base/ops4j-base-io/1.5.0/ops4j-base-io-1.5.0.jar
[INFO] Downloading: http://download.eclipse.org/rt/eclipselink/maven.repo/org/ops4j/base/ops4j-base-spi/1.5.0/ops4j-base-spi-1.5.0.jar
[INFO] Downloading: http://download.eclipse.org/rt/eclipselink/maven.repo/org/ops4j/pax/swissbox/pax-swissbox-framework/1.8.2/pax-swissbox-framework-1.8.2.jar
[INFO] Downloading: http://download.eclipse.org/rt/eclipselink/maven.repo/org/ops4j/pax/swissbox/pax-swissbox-tracker/1.8.2/pax-swissbox-tracker-1.8.2.jar
[INFO] Downloading: http://download.eclipse.org/rt/eclipselink/maven.repo/org/ops4j/pax/swissbox/pax-swissbox-lifecycle/1.8.2/pax-swissbox-lifecycle-1.8.2.jar
[INFO] Downloading: http://download.eclipse.org/rt/eclipselink/maven.repo/org/ops4j/pax/exam/pax-exam-junit4/4.8.0/pax-exam-junit4-4.8.0.jar
[INFO] Downloading: http://download.eclipse.org/rt/eclipselink/maven.repo/org/ops4j/pax/exam/pax-exam-link-mvn/4.8.0/pax-exam-link-mvn-4.8.0.jar
[INFO] Downloading: http://download.eclipse.org/rt/eclipselink/maven.repo/org/ops4j/pax/url/pax-url-link/2.4.2/pax-url-link-2.4.2.jar
[INFO] Downloading: http://download.eclipse.org/rt/eclipselink/maven.repo/org/ops4j/pax/url/pax-url-classpath/2.4.2/pax-url-classpath-2.4.2.jar
[INFO] Downloading: http://download.eclipse.org/rt/eclipselink/maven.repo/org/ops4j/pax/swissbox/pax-swissbox-optional-jcl/1.8.2/pax-swissbox-optional-jcl-1.8.2.jar
[INFO] Downloading: http://download.eclipse.org/rt/eclipselink/maven.repo/commons-logging/commons-logging/1.0.4/commons-logging-1.0.4.jar
[INFO] Downloading: https://repo.maven.apache.org/maven2/org/eclipse/persistence/javax.persistence/2.1.1/javax.persistence-2.1.1.jar
[INFO] Downloading: https://repo.maven.apache.org/maven2/org/ops4j/pax/exam/pax-exam/4.8.0/pax-exam-4.8.0.jar
[INFO] Downloading: https://repo.maven.apache.org/maven2/org/ops4j/base/ops4j-base-store/1.5.0/ops4j-base-store-1.5.0.jar
[INFO] Downloading: https://repo.maven.apache.org/maven2/org/ops4j/base/ops4j-base-lang/1.5.0/ops4j-base-lang-1.5.0.jar
[INFO] Downloading: https://repo.maven.apache.org/maven2/org/ops4j/base/ops4j-base-util-property/1.5.0/ops4j-base-util-property-1.5.0.jar
[INFO] Downloaded: https://repo.maven.apache.org/maven2/org/ops4j/base/ops4j-base-store/1.5.0/ops4j-base-store-1.5.0.jar
(8 KB at 93.7 KB/sec)
[INFO] Downloading: https://repo.maven.apache.org/maven2/org/ops4j/pax/exam/pax-exam-container-forked/4.8.0/pax-exam-container-forked-4.8.0.jar
[INFO] Downloaded: https://repo.maven.apache.org/maven2/org/ops4j/base/ops4j-base-lang/1.5.0/ops4j-base-lang-1.5.0.jar
(7 KB at 78.4 KB/sec)
[INFO] Downloading: https://repo.maven.apache.org/maven2/org/ops4j/pax/exam/pax-exam-spi/4.8.0/pax-exam-spi-4.8.0.jar
[INFO] Downloaded: https://repo.maven.apache.org/maven2/org/eclipse/persistence/javax.persistence/2.1.1/javax.persistence-2.1.1.jar
(159 KB at 1778.8 KB/sec)
[INFO] Downloading: https://repo.maven.apache.org/maven2/org/ops4j/base/ops4j-base-exec/1.5.0/ops4j-base-exec-1.5.0.jar
[INFO] Downloaded: https://repo.maven.apache.org/maven2/org/ops4j/base/ops4j-base-util-property/1.5.0/ops4j-base-util-property-1.5.0.jar
(6 KB at 65.2 KB/sec)
[INFO] Downloading: https://repo.maven.apache.org/maven2/org/ops4j/base/ops4j-base-net/1.5.0/ops4j-base-net-1.5.0.jar
[INFO] Downloaded: https://repo.maven.apache.org/maven2/org/ops4j/pax/exam/pax-exam/4.8.0/pax-exam-4.8.0.jar
(80 KB at 739.2 KB/sec)
[INFO] Downloading: https://repo.maven.apache.org/maven2/org/ops4j/base/ops4j-base-monitors/1.5.0/ops4j-base-monitors-1.5.0.jar
[INFO] Downloaded: https://repo.maven.apache.org/maven2/org/ops4j/base/ops4j-base-net/1.5.0/ops4j-base-net-1.5.0.jar
(13 KB at 113.4 KB/sec)
[INFO] Downloading: https://repo.maven.apache.org/maven2/org/ops4j/base/ops4j-base-io/1.5.0/ops4j-base-io-1.5.0.jar
[INFO] Downloaded: https://repo.maven.apache.org/maven2/org/ops4j/pax/exam/pax-exam-spi/4.8.0/pax-exam-spi-4.8.0.jar
(69 KB at 573.4 KB/sec)
[INFO] Downloading: https://repo.maven.apache.org/maven2/org/ops4j/base/ops4j-base-spi/1.5.0/ops4j-base-spi-1.5.0.jar
[INFO] Downloaded: https://repo.maven.apache.org/maven2/org/ops4j/base/ops4j-base-exec/1.5.0/ops4j-base-exec-1.5.0.jar
(9 KB at 70.8 KB/sec)
[INFO] Downloaded: https://repo.maven.apache.org/maven2/org/ops4j/base/ops4j-base-monitors/1.5.0/ops4j-base-monitors-1.5.0.jar
(9 KB at 64.7 KB/sec)
[INFO] Downloading: https://repo.maven.apache.org/maven2/org/ops4j/pax/swissbox/pax-swissbox-tracker/1.8.2/pax-swissbox-tracker-1.8.2.jar
[INFO] Downloading: https://repo.maven.apache.org/maven2/org/ops4j/pax/swissbox/pax-swissbox-framework/1.8.2/pax-swissbox-framework-1.8.2.jar
[INFO] Downloaded: https://repo.maven.apache.org/maven2/org/ops4j/base/ops4j-base-spi/1.5.0/ops4j-base-spi-1.5.0.jar
(8 KB at 49.0 KB/sec)
[INFO] Downloading: https://repo.maven.apache.org/maven2/org/ops4j/pax/swissbox/pax-swissbox-lifecycle/1.8.2/pax-swissbox-lifecycle-1.8.2.jar
[INFO] Downloaded: https://repo.maven.apache.org/maven2/org/ops4j/base/ops4j-base-io/1.5.0/ops4j-base-io-1.5.0.jar
(21 KB at 139.2 KB/sec)
[INFO] Downloading: https://repo.maven.apache.org/maven2/org/ops4j/pax/exam/pax-exam-junit4/4.8.0/pax-exam-junit4-4.8.0.jar
[INFO] Downloaded: https://repo.maven.apache.org/maven2/org/ops4j/pax/swissbox/pax-swissbox-framework/1.8.2/pax-swissbox-framework-1.8.2.jar
(14 KB at 84.9 KB/sec)
[INFO] Downloading: https://repo.maven.apache.org/maven2/org/ops4j/pax/exam/pax-exam-link-mvn/4.8.0/pax-exam-link-mvn-4.8.0.jar
[INFO] Downloaded: https://repo.maven.apache.org/maven2/org/ops4j/pax/swissbox/pax-swissbox-lifecycle/1.8.2/pax-swissbox-lifecycle-1.8.2.jar
(7 KB at 37.8 KB/sec)
[INFO] Downloading: https://repo.maven.apache.org/maven2/org/ops4j/pax/url/pax-url-link/2.4.2/pax-url-link-2.4.2.jar
[INFO] Downloaded: https://repo.maven.apache.org/maven2/org/ops4j/pax/swissbox/pax-swissbox-tracker/1.8.2/pax-swissbox-tracker-1.8.2.jar
(15 KB at 86.4 KB/sec)
[INFO] Downloading: https://repo.maven.apache.org/maven2/org/ops4j/pax/url/pax-url-classpath/2.4.2/pax-url-classpath-2.4.2.jar
[INFO] Downloaded: https://repo.maven.apache.org/maven2/org/ops4j/pax/exam/pax-exam-junit4/4.8.0/pax-exam-junit4-4.8.0.jar
(35 KB at 184.9 KB/sec)
[INFO] Downloading: https://repo.maven.apache.org/maven2/org/ops4j/pax/swissbox/pax-swissbox-optional-jcl/1.8.2/pax-swissbox-optional-jcl-1.8.2.jar
[INFO] Downloaded: https://repo.maven.apache.org/maven2/org/ops4j/pax/exam/pax-exam-link-mvn/4.8.0/pax-exam-link-mvn-4.8.0.jar
(11 KB at 57.1 KB/sec)
[INFO] Downloading: https://repo.maven.apache.org/maven2/commons-logging/commons-logging/1.0.4/commons-logging-1.0.4.jar
[INFO] Downloaded: https://repo.maven.apache.org/maven2/org/ops4j/pax/url/pax-url-classpath/2.4.2/pax-url-classpath-2.4.2.jar
(9 KB at 42.9 KB/sec)
[INFO] Downloaded: https://repo.maven.apache.org/maven2/org/ops4j/pax/url/pax-url-link/2.4.2/pax-url-link-2.4.2.jar
(8 KB at 36.1 KB/sec)
[INFO] Downloaded: https://repo.maven.apache.org/maven2/org/ops4j/pax/exam/pax-exam-container-forked/4.8.0/pax-exam-container-forked-4.8.0.jar
(32 KB at 149.7 KB/sec)
[INFO] Downloaded: https://repo.maven.apache.org/maven2/org/ops4j/pax/swissbox/pax-swissbox-optional-jcl/1.8.2/pax-swissbox-optional-jcl-1.8.2.jar
(7 KB at 30.5 KB/sec)
[INFO] Downloaded: https://repo.maven.apache.org/maven2/commons-logging/commons-logging/1.0.4/commons-logging-1.0.4.jar
(38 KB at 162.1 KB/sec)
[INFO] 
[INFO] --- maven-clean-plugin:2.5:clean (default-clean) @ org.apache.aries.tx-control-jpa-itests
---
[INFO] 
[INFO] --- maven-enforcer-plugin:1.3.1:enforce (default) @ org.apache.aries.tx-control-jpa-itests
---
[INFO] 
[INFO] --- maven-remote-resources-plugin:1.5:process (default) @ org.apache.aries.tx-control-jpa-itests
---
[INFO] 
[INFO] --- depends-maven-plugin:1.2:generate-depends-file (generate-depends-file) @ org.apache.aries.tx-control-jpa-itests
---
[INFO] Created: <https://builds.apache.org/job/Aries-Tx-Control-Trunk-JDK8/ws/tx-control-jpa-itests/target/classes/META-INF/maven/dependencies.properties>
[INFO] 
[INFO] --- maven-resources-plugin:2.6:resources (default-resources) @ org.apache.aries.tx-control-jpa-itests
---
[INFO] Using 'UTF-8' encoding to copy filtered resources.
[INFO] skip non existing resourceDirectory <https://builds.apache.org/job/Aries-Tx-Control-Trunk-JDK8/ws/tx-control-jpa-itests/src/main/resources>
[INFO] skip non existing resourceDirectory <https://builds.apache.org/job/Aries-Tx-Control-Trunk-JDK8/ws/tx-control-jpa-itests/src/main/filtered-resources>
[INFO] skip non existing resourceDirectory <https://builds.apache.org/job/Aries-Tx-Control-Trunk-JDK8/ws/tx-control-jpa-itests/src/main/java>
[INFO] Copying 3 resources
[INFO] 
[INFO] --- maven-compiler-plugin:3.1:compile (default-compile) @ org.apache.aries.tx-control-jpa-itests
---
[INFO] No sources to compile
[INFO] 
[INFO] --- maven-resources-plugin:2.6:testResources (default-testResources) @ org.apache.aries.tx-control-jpa-itests
---
[INFO] Using 'UTF-8' encoding to copy filtered resources.
[INFO] Copying 1 resource
[INFO] skip non existing resourceDirectory <https://builds.apache.org/job/Aries-Tx-Control-Trunk-JDK8/ws/tx-control-jpa-itests/src/test/filtered-resources>
[INFO] Copying 3 resources
[INFO] 
[INFO] --- maven-compiler-plugin:3.1:testCompile (default-testCompile) @ org.apache.aries.tx-control-jpa-itests
---
[INFO] Changes detected - recompiling the module!
[INFO] Compiling 5 source files to <https://builds.apache.org/job/Aries-Tx-Control-Trunk-JDK8/ws/tx-control-jpa-itests/target/test-classes>
[WARNING] Supported source version 'RELEASE_6' from annotation processor 'org.sonatype.guice.bean.scanners.index.SisuIndexAPT6'
less than -source '1.8'
[INFO] 
[INFO] --- maven-surefire-plugin:2.16:test (default-test) @ org.apache.aries.tx-control-jpa-itests
---
[WARNING] The parameter forkMode is deprecated since version 2.14. Use forkCount and reuseForks
instead.
[INFO] Surefire report directory: <https://builds.apache.org/job/Aries-Tx-Control-Trunk-JDK8/ws/tx-control-jpa-itests/target/surefire-reports>

-------------------------------------------------------
 T E S T S
-------------------------------------------------------

-------------------------------------------------------
 T E S T S
-------------------------------------------------------
Running org.apache.aries.tx.control.itests.SimpleHibernate_5_0_9_Test
Tests run: 1, Failures: 0, Errors: 1, Skipped: 0, Time elapsed: 4.578 sec <<< FAILURE!
- in org.apache.aries.tx.control.itests.SimpleHibernate_5_0_9_Test
org.apache.aries.tx.control.itests.SimpleHibernate_5_0_9_Test  Time elapsed: 4.525 sec  <<<
ERROR!
org.ops4j.pax.exam.TestContainerException: [mvn:org.apache.aries.jpa/org.apache.aries.jpa.container/2.4.0-SNAPSHOT]
could not be downloaded
	at org.ops4j.pax.exam.forked.provision.PlatformImpl.download(PlatformImpl.java:146)
	at org.ops4j.pax.exam.forked.ForkedTestContainer.downloadBundle(ForkedTestContainer.java:354)
	at org.ops4j.pax.exam.forked.ForkedTestContainer.installAndStartBundles(ForkedTestContainer.java:283)
	at org.ops4j.pax.exam.forked.ForkedTestContainer.start(ForkedTestContainer.java:165)
	at org.ops4j.pax.exam.spi.reactors.EagerSingleStagedReactor.setUp(EagerSingleStagedReactor.java:86)
	at org.ops4j.pax.exam.spi.reactors.EagerSingleStagedReactor.beforeClass(EagerSingleStagedReactor.java:136)
	at org.ops4j.pax.exam.spi.reactors.ReactorManager.beforeClass(ReactorManager.java:448)
	at org.ops4j.pax.exam.junit.impl.ProbeRunner.run(ProbeRunner.java:97)
	at org.ops4j.pax.exam.junit.PaxExam.run(PaxExam.java:93)
	at org.apache.maven.surefire.junit4.JUnit4Provider.execute(JUnit4Provider.java:264)
	at org.apache.maven.surefire.junit4.JUnit4Provider.executeTestSet(JUnit4Provider.java:153)
	at org.apache.maven.surefire.junit4.JUnit4Provider.invoke(JUnit4Provider.java:124)
	at org.apache.maven.surefire.booter.ForkedBooter.invokeProviderInSameClassLoader(ForkedBooter.java:200)
	at org.apache.maven.surefire.booter.ForkedBooter.runSuitesInProcess(ForkedBooter.java:153)
	at org.apache.maven.surefire.booter.ForkedBooter.main(ForkedBooter.java:103)
Caused by: java.io.IOException: Error resolving artifact org.apache.aries.jpa:org.apache.aries.jpa.container:jar:2.4.0-SNAPSHOT:
Could not find artifact org.apache.aries.jpa:org.apache.aries.jpa.container:jar:2.4.0-SNAPSHOT
in central (http://repo1.maven.org/maven2/)
	at org.ops4j.pax.url.mvn.internal.AetherBasedResolver.resolve(AetherBasedResolver.java:258)
	at org.ops4j.pax.url.mvn.internal.AetherBasedResolver.resolveFile(AetherBasedResolver.java:239)
	at org.ops4j.pax.url.mvn.internal.AetherBasedResolver.resolve(AetherBasedResolver.java:223)
	at org.ops4j.pax.url.mvn.internal.Connection.getInputStream(Connection.java:122)
	at java.net.URL.openStream(URL.java:1045)
	at org.ops4j.pax.exam.forked.provision.StreamUtils.streamCopy(StreamUtils.java:103)
	at org.ops4j.pax.exam.forked.provision.PlatformImpl.download(PlatformImpl.java:133)
	at org.ops4j.pax.exam.forked.ForkedTestContainer.downloadBundle(ForkedTestContainer.java:354)
	at org.ops4j.pax.exam.forked.ForkedTestContainer.installAndStartBundles(ForkedTestContainer.java:283)
	at org.ops4j.pax.exam.forked.ForkedTestContainer.start(ForkedTestContainer.java:165)
	at org.ops4j.pax.exam.spi.reactors.EagerSingleStagedReactor.setUp(EagerSingleStagedReactor.java:86)
	at org.ops4j.pax.exam.spi.reactors.EagerSingleStagedReactor.beforeClass(EagerSingleStagedReactor.java:136)
	at org.ops4j.pax.exam.spi.reactors.ReactorManager.beforeClass(ReactorManager.java:448)
	at org.ops4j.pax.exam.junit.impl.ProbeRunner.run(ProbeRunner.java:97)
	at org.ops4j.pax.exam.junit.PaxExam.run(PaxExam.java:93)
	at org.apache.maven.surefire.junit4.JUnit4Provider.execute(JUnit4Provider.java:264)
	at org.apache.maven.surefire.junit4.JUnit4Provider.executeTestSet(JUnit4Provider.java:153)
	at org.apache.maven.surefire.junit4.JUnit4Provider.invoke(JUnit4Provider.java:124)
	at org.apache.maven.surefire.booter.ForkedBooter.invokeProviderInSameClassLoader(ForkedBooter.java:200)
	at org.apache.maven.surefire.booter.ForkedBooter.runSuitesInProcess(ForkedBooter.java:153)
	at org.apache.maven.surefire.booter.ForkedBooter.main(ForkedBooter.java:103)

Running org.apache.aries.tx.control.itests.SimpleEclipseLink_2_6_0_Test
Tests run: 7, Failures: 0, Errors: 0, Skipped: 0, Time elapsed: 10.075 sec - in org.apache.aries.tx.control.itests.SimpleEclipseLink_2_6_0_Test

Results :

Tests in error: 
  SimpleHibernate_5_0_9_Test.org.apache.aries.tx.control.itests.SimpleHibernate_5_0_9_Test
ยป TestContainer

Tests run: 8, Failures: 0, Errors: 1, Skipped: 0

[INFO] ------------------------------------------------------------------------
[INFO] Reactor Summary:
[INFO] 
[INFO] OSGi Transaction Control API ....................... SUCCESS [ 27.806 s]
[INFO] OSGi Transaction Control JPA Resource Provider - Local Transactions SUCCESS [ 55.138
s]
[INFO] OSGi Transaction Control Service - Common Code ..... SUCCESS [  2.570 s]
[INFO] OSGi Transaction Control Service - Local Transactions SUCCESS [  4.166 s]
[INFO] OSGi Transaction Control Service - XA Transactions . SUCCESS [ 20.008 s]
[INFO] OSGi Transaction Control JDBC Resource Provider - Common Code SUCCESS [  2.293 s]
[INFO] OSGi Transaction Control JDBC Resource Provider - Local Transactions SUCCESS [  2.609
s]
[INFO] OSGi Transaction Control JDBC Resource Provider - XA Transactions SUCCESS [  3.228
s]
[INFO] Apache Aries Transaction Control iTests ............ SUCCESS [17:46 min]
[INFO] Apache Aries Transaction Control JPA iTests ........ FAILURE [01:53 min]
[INFO] tx-control ......................................... SKIPPED
[INFO] ------------------------------------------------------------------------
[INFO] BUILD FAILURE
[INFO] ------------------------------------------------------------------------
[INFO] Total time: 21:55 min
[INFO] Finished at: 2016-04-06T15:19:36+00:00
[INFO] Final Memory: 64M/545M
[INFO] ------------------------------------------------------------------------
[ERROR] Failed to execute goal org.apache.maven.plugins:maven-surefire-plugin:2.16:test (default-test)
on project org.apache.aries.tx-control-jpa-itests: There are test failures.
[ERROR] 
[ERROR] Please refer to <https://builds.apache.org/job/Aries-Tx-Control-Trunk-JDK8/ws/tx-control-jpa-itests/target/surefire-reports>
for the individual test results.
[ERROR] -> [Help 1]
org.apache.maven.lifecycle.LifecycleExecutionException: Failed to execute goal org.apache.maven.plugins:maven-surefire-plugin:2.16:test
(default-test) on project org.apache.aries.tx-control-jpa-itests: There are test failures.

Please refer to <https://builds.apache.org/job/Aries-Tx-Control-Trunk-JDK8/ws/tx-control-jpa-itests/target/surefire-reports>
for the individual test results.
	at org.apache.maven.lifecycle.internal.MojoExecutor.execute(MojoExecutor.java:212)
	at org.apache.maven.lifecycle.internal.MojoExecutor.execute(MojoExecutor.java:153)
	at org.apache.maven.lifecycle.internal.MojoExecutor.execute(MojoExecutor.java:145)
	at org.apache.maven.lifecycle.internal.LifecycleModuleBuilder.buildProject(LifecycleModuleBuilder.java:116)
	at org.apache.maven.lifecycle.internal.LifecycleModuleBuilder.buildProject(LifecycleModuleBuilder.java:80)
	at org.apache.maven.lifecycle.internal.builder.singlethreaded.SingleThreadedBuilder.build(SingleThreadedBuilder.java:51)
	at org.apache.maven.lifecycle.internal.LifecycleStarter.execute(LifecycleStarter.java:120)
	at org.apache.maven.DefaultMaven.doExecute(DefaultMaven.java:355)
	at org.apache.maven.DefaultMaven.execute(DefaultMaven.java:155)
	at org.jvnet.hudson.maven3.launcher.Maven32Launcher.main(Maven32Launcher.java:132)
	at sun.reflect.NativeMethodAccessorImpl.invoke0(Native Method)
	at sun.reflect.NativeMethodAccessorImpl.invoke(NativeMethodAccessorImpl.java:62)
	at sun.reflect.DelegatingMethodAccessorImpl.invoke(DelegatingMethodAccessorImpl.java:43)
	at java.lang.reflect.Method.invoke(Method.java:498)
	at org.codehaus.plexus.classworlds.launcher.Launcher.launchStandard(Launcher.java:330)
	at org.codehaus.plexus.classworlds.launcher.Launcher.launch(Launcher.java:238)
	at jenkins.maven3.agent.Maven32Main.launch(Maven32Main.java:186)
	at sun.reflect.NativeMethodAccessorImpl.invoke0(Native Method)
	at sun.reflect.NativeMethodAccessorImpl.invoke(NativeMethodAccessorImpl.java:62)
	at sun.reflect.DelegatingMethodAccessorImpl.invoke(DelegatingMethodAccessorImpl.java:43)
	at java.lang.reflect.Method.invoke(Method.java:498)
	at hudson.maven.Maven3Builder.call(Maven3Builder.java:136)
	at hudson.maven.Maven3Builder.call(Maven3Builder.java:71)
	at hudson.remoting.UserRequest.perform(UserRequest.java:120)
	at hudson.remoting.UserRequest.perform(UserRequest.java:48)
	at hudson.remoting.Request$2.run(Request.java:326)
	at hudson.remoting.InterceptingExecutorService$1.call(InterceptingExecutorService.java:68)
	at java.util.concurrent.FutureTask.run(FutureTask.java:266)
	at java.util.concurrent.ThreadPoolExecutor.runWorker(ThreadPoolExecutor.java:1142)
	at java.util.concurrent.ThreadPoolExecutor$Worker.run(ThreadPoolExecutor.java:617)
	at java.lang.Thread.run(Thread.java:745)
Caused by: org.apache.maven.plugin.MojoFailureException: There are test failures.

Please refer to <https://builds.apache.org/job/Aries-Tx-Control-Trunk-JDK8/ws/tx-control-jpa-itests/target/surefire-reports>
for the individual test results.
	at org.apache.maven.plugin.surefire.SurefireHelper.reportExecution(SurefireHelper.java:82)
	at org.apache.maven.plugin.surefire.SurefirePlugin.handleSummary(SurefirePlugin.java:190)
	at org.apache.maven.plugin.surefire.AbstractSurefireMojo.executeAfterPreconditionsChecked(AbstractSurefireMojo.java:852)
	at org.apache.maven.plugin.surefire.AbstractSurefireMojo.execute(AbstractSurefireMojo.java:720)
	at org.apache.maven.plugin.DefaultBuildPluginManager.executeMojo(DefaultBuildPluginManager.java:132)
	at org.apache.maven.lifecycle.internal.MojoExecutor.execute(MojoExecutor.java:208)
	... 30 more
[ERROR] 
[ERROR] Re-run Maven using the -X switch to enable full debug logging.
[ERROR] 
[ERROR] For more information about the errors and possible solutions, please read the following
articles:
[ERROR] [Help 1] http://cwiki.apache.org/confluence/display/MAVEN/MojoFailureException
[ERROR] 
[ERROR] After correcting the problems, you can resume the build with the command
[ERROR]   mvn <goals> -rf :org.apache.aries.tx-control-jpa-itests
[JENKINS] Archiving <https://builds.apache.org/job/Aries-Tx-Control-Trunk-JDK8/ws/tx-control-provider-jpa-local/pom.xml>
to org.apache.aries.tx-control/tx-control-provider-jpa-local/0.0.1-SNAPSHOT/tx-control-provider-jpa-local-0.0.1-SNAPSHOT.pom
[JENKINS] Archiving <https://builds.apache.org/job/Aries-Tx-Control-Trunk-JDK8/ws/tx-control-provider-jpa-local/target/tx-control-provider-jpa-local-0.0.1-SNAPSHOT.jar>
to org.apache.aries.tx-control/tx-control-provider-jpa-local/0.0.1-SNAPSHOT/tx-control-provider-jpa-local-0.0.1-SNAPSHOT.jar
Compressed 290.72 KB of artifacts by 22.0% relative to #14
[JENKINS] Archiving <https://builds.apache.org/job/Aries-Tx-Control-Trunk-JDK8/ws/pom.xml>
to org.apache.aries.tx-control/tx-control/0.0.1-SNAPSHOT/tx-control-0.0.1-SNAPSHOT.pom
channel stopped

Mime
View raw message