aries-dev mailing list archives

Site index · List index
Message view « Date » · « Thread »
Top « Date » · « Thread »
From Apache Jenkins Server <jenk...@builds.apache.org>
Subject Build failed in Jenkins: Aries-Tx-Control-Trunk-JDK8 #31
Date Fri, 24 Jun 2016 16:21:15 GMT
See <https://builds.apache.org/job/Aries-Tx-Control-Trunk-JDK8/31/>

------------------------------------------
[...truncated 296 lines...]
A         tx-control-jpa-itests/src/test/java/org/apache
A         tx-control-jpa-itests/src/test/java/org/apache/aries
A         tx-control-jpa-itests/src/test/java/org/apache/aries/tx
A         tx-control-jpa-itests/src/test/java/org/apache/aries/tx/control
A         tx-control-jpa-itests/src/test/java/org/apache/aries/tx/control/itests
A         tx-control-jpa-itests/src/test/java/org/apache/aries/tx/control/itests/XAOpenJPA_2_4_1_Test.java
A         tx-control-jpa-itests/src/test/java/org/apache/aries/tx/control/itests/SimpleOpenJPA_2_4_1_Test.java
A         tx-control-jpa-itests/src/test/java/org/apache/aries/tx/control/itests/XAJPATransactionTest.java
A         tx-control-jpa-itests/src/test/java/org/apache/aries/tx/control/itests/entity
A         tx-control-jpa-itests/src/test/java/org/apache/aries/tx/control/itests/entity/Message.java
A         tx-control-jpa-itests/src/test/java/org/apache/aries/tx/control/itests/XAEclipseLink_2_6_0_Test.java
A         tx-control-jpa-itests/src/test/java/org/apache/aries/tx/control/itests/SimpleEclipseLink_2_6_0_Test.java
A         tx-control-jpa-itests/src/test/java/org/apache/aries/tx/control/itests/AbstractSimpleTransactionTest.java
A         tx-control-jpa-itests/src/test/java/org/apache/aries/tx/control/itests/AbstractJPATransactionTest.java
A         tx-control-jpa-itests/src/test/java/org/apache/aries/tx/control/itests/XAHibernate_5_0_9_Test.java
A         tx-control-jpa-itests/src/test/java/org/apache/aries/tx/control/itests/SimpleHibernate_5_0_9_Test.java
A         tx-control-jpa-itests/src/test/resources
A         tx-control-jpa-itests/src/test/resources/META-INF
A         tx-control-jpa-itests/src/test/resources/META-INF/xa-test-unit-1.xml
A         tx-control-jpa-itests/src/test/resources/META-INF/xa-test-unit-2.xml
A         tx-control-jpa-itests/src/test/resources/META-INF/persistence.xml
A         tx-control-jpa-itests/pom.xml
A         README.md
A         tx-control-service-common
A         tx-control-service-common/NOTICE
A         tx-control-service-common/LICENSE
A         tx-control-service-common/src
A         tx-control-service-common/src/main
A         tx-control-service-common/src/main/java
A         tx-control-service-common/src/main/java/org
A         tx-control-service-common/src/main/java/org/apache
A         tx-control-service-common/src/main/java/org/apache/aries
A         tx-control-service-common/src/main/java/org/apache/aries/tx
A         tx-control-service-common/src/main/java/org/apache/aries/tx/control
A         tx-control-service-common/src/main/java/org/apache/aries/tx/control/service
A         tx-control-service-common/src/main/java/org/apache/aries/tx/control/service/common
A         tx-control-service-common/src/main/java/org/apache/aries/tx/control/service/common/activator
A         tx-control-service-common/src/main/java/org/apache/aries/tx/control/service/common/impl
A         tx-control-service-common/src/main/java/org/apache/aries/tx/control/service/common/impl/NoTransactionContextImpl.java
A         tx-control-service-common/src/main/java/org/apache/aries/tx/control/service/common/impl/AbstractTransactionControlImpl.java
A         tx-control-service-common/src/main/java/org/apache/aries/tx/control/service/common/impl/AbstractTransactionContextImpl.java
A         tx-control-service-common/src/test
A         tx-control-service-common/src/test/java
A         tx-control-service-common/src/test/java/org
A         tx-control-service-common/src/test/java/org/apache
A         tx-control-service-common/src/test/java/org/apache/aries
A         tx-control-service-common/src/test/java/org/apache/aries/tx
A         tx-control-service-common/src/test/java/org/apache/aries/tx/control
A         tx-control-service-common/src/test/java/org/apache/aries/tx/control/service
A         tx-control-service-common/src/test/java/org/apache/aries/tx/control/service/common
A         tx-control-service-common/src/test/java/org/apache/aries/tx/control/service/common/impl
A         tx-control-service-common/src/test/java/org/apache/aries/tx/control/service/common/impl/NoTransactionContextTest.java
A         tx-control-service-common/pom.xml
A         tx-control-service-xa
A         tx-control-service-xa/NOTICE
A         tx-control-service-xa/LICENSE
A         tx-control-service-xa/src
A         tx-control-service-xa/src/test
A         tx-control-service-xa/src/test/java
A         tx-control-service-xa/src/test/java/org
A         tx-control-service-xa/src/test/java/org/apache
A         tx-control-service-xa/src/test/java/org/apache/aries
A         tx-control-service-xa/src/test/java/org/apache/aries/tx
A         tx-control-service-xa/src/test/java/org/apache/aries/tx/control
A         tx-control-service-xa/src/test/java/org/apache/aries/tx/control/service
A         tx-control-service-xa/src/test/java/org/apache/aries/tx/control/service/xa
A         tx-control-service-xa/src/test/java/org/apache/aries/tx/control/service/xa/impl
A         tx-control-service-xa/src/test/java/org/apache/aries/tx/control/service/xa/impl/TransactionLifecycleTest.java
A         tx-control-service-xa/src/test/java/org/apache/aries/tx/control/service/xa/impl/TransactionControlRunningTest.java
A         tx-control-service-xa/src/test/java/org/apache/aries/tx/control/service/xa/impl/TransactionLogTest.java
A         tx-control-service-xa/src/test/java/org/apache/aries/tx/control/service/xa/impl/TransactionContextTest.java
A         tx-control-service-xa/src/test/java/org/apache/aries/tx/control/service/xa/impl/TransactionControlStatusTest.java
A         tx-control-service-xa/src/main
A         tx-control-service-xa/src/main/java
A         tx-control-service-xa/src/main/java/org
A         tx-control-service-xa/src/main/java/org/apache
A         tx-control-service-xa/src/main/java/org/apache/aries
A         tx-control-service-xa/src/main/java/org/apache/aries/tx
A         tx-control-service-xa/src/main/java/org/apache/aries/tx/control
A         tx-control-service-xa/src/main/java/org/apache/aries/tx/control/service
A         tx-control-service-xa/src/main/java/org/apache/aries/tx/control/service/xa
A         tx-control-service-xa/src/main/java/org/apache/aries/tx/control/service/xa/impl
A         tx-control-service-xa/src/main/java/org/apache/aries/tx/control/service/xa/impl/TransactionControlImpl.java
A         tx-control-service-xa/src/main/java/org/apache/aries/tx/control/service/xa/impl/Activator.java
A         tx-control-service-xa/src/main/java/org/apache/aries/tx/control/service/xa/impl/TransactionContextImpl.java
A         tx-control-service-xa/pom.xml
At revision 1750128

Parsing POMs
Modules changed, recalculating dependency graph
Established TCP socket on 35970
maven32-agent.jar already up to date
maven32-interceptor.jar already up to date
maven3-interceptor-commons.jar already up to date
[Aries-Tx-Control-Trunk-JDK8] $ /home/jenkins/jenkins-slave/tools/hudson.model.JDK/latest1.8/bin/java
-Xmx2g -Xms256m -XX:MaxPermSize=512m -cp /home/jenkins/jenkins-slave/maven32-agent.jar:/home/jenkins/jenkins-slave/tools/hudson.tasks.Maven_MavenInstallation/maven-3.2.5/boot/plexus-classworlds-2.5.2.jar:/home/jenkins/jenkins-slave/tools/hudson.tasks.Maven_MavenInstallation/maven-3.2.5/conf/logging
jenkins.maven3.agent.Maven32Main /home/jenkins/jenkins-slave/tools/hudson.tasks.Maven_MavenInstallation/maven-3.2.5
/home/jenkins/jenkins-slave/slave.jar /home/jenkins/jenkins-slave/maven32-interceptor.jar
/home/jenkins/jenkins-slave/maven3-interceptor-commons.jar 35970
Java HotSpot(TM) 64-Bit Server VM warning: ignoring option MaxPermSize=512m; support was removed
in 8.0
<===[JENKINS REMOTING CAPACITY]===>   channel started
Executing Maven:  -B -f <https://builds.apache.org/job/Aries-Tx-Control-Trunk-JDK8/ws/pom.xml>
-Dmaven.repo.local=/home/jenkins/jenkins-slave/maven-repositories/0 -U -e -B clean install
[INFO] Error stacktraces are turned on.
[INFO] Scanning for projects...
[INFO] ------------------------------------------------------------------------
[INFO] Reactor Build Order:
[INFO] 
[INFO] tx-control
[INFO] OSGi Transaction Control API
[INFO] OSGi Transaction Control Service - Common Code
[INFO] OSGi Transaction Control Service - Local Transactions
[INFO] OSGi Transaction Control Service - XA Transactions
[INFO] OSGi Transaction Control JDBC Resource Provider - Common Code
[INFO] OSGi Transaction Control JDBC Resource Provider - Local Transactions
[INFO] OSGi Transaction Control JDBC Resource Provider - XA Transactions
[INFO] OSGi Transaction Control JPA Resource Provider - Local Transactions
[INFO] OSGi Transaction Control JPA Resource Provider - XA Transactions
[INFO] Apache Aries Transaction Control iTests
[INFO] Apache Aries Transaction Control JPA iTests
[INFO]                                                                         
[INFO] ------------------------------------------------------------------------
[INFO] Building tx-control 0.0.2-SNAPSHOT
[INFO] ------------------------------------------------------------------------
[INFO] 
[INFO] --- maven-clean-plugin:2.5:clean (default-clean) @ tx-control ---
[INFO] 
[INFO] --- maven-enforcer-plugin:1.3.1:enforce (default) @ tx-control ---
[INFO] 
[INFO] --- maven-remote-resources-plugin:1.5:process (default) @ tx-control ---
[INFO] 
[INFO] --- maven-site-plugin:3.3:attach-descriptor (attach-descriptor) @ tx-control ---
[INFO] 
[INFO] --- org.apache.aries.versioning.plugin:0.3.0:version-check (default-verify) @ tx-control
---
[INFO] 
[INFO] --- ianal-maven-plugin:1.0-alpha-1:verify-legal-files (default) @ tx-control ---
[INFO] 
[INFO] --- maven-install-plugin:2.5.1:install (default-install) @ tx-control ---
[INFO] Installing <https://builds.apache.org/job/Aries-Tx-Control-Trunk-JDK8/ws/pom.xml>
to /home/jenkins/jenkins-slave/maven-repositories/0/org/apache/aries/tx-control/tx-control/0.0.2-SNAPSHOT/tx-control-0.0.2-SNAPSHOT.pom
[INFO]                                                                         
[INFO] ------------------------------------------------------------------------
[INFO] Building OSGi Transaction Control API 0.0.2-SNAPSHOT
[INFO] ------------------------------------------------------------------------
[INFO] 
[INFO] --- maven-clean-plugin:2.5:clean (default-clean) @ tx-control-api ---
[INFO] 
[INFO] --- maven-enforcer-plugin:1.3.1:enforce (default) @ tx-control-api ---
[INFO] 
[INFO] --- maven-remote-resources-plugin:1.5:process (default) @ tx-control-api ---
[INFO] 
[INFO] --- maven-resources-plugin:2.6:resources (default-resources) @ tx-control-api ---
[INFO] Using 'UTF-8' encoding to copy filtered resources.
[INFO] skip non existing resourceDirectory <https://builds.apache.org/job/Aries-Tx-Control-Trunk-JDK8/ws/tx-control-api/src/main/resources>
[INFO] skip non existing resourceDirectory <https://builds.apache.org/job/Aries-Tx-Control-Trunk-JDK8/ws/tx-control-api/src/main/filtered-resources>
[INFO] Copying 4 resources
[INFO] Copying 3 resources
[INFO] 
[INFO] --- maven-compiler-plugin:3.1:compile (default-compile) @ tx-control-api ---
[INFO] Changes detected - recompiling the module!
[INFO] Compiling 16 source files to <https://builds.apache.org/job/Aries-Tx-Control-Trunk-JDK8/ws/tx-control-api/target/classes>
[INFO] 
[INFO] --- maven-resources-plugin:2.6:testResources (default-testResources) @ tx-control-api
---
[INFO] Using 'UTF-8' encoding to copy filtered resources.
[INFO] skip non existing resourceDirectory <https://builds.apache.org/job/Aries-Tx-Control-Trunk-JDK8/ws/tx-control-api/src/test/resources>
[INFO] skip non existing resourceDirectory <https://builds.apache.org/job/Aries-Tx-Control-Trunk-JDK8/ws/tx-control-api/src/test/filtered-resources>
[INFO] Copying 3 resources
[INFO] 
[INFO] --- maven-compiler-plugin:3.1:testCompile (default-testCompile) @ tx-control-api ---
[INFO] No sources to compile
[INFO] 
[INFO] --- maven-surefire-plugin:2.16:test (default-test) @ tx-control-api ---
[INFO] 
[INFO] --- maven-bundle-plugin:3.0.1:bundle (default-bundle) @ tx-control-api ---
[INFO] 
[INFO] --- maven-site-plugin:3.3:attach-descriptor (attach-descriptor) @ tx-control-api ---
[INFO] 
[INFO] --- org.apache.aries.versioning.plugin:0.3.0:version-check (default-verify) @ tx-control-api
---
[ERROR] The bundle tx-control-api has the following changes:
Some packages have major changes. For an instance, the package org.osgi.service.transaction.control.jpa
has major version changes.
The bundle version should be 1.0.0.

[INFO] ------------------------------------------------------------------------
[INFO] Reactor Summary:
[INFO] 
[INFO] tx-control ......................................... SUCCESS [  4.801 s]
[INFO] OSGi Transaction Control API ....................... FAILURE [  3.979 s]
[INFO] OSGi Transaction Control Service - Common Code ..... SKIPPED
[INFO] OSGi Transaction Control Service - Local Transactions SKIPPED
[INFO] OSGi Transaction Control Service - XA Transactions . SKIPPED
[INFO] OSGi Transaction Control JDBC Resource Provider - Common Code SKIPPED
[INFO] OSGi Transaction Control JDBC Resource Provider - Local Transactions SKIPPED
[INFO] OSGi Transaction Control JDBC Resource Provider - XA Transactions SKIPPED
[INFO] OSGi Transaction Control JPA Resource Provider - Local Transactions SKIPPED
[INFO] OSGi Transaction Control JPA Resource Provider - XA Transactions SKIPPED
[INFO] Apache Aries Transaction Control iTests ............ SKIPPED
[INFO] Apache Aries Transaction Control JPA iTests ........ SKIPPED
[INFO] ------------------------------------------------------------------------
[INFO] BUILD FAILURE
[INFO] ------------------------------------------------------------------------
[INFO] Total time: 12.636 s
[INFO] Finished at: 2016-06-24T16:21:20+00:00
[INFO] Final Memory: 39M/464M
[INFO] ------------------------------------------------------------------------
[ERROR] Failed to execute goal org.apache.aries.versioning:org.apache.aries.versioning.plugin:0.3.0:version-check
(default-verify) on project tx-control-api: Execution default-verify of goal org.apache.aries.versioning:org.apache.aries.versioning.plugin:0.3.0:version-check
failed: Semantic Versioning incorrect -> [Help 1]
org.apache.maven.lifecycle.LifecycleExecutionException: Failed to execute goal org.apache.aries.versioning:org.apache.aries.versioning.plugin:0.3.0:version-check
(default-verify) on project tx-control-api: Execution default-verify of goal org.apache.aries.versioning:org.apache.aries.versioning.plugin:0.3.0:version-check
failed: Semantic Versioning incorrect
	at org.apache.maven.lifecycle.internal.MojoExecutor.execute(MojoExecutor.java:224)
	at org.apache.maven.lifecycle.internal.MojoExecutor.execute(MojoExecutor.java:153)
	at org.apache.maven.lifecycle.internal.MojoExecutor.execute(MojoExecutor.java:145)
	at org.apache.maven.lifecycle.internal.LifecycleModuleBuilder.buildProject(LifecycleModuleBuilder.java:116)
	at org.apache.maven.lifecycle.internal.LifecycleModuleBuilder.buildProject(LifecycleModuleBuilder.java:80)
	at org.apache.maven.lifecycle.internal.builder.singlethreaded.SingleThreadedBuilder.build(SingleThreadedBuilder.java:51)
	at org.apache.maven.lifecycle.internal.LifecycleStarter.execute(LifecycleStarter.java:120)
	at org.apache.maven.DefaultMaven.doExecute(DefaultMaven.java:355)
	at org.apache.maven.DefaultMaven.execute(DefaultMaven.java:155)
	at org.jvnet.hudson.maven3.launcher.Maven32Launcher.main(Maven32Launcher.java:132)
	at sun.reflect.NativeMethodAccessorImpl.invoke0(Native Method)
	at sun.reflect.NativeMethodAccessorImpl.invoke(NativeMethodAccessorImpl.java:62)
	at sun.reflect.DelegatingMethodAccessorImpl.invoke(DelegatingMethodAccessorImpl.java:43)
	at java.lang.reflect.Method.invoke(Method.java:498)
	at org.codehaus.plexus.classworlds.launcher.Launcher.launchStandard(Launcher.java:330)
	at org.codehaus.plexus.classworlds.launcher.Launcher.launch(Launcher.java:238)
	at jenkins.maven3.agent.Maven32Main.launch(Maven32Main.java:186)
	at sun.reflect.NativeMethodAccessorImpl.invoke0(Native Method)
	at sun.reflect.NativeMethodAccessorImpl.invoke(NativeMethodAccessorImpl.java:62)
	at sun.reflect.DelegatingMethodAccessorImpl.invoke(DelegatingMethodAccessorImpl.java:43)
	at java.lang.reflect.Method.invoke(Method.java:498)
	at hudson.maven.Maven3Builder.call(Maven3Builder.java:136)
	at hudson.maven.Maven3Builder.call(Maven3Builder.java:71)
	at hudson.remoting.UserRequest.perform(UserRequest.java:120)
	at hudson.remoting.UserRequest.perform(UserRequest.java:48)
	at hudson.remoting.Request$2.run(Request.java:326)
	at hudson.remoting.InterceptingExecutorService$1.call(InterceptingExecutorService.java:68)
	at java.util.concurrent.FutureTask.run(FutureTask.java:266)
	at java.util.concurrent.ThreadPoolExecutor.runWorker(ThreadPoolExecutor.java:1142)
	at java.util.concurrent.ThreadPoolExecutor$Worker.run(ThreadPoolExecutor.java:617)
	at java.lang.Thread.run(Thread.java:745)
Caused by: org.apache.maven.plugin.PluginExecutionException: Execution default-verify of goal
org.apache.aries.versioning:org.apache.aries.versioning.plugin:0.3.0:version-check failed:
Semantic Versioning incorrect
	at org.apache.maven.plugin.DefaultBuildPluginManager.executeMojo(DefaultBuildPluginManager.java:143)
	at org.apache.maven.lifecycle.internal.MojoExecutor.execute(MojoExecutor.java:208)
	... 30 more
Caused by: java.lang.RuntimeException: Semantic Versioning incorrect
	at org.apache.aries.versioning.mojo.VersionCheckerMojo.execute(VersionCheckerMojo.java:143)
	at org.apache.maven.plugin.DefaultBuildPluginManager.executeMojo(DefaultBuildPluginManager.java:132)
	... 31 more
[ERROR] 
[ERROR] Re-run Maven using the -X switch to enable full debug logging.
[ERROR] 
[ERROR] For more information about the errors and possible solutions, please read the following
articles:
[ERROR] [Help 1] http://cwiki.apache.org/confluence/display/MAVEN/PluginExecutionException
[ERROR] 
[ERROR] After correcting the problems, you can resume the build with the command
[ERROR]   mvn <goals> -rf :tx-control-api
[JENKINS] Archiving <https://builds.apache.org/job/Aries-Tx-Control-Trunk-JDK8/ws/pom.xml>
to org.apache.aries.tx-control/tx-control/0.0.2-SNAPSHOT/tx-control-0.0.2-SNAPSHOT.pom
channel stopped

Mime
View raw message