aries-dev mailing list archives

Site index · List index
Message view « Date » · « Thread »
Top « Date » · « Thread »
From Apache Jenkins Server <jenk...@builds.apache.org>
Subject Build failed in Jenkins: Aries-Tx-Control-Trunk-JDK8 #35
Date Tue, 16 Aug 2016 12:11:20 GMT
See <https://builds.apache.org/job/Aries-Tx-Control-Trunk-JDK8/35/changes>

Changes:

[timothyjward] [tx-control] Add missing package to avoid the need to deploy the JDBC API

[timothyjward] [tx-control] Correctly set the causes of ScopedWorkExceptions

------------------------------------------
[...truncated 23660 lines...]
12:11:08.629 [Thread-7] DEBUG o.o.p.t.core.intern.RawBuilder - PaxExam-ec99834d-55e4-4647-8cf6-36404d25dd54
= org.apache.aries.tx.control.itests.SimpleEclipseLink_2_6_0_Test;testTx
12:11:08.631 [Thread-7] DEBUG o.o.p.t.core.intern.RawBuilder - Copying resource META-INF/NOTICE
12:11:08.632 [Thread-7] DEBUG o.o.p.t.core.intern.RawBuilder - Copying resource org/apache/aries/tx/control/itests/XAOpenJPA_2_4_1_Test.class
12:11:08.633 [Thread-7] DEBUG o.o.p.t.core.intern.RawBuilder - Copying resource org/apache/aries/tx/control/itests/SimpleHibernate_5_0_9_Test.class
12:11:08.633 [Thread-7] DEBUG o.o.p.t.core.intern.RawBuilder - Copying resource META-INF/LICENSE
12:11:08.634 [Thread-7] DEBUG o.o.p.t.core.intern.RawBuilder - Copying resource META-INF/persistence.xml
12:11:08.635 [Thread-7] DEBUG o.o.p.t.core.intern.RawBuilder - Copying resource META-INF/DEPENDENCIES
12:11:08.635 [Thread-7] DEBUG o.o.p.t.core.intern.RawBuilder - Copying resource META-INF/xa-test-unit-2.xml
12:11:08.635 [Thread-7] DEBUG o.o.p.t.core.intern.RawBuilder - Copying resource org/apache/aries/tx/control/itests/XAEclipseLink_2_6_0_Test.class
12:11:08.636 [Thread-7] DEBUG o.o.p.t.core.intern.RawBuilder - Copying resource org/apache/aries/tx/control/itests/AbstractJPATransactionTest$1.class
12:11:08.636 [Thread-7] DEBUG o.o.p.t.core.intern.RawBuilder - Copying resource org/apache/aries/tx/control/itests/XAJPATransactionTest$PoisonResource.class
12:11:08.636 [Thread-7] DEBUG o.o.p.t.core.intern.RawBuilder - Copying resource org/apache/aries/tx/control/itests/XAHibernate_5_0_9_Test.class
12:11:08.636 [Thread-7] DEBUG o.o.p.t.core.intern.RawBuilder - Copying resource org/apache/aries/tx/control/itests/AbstractJPATransactionTest.class
12:11:08.637 [Thread-7] DEBUG o.o.p.t.core.intern.RawBuilder - Copying resource org/apache/aries/tx/control/itests/XAJPATransactionTest$1.class
12:11:08.638 [Thread-7] DEBUG o.o.p.t.core.intern.RawBuilder - Copying resource org/apache/aries/tx/control/itests/XAJPATransactionTest.class
12:11:08.639 [Thread-7] DEBUG o.o.p.t.core.intern.RawBuilder - Copying resource org/apache/aries/tx/control/itests/SimpleOpenJPA_2_4_1_Test.class
12:11:08.641 [Thread-7] DEBUG o.o.p.t.core.intern.RawBuilder - Copying resource META-INF/xa-test-unit-1.xml
12:11:08.642 [Thread-7] DEBUG o.o.p.t.core.intern.RawBuilder - Copying resource org/apache/aries/tx/control/itests/entity/Message.class
12:11:08.642 [Thread-7] DEBUG o.o.p.t.core.intern.RawBuilder - Copying resource org/apache/aries/tx/control/itests/SimpleEclipseLink_2_6_0_Test.class
12:11:08.642 [Thread-7] DEBUG o.o.p.t.core.intern.RawBuilder - Copying resource org/apache/aries/tx/control/itests/AbstractSimpleTransactionTest.class
12:11:08.645 [main] DEBUG o.ops4j.store.intern.TemporaryStore - Exit store(): d96844c4e5ff5db4e7d542aa738d01a53b126640
12:11:08.652 [main] DEBUG o.o.pax.exam.junit.impl.ProbeRunner - Invoke testNestedTxOuterRollback:org.apache.aries.tx.control.itests.SimpleEclipseLink_2_6_0_Test.testNestedTxOuterRollback:Forked:FrameworkFactory[0]
@ [TestAddress:PaxExam-38ce70da-e825-4a98-9d32-2e57c3354eda root:PaxExam-bd12b7b9-9e53-4b71-87fa-d599d58fdf6d]
Arguments: [Ljava.lang.Object;@5bcab519
[RMI TCP Connection(1)-67.195.81.190] INFO org.ops4j.pax.exam.invoker.junit.internal.ContainerTestRunner
- running testNestedTxOuterRollback in reactor
Configuring connection provider with pid org.apache.aries.tx.control.jpa.local
[CM Configuration Updater (Update: pid=org.apache.aries.tx.control.jpa.local.56aeace8-901b-4749-aa27-20ef4a8f32ca)]
INFO com.zaxxer.hikari.HikariDataSource - HikariPool-0 - is starting.
[CM Configuration Updater (Update: pid=org.apache.aries.tx.control.jpa.local.56aeace8-901b-4749-aa27-20ef4a8f32ca)]
INFO org.apache.aries.jpa.container.weaving.impl.JPAWeavingHook - Adding transformer org.eclipse.persistence.internal.jpa.weaving.PersistenceWeaver
[EL Info]: 2016-08-16 12:11:09.07--ServerSession(226735894)--EclipseLink, version: Eclipse
Persistence Services - 2.6.0.v20150309-bf26070
[EL Info]: 2016-08-16 12:11:09.079--ServerSession(226735894)--/bundle://29.0:1/_test-unit_transactionType=RESOURCE_LOCAL_nonJtaDataSource=1299995052
login successful
[Message [id=2, message=Hello Nested World!]]
12:11:09.547 [main] DEBUG o.o.pax.exam.junit.impl.ProbeRunner - Invoke testTx:org.apache.aries.tx.control.itests.SimpleEclipseLink_2_6_0_Test.testTx:Forked:FrameworkFactory[0]
@ [TestAddress:PaxExam-e4d2f18d-c14d-4771-b65c-33802326baf3 root:PaxExam-ec99834d-55e4-4647-8cf6-36404d25dd54]
Arguments: [Ljava.lang.Object;@31a5c39e
[RMI TCP Connection(1)-67.195.81.190] INFO org.ops4j.pax.exam.invoker.junit.internal.ContainerTestRunner
- running testTx in reactor
Configuring connection provider with pid org.apache.aries.tx.control.jpa.local
[CM Configuration Updater (Update: pid=org.apache.aries.tx.control.jpa.local.fbe551cc-be13-41cd-bc86-671c6171c5c2)]
INFO com.zaxxer.hikari.HikariDataSource - HikariPool-1 - is starting.
[CM Configuration Updater (Update: pid=org.apache.aries.tx.control.jpa.local.fbe551cc-be13-41cd-bc86-671c6171c5c2)]
INFO org.apache.aries.jpa.container.weaving.impl.JPAWeavingHook - Adding transformer org.eclipse.persistence.internal.jpa.weaving.PersistenceWeaver
[EL Info]: 2016-08-16 12:11:09.595--ServerSession(1477489328)--EclipseLink, version: Eclipse
Persistence Services - 2.6.0.v20150309-bf26070
[EL Info]: 2016-08-16 12:11:09.598--ServerSession(1477489328)--/bundle://29.0:1/_test-unit_transactionType=RESOURCE_LOCAL_nonJtaDataSource=418398621
login successful
12:11:09.907 [main] DEBUG o.o.pax.exam.junit.impl.ProbeRunner - Invoke testRequiredInheritsTx:org.apache.aries.tx.control.itests.SimpleEclipseLink_2_6_0_Test.testRequiredInheritsTx:Forked:FrameworkFactory[0]
@ [TestAddress:PaxExam-6073a625-64cc-4142-a605-77082e624ff1 root:PaxExam-049e0db0-6fb1-4450-977f-52bb52edcfe3]
Arguments: [Ljava.lang.Object;@3f49dace
[RMI TCP Connection(1)-67.195.81.190] INFO org.ops4j.pax.exam.invoker.junit.internal.ContainerTestRunner
- running testRequiredInheritsTx in reactor
Configuring connection provider with pid org.apache.aries.tx.control.jpa.local
[CM Configuration Updater (Update: pid=org.apache.aries.tx.control.jpa.local.eec97be9-ac9a-499b-9ad9-e65f860e6a12)]
INFO com.zaxxer.hikari.HikariDataSource - HikariPool-2 - is starting.
[CM Configuration Updater (Update: pid=org.apache.aries.tx.control.jpa.local.eec97be9-ac9a-499b-9ad9-e65f860e6a12)]
INFO org.apache.aries.jpa.container.weaving.impl.JPAWeavingHook - Adding transformer org.eclipse.persistence.internal.jpa.weaving.PersistenceWeaver
[EL Info]: 2016-08-16 12:11:09.962--ServerSession(2002968652)--EclipseLink, version: Eclipse
Persistence Services - 2.6.0.v20150309-bf26070
[EL Info]: 2016-08-16 12:11:09.964--ServerSession(2002968652)--/bundle://29.0:1/_test-unit_transactionType=RESOURCE_LOCAL_nonJtaDataSource=724861764
login successful
[Message [id=2, message=Hello Nested World!], Message [id=1, message=Hello World!]]
12:11:10.266 [main] DEBUG o.o.pax.exam.junit.impl.ProbeRunner - Invoke testSuspendedTx:org.apache.aries.tx.control.itests.SimpleEclipseLink_2_6_0_Test.testSuspendedTx:Forked:FrameworkFactory[0]
@ [TestAddress:PaxExam-78f72cf3-6801-4e72-9c87-529773050c78 root:PaxExam-69afa591-fa6b-4ee3-84b2-02f51c93e533]
Arguments: [Ljava.lang.Object;@1e397ed7
[RMI TCP Connection(1)-67.195.81.190] INFO org.ops4j.pax.exam.invoker.junit.internal.ContainerTestRunner
- running testSuspendedTx in reactor
Configuring connection provider with pid org.apache.aries.tx.control.jpa.local
[CM Configuration Updater (Update: pid=org.apache.aries.tx.control.jpa.local.67a39a1c-39c2-4080-9b82-d85c4b142bb0)]
INFO com.zaxxer.hikari.HikariDataSource - HikariPool-3 - is starting.
[CM Configuration Updater (Update: pid=org.apache.aries.tx.control.jpa.local.67a39a1c-39c2-4080-9b82-d85c4b142bb0)]
INFO org.apache.aries.jpa.container.weaving.impl.JPAWeavingHook - Adding transformer org.eclipse.persistence.internal.jpa.weaving.PersistenceWeaver
[EL Info]: 2016-08-16 12:11:10.315--ServerSession(1006655719)--EclipseLink, version: Eclipse
Persistence Services - 2.6.0.v20150309-bf26070
[EL Info]: 2016-08-16 12:11:10.318--ServerSession(1006655719)--/bundle://29.0:1/_test-unit_transactionType=RESOURCE_LOCAL_nonJtaDataSource=1868221915
login successful
12:11:10.618 [main] DEBUG o.o.pax.exam.junit.impl.ProbeRunner - Invoke testRollback:org.apache.aries.tx.control.itests.SimpleEclipseLink_2_6_0_Test.testRollback:Forked:FrameworkFactory[0]
@ [TestAddress:PaxExam-d5754688-88fb-436c-b070-51485db3b8e0 root:PaxExam-46905951-d861-434f-818b-c0b30df481bc]
Arguments: [Ljava.lang.Object;@490ab905
[RMI TCP Connection(1)-67.195.81.190] INFO org.ops4j.pax.exam.invoker.junit.internal.ContainerTestRunner
- running testRollback in reactor
Configuring connection provider with pid org.apache.aries.tx.control.jpa.local
[CM Configuration Updater (Update: pid=org.apache.aries.tx.control.jpa.local.bc45b72f-75cf-4d42-b2ab-51912d0f14c8)]
INFO com.zaxxer.hikari.HikariDataSource - HikariPool-4 - is starting.
[CM Configuration Updater (Update: pid=org.apache.aries.tx.control.jpa.local.bc45b72f-75cf-4d42-b2ab-51912d0f14c8)]
INFO org.apache.aries.jpa.container.weaving.impl.JPAWeavingHook - Adding transformer org.eclipse.persistence.internal.jpa.weaving.PersistenceWeaver
[EL Info]: 2016-08-16 12:11:10.649--ServerSession(856538363)--EclipseLink, version: Eclipse
Persistence Services - 2.6.0.v20150309-bf26070
[EL Info]: 2016-08-16 12:11:10.651--ServerSession(856538363)--/bundle://29.0:1/_test-unit_transactionType=RESOURCE_LOCAL_nonJtaDataSource=2110783747
login successful
12:11:10.934 [main] DEBUG o.o.pax.exam.junit.impl.ProbeRunner - Invoke testNestedTxInnerRollback:org.apache.aries.tx.control.itests.SimpleEclipseLink_2_6_0_Test.testNestedTxInnerRollback:Forked:FrameworkFactory[0]
@ [TestAddress:PaxExam-af591268-a6a6-4fc2-be86-f00f6e84ff4a root:PaxExam-eaa3e003-d1b3-49c8-9a37-b8694ce709fe]
Arguments: [Ljava.lang.Object;@56ac3a89
[RMI TCP Connection(1)-67.195.81.190] INFO org.ops4j.pax.exam.invoker.junit.internal.ContainerTestRunner
- running testNestedTxInnerRollback in reactor
Configuring connection provider with pid org.apache.aries.tx.control.jpa.local
[CM Configuration Updater (Update: pid=org.apache.aries.tx.control.jpa.local.b7886abf-a04d-4a06-b1f0-7b8f8246c440)]
INFO com.zaxxer.hikari.HikariDataSource - HikariPool-5 - is starting.
[CM Configuration Updater (Update: pid=org.apache.aries.tx.control.jpa.local.b7886abf-a04d-4a06-b1f0-7b8f8246c440)]
INFO org.apache.aries.jpa.container.weaving.impl.JPAWeavingHook - Adding transformer org.eclipse.persistence.internal.jpa.weaving.PersistenceWeaver
[EL Info]: 2016-08-16 12:11:10.976--ServerSession(1362072672)--EclipseLink, version: Eclipse
Persistence Services - 2.6.0.v20150309-bf26070
[EL Info]: 2016-08-16 12:11:10.979--ServerSession(1362072672)--/bundle://29.0:1/_test-unit_transactionType=RESOURCE_LOCAL_nonJtaDataSource=725938676
login successful
[Message [id=1, message=Hello World!]]
12:11:11.266 [main] DEBUG o.o.pax.exam.junit.impl.ProbeRunner - Invoke testNestedTx:org.apache.aries.tx.control.itests.SimpleEclipseLink_2_6_0_Test.testNestedTx:Forked:FrameworkFactory[0]
@ [TestAddress:PaxExam-b420beca-855c-43de-95c9-bccbb12d0b25 root:PaxExam-bf5fc0d4-b5b2-4ce6-8379-701016685f2f]
Arguments: [Ljava.lang.Object;@27c20538
[RMI TCP Connection(1)-67.195.81.190] INFO org.ops4j.pax.exam.invoker.junit.internal.ContainerTestRunner
- running testNestedTx in reactor
Configuring connection provider with pid org.apache.aries.tx.control.jpa.local
[CM Configuration Updater (Update: pid=org.apache.aries.tx.control.jpa.local.7d91f365-e634-4d2f-a2e7-c8053f76fba4)]
INFO com.zaxxer.hikari.HikariDataSource - HikariPool-6 - is starting.
[CM Configuration Updater (Update: pid=org.apache.aries.tx.control.jpa.local.7d91f365-e634-4d2f-a2e7-c8053f76fba4)]
INFO org.apache.aries.jpa.container.weaving.impl.JPAWeavingHook - Adding transformer org.eclipse.persistence.internal.jpa.weaving.PersistenceWeaver
[EL Info]: 2016-08-16 12:11:11.299--ServerSession(424687135)--EclipseLink, version: Eclipse
Persistence Services - 2.6.0.v20150309-bf26070
[EL Info]: 2016-08-16 12:11:11.301--ServerSession(424687135)--/bundle://29.0:1/_test-unit_transactionType=RESOURCE_LOCAL_nonJtaDataSource=74907731
login successful
[Message [id=2, message=Hello Nested World!], Message [id=1, message=Hello World!]]
12:11:11.589 [main] DEBUG o.o.pax.exam.junit.impl.ProbeRunner - Invoke testNestedTxOuterRollback:org.apache.aries.tx.control.itests.SimpleEclipseLink_2_6_0_Test.testNestedTxOuterRollback:Forked:FrameworkFactory[1]
@ [TestAddress:PaxExam-dae01637-2ac9-4a45-885c-f5a49ba5ecba root:PaxExam-bd12b7b9-9e53-4b71-87fa-d599d58fdf6d]
Arguments: [Ljava.lang.Object;@5bcab519
[RMI TCP Connection(1)-67.195.81.190] INFO org.ops4j.pax.exam.invoker.junit.internal.ContainerTestRunner
- running testNestedTxOuterRollback in reactor
Configuring connection provider with pid org.apache.aries.tx.control.jpa.xa
[CM Configuration Updater (Update: pid=org.apache.aries.tx.control.jpa.xa.75817f41-0cce-498f-882f-7a5e2339bb20)]
INFO com.zaxxer.hikari.HikariDataSource - HikariPool-0 - is starting.
[RMI TCP Connection(1)-67.195.81.190] INFO org.apache.aries.jpa.container.weaving.impl.JPAWeavingHook
- Adding transformer org.eclipse.persistence.internal.jpa.weaving.PersistenceWeaver
[EL Info]: 2016-08-16 12:11:11.983--ServerSession(55361092)--EclipseLink, version: Eclipse
Persistence Services - 2.6.0.v20150309-bf26070
[EL Info]: 2016-08-16 12:11:11.992--ServerSession(55361092)--/bundle://29.0:1/_test-unit_transactionType=JTA_jtaDataSource=140084114_nonJtaDataSource=610954981
login successful
[Message [id=2, message=Hello Nested World!]]
12:11:12.447 [main] DEBUG o.o.pax.exam.junit.impl.ProbeRunner - Invoke testTx:org.apache.aries.tx.control.itests.SimpleEclipseLink_2_6_0_Test.testTx:Forked:FrameworkFactory[1]
@ [TestAddress:PaxExam-c6153c15-c560-4f1e-ba0d-a87fd4df52a3 root:PaxExam-ec99834d-55e4-4647-8cf6-36404d25dd54]
Arguments: [Ljava.lang.Object;@31a5c39e
[RMI TCP Connection(1)-67.195.81.190] INFO org.ops4j.pax.exam.invoker.junit.internal.ContainerTestRunner
- running testTx in reactor
Configuring connection provider with pid org.apache.aries.tx.control.jpa.xa
[CM Configuration Updater (Update: pid=org.apache.aries.tx.control.jpa.xa.cfc85b68-2ca5-47a5-81e2-6ea7610ca138)]
INFO com.zaxxer.hikari.HikariDataSource - HikariPool-1 - is starting.
[RMI TCP Connection(1)-67.195.81.190] INFO org.apache.aries.jpa.container.weaving.impl.JPAWeavingHook
- Adding transformer org.eclipse.persistence.internal.jpa.weaving.PersistenceWeaver
[EL Info]: 2016-08-16 12:11:12.502--ServerSession(225595086)--EclipseLink, version: Eclipse
Persistence Services - 2.6.0.v20150309-bf26070
[EL Info]: 2016-08-16 12:11:12.504--ServerSession(225595086)--/bundle://29.0:1/_test-unit_transactionType=JTA_jtaDataSource=1074671281_nonJtaDataSource=213087339
login successful
12:11:12.815 [main] DEBUG o.o.pax.exam.junit.impl.ProbeRunner - Invoke testRequiredInheritsTx:org.apache.aries.tx.control.itests.SimpleEclipseLink_2_6_0_Test.testRequiredInheritsTx:Forked:FrameworkFactory[1]
@ [TestAddress:PaxExam-c0120b6f-4fef-4b2c-8b78-a6f653b8502e root:PaxExam-049e0db0-6fb1-4450-977f-52bb52edcfe3]
Arguments: [Ljava.lang.Object;@3f49dace
[RMI TCP Connection(1)-67.195.81.190] INFO org.ops4j.pax.exam.invoker.junit.internal.ContainerTestRunner
- running testRequiredInheritsTx in reactor
Configuring connection provider with pid org.apache.aries.tx.control.jpa.xa
[CM Configuration Updater (Update: pid=org.apache.aries.tx.control.jpa.xa.fa88e4d7-85bb-4925-9913-3f85fdba9f3d)]
INFO com.zaxxer.hikari.HikariDataSource - HikariPool-2 - is starting.
[RMI TCP Connection(1)-67.195.81.190] INFO org.apache.aries.jpa.container.weaving.impl.JPAWeavingHook
- Adding transformer org.eclipse.persistence.internal.jpa.weaving.PersistenceWeaver
[EL Info]: 2016-08-16 12:11:12.868--ServerSession(241097093)--EclipseLink, version: Eclipse
Persistence Services - 2.6.0.v20150309-bf26070
[EL Info]: 2016-08-16 12:11:12.87--ServerSession(241097093)--/bundle://29.0:1/_test-unit_transactionType=JTA_jtaDataSource=210087087_nonJtaDataSource=1269606556
login successful
[Message [id=2, message=Hello Nested World!], Message [id=1, message=Hello World!]]
12:11:13.175 [main] DEBUG o.o.pax.exam.junit.impl.ProbeRunner - Invoke testSuspendedTx:org.apache.aries.tx.control.itests.SimpleEclipseLink_2_6_0_Test.testSuspendedTx:Forked:FrameworkFactory[1]
@ [TestAddress:PaxExam-63582142-b0cd-48bf-a405-c71bacecca34 root:PaxExam-69afa591-fa6b-4ee3-84b2-02f51c93e533]
Arguments: [Ljava.lang.Object;@1e397ed7
[RMI TCP Connection(1)-67.195.81.190] INFO org.ops4j.pax.exam.invoker.junit.internal.ContainerTestRunner
- running testSuspendedTx in reactor
Configuring connection provider with pid org.apache.aries.tx.control.jpa.xa
[CM Configuration Updater (Update: pid=org.apache.aries.tx.control.jpa.xa.9f2d3b09-7fc7-481d-9529-6b1b9403c152)]
INFO com.zaxxer.hikari.HikariDataSource - HikariPool-3 - is starting.
[RMI TCP Connection(1)-67.195.81.190] INFO org.apache.aries.jpa.container.weaving.impl.JPAWeavingHook
- Adding transformer org.eclipse.persistence.internal.jpa.weaving.PersistenceWeaver
[EL Info]: 2016-08-16 12:11:13.22--ServerSession(1744314068)--EclipseLink, version: Eclipse
Persistence Services - 2.6.0.v20150309-bf26070
[EL Info]: 2016-08-16 12:11:13.222--ServerSession(1744314068)--/bundle://29.0:1/_test-unit_transactionType=JTA_jtaDataSource=1297035534_nonJtaDataSource=1736564816
login successful
12:11:13.527 [main] DEBUG o.o.pax.exam.junit.impl.ProbeRunner - Invoke testRollback:org.apache.aries.tx.control.itests.SimpleEclipseLink_2_6_0_Test.testRollback:Forked:FrameworkFactory[1]
@ [TestAddress:PaxExam-ca5f86c3-4b2c-402e-a991-577e5f87708e root:PaxExam-46905951-d861-434f-818b-c0b30df481bc]
Arguments: [Ljava.lang.Object;@490ab905
[RMI TCP Connection(1)-67.195.81.190] INFO org.ops4j.pax.exam.invoker.junit.internal.ContainerTestRunner
- running testRollback in reactor
Configuring connection provider with pid org.apache.aries.tx.control.jpa.xa
[CM Configuration Updater (Update: pid=org.apache.aries.tx.control.jpa.xa.60212355-5384-4aeb-86fc-6b80131f145c)]
INFO com.zaxxer.hikari.HikariDataSource - HikariPool-4 - is starting.
[RMI TCP Connection(1)-67.195.81.190] INFO org.apache.aries.jpa.container.weaving.impl.JPAWeavingHook
- Adding transformer org.eclipse.persistence.internal.jpa.weaving.PersistenceWeaver
[EL Info]: 2016-08-16 12:11:13.574--ServerSession(708004592)--EclipseLink, version: Eclipse
Persistence Services - 2.6.0.v20150309-bf26070
[EL Info]: 2016-08-16 12:11:13.577--ServerSession(708004592)--/bundle://29.0:1/_test-unit_transactionType=JTA_jtaDataSource=412451603_nonJtaDataSource=362761736
login successful
12:11:13.866 [main] DEBUG o.o.pax.exam.junit.impl.ProbeRunner - Invoke testNestedTxInnerRollback:org.apache.aries.tx.control.itests.SimpleEclipseLink_2_6_0_Test.testNestedTxInnerRollback:Forked:FrameworkFactory[1]
@ [TestAddress:PaxExam-7c2faae7-efdb-493e-bf88-3dcb2eb7b136 root:PaxExam-eaa3e003-d1b3-49c8-9a37-b8694ce709fe]
Arguments: [Ljava.lang.Object;@56ac3a89
[RMI TCP Connection(1)-67.195.81.190] INFO org.ops4j.pax.exam.invoker.junit.internal.ContainerTestRunner
- running testNestedTxInnerRollback in reactor
Configuring connection provider with pid org.apache.aries.tx.control.jpa.xa
[CM Configuration Updater (Update: pid=org.apache.aries.tx.control.jpa.xa.ff5854c8-f793-4d52-b0fd-f0a94aca7994)]
INFO com.zaxxer.hikari.HikariDataSource - HikariPool-5 - is starting.
[RMI TCP Connection(1)-67.195.81.190] INFO org.apache.aries.jpa.container.weaving.impl.JPAWeavingHook
- Adding transformer org.eclipse.persistence.internal.jpa.weaving.PersistenceWeaver
[EL Info]: 2016-08-16 12:11:13.906--ServerSession(1830429845)--EclipseLink, version: Eclipse
Persistence Services - 2.6.0.v20150309-bf26070
[EL Info]: 2016-08-16 12:11:13.908--ServerSession(1830429845)--/bundle://29.0:1/_test-unit_transactionType=JTA_jtaDataSource=1230209127_nonJtaDataSource=1093760784
login successful
[Message [id=1, message=Hello World!]]
12:11:14.199 [main] DEBUG o.o.pax.exam.junit.impl.ProbeRunner - Invoke testNestedTx:org.apache.aries.tx.control.itests.SimpleEclipseLink_2_6_0_Test.testNestedTx:Forked:FrameworkFactory[1]
@ [TestAddress:PaxExam-0435555b-2088-4da7-8e0b-2f7305a3c404 root:PaxExam-bf5fc0d4-b5b2-4ce6-8379-701016685f2f]
Arguments: [Ljava.lang.Object;@27c20538
[RMI TCP Connection(1)-67.195.81.190] INFO org.ops4j.pax.exam.invoker.junit.internal.ContainerTestRunner
- running testNestedTx in reactor
Configuring connection provider with pid org.apache.aries.tx.control.jpa.xa
[CM Configuration Updater (Update: pid=org.apache.aries.tx.control.jpa.xa.2006dec5-cf0e-40a5-a563-27d2a4c54586)]
INFO com.zaxxer.hikari.HikariDataSource - HikariPool-6 - is starting.
[RMI TCP Connection(1)-67.195.81.190] INFO org.apache.aries.jpa.container.weaving.impl.JPAWeavingHook
- Adding transformer org.eclipse.persistence.internal.jpa.weaving.PersistenceWeaver
[EL Info]: 2016-08-16 12:11:14.24--ServerSession(1546282307)--EclipseLink, version: Eclipse
Persistence Services - 2.6.0.v20150309-bf26070
[EL Info]: 2016-08-16 12:11:14.243--ServerSession(1546282307)--/bundle://29.0:1/_test-unit_transactionType=JTA_jtaDataSource=367061477_nonJtaDataSource=343988046
login successful
[Message [id=2, message=Hello Nested World!], Message [id=1, message=Hello World!]]
org.ops4j.pax.logging.pax-logging-api[org.ops4j.pax.logging.internal.Activator] : Disabling
SLF4J API support.
org.ops4j.pax.logging.pax-logging-api[org.ops4j.pax.logging.internal.Activator] : Disabling
Jakarta Commons Logging API support.
org.ops4j.pax.logging.pax-logging-api[org.ops4j.pax.logging.internal.Activator] : Disabling
Log4J API support.
org.ops4j.pax.logging.pax-logging-api[org.ops4j.pax.logging.internal.Activator] : Disabling
Avalon Logger API support.
org.ops4j.pax.logging.pax-logging-api[org.ops4j.pax.logging.internal.Activator] : Disabling
JULI Logger API support.
org.apache.aries.jpa.container[org.apache.aries.jpa.container.impl.PersistenceBundleTracker]
: removing persistence units for PAXEXAM-PROBE-9a2c4db5-d371-4e74-9d23-c3a09c4bac2f null
org.apache.aries.jpa.container[org.apache.aries.jpa.container.impl.PersistenceProviderTracker]
: Lost provider for test-unit org.eclipse.persistence.jpa.PersistenceProvider
org.ops4j.pax.logging.pax-logging-api[org.ops4j.pax.logging.internal.Activator] : Disabling
SLF4J API support.
org.ops4j.pax.logging.pax-logging-api[org.ops4j.pax.logging.internal.Activator] : Disabling
Jakarta Commons Logging API support.
org.ops4j.pax.logging.pax-logging-api[org.ops4j.pax.logging.internal.Activator] : Disabling
Log4J API support.
org.ops4j.pax.logging.pax-logging-api[org.ops4j.pax.logging.internal.Activator] : Disabling
Avalon Logger API support.
org.ops4j.pax.logging.pax-logging-api[org.ops4j.pax.logging.internal.Activator] : Disabling
JULI Logger API support.
12:11:14.575 [main] DEBUG org.ops4j.exec.DefaultJavaRunner - Shutdown in progress...

12:11:14.576 [main] DEBUG org.ops4j.exec.DefaultJavaRunner - Unwrapping stream I/O.
12:11:14.576 [main] INFO  org.ops4j.exec.DefaultJavaRunner - Platform has been shutdown.
org.ops4j.pax.logging.pax-logging-api[org.ops4j.pax.logging.internal.Activator] : Disabling
SLF4J API support.
org.ops4j.pax.logging.pax-logging-api[org.ops4j.pax.logging.internal.Activator] : Disabling
Jakarta Commons Logging API support.
org.ops4j.pax.logging.pax-logging-api[org.ops4j.pax.logging.internal.Activator] : Disabling
Log4J API support.
org.ops4j.pax.logging.pax-logging-api[org.ops4j.pax.logging.internal.Activator] : Disabling
Avalon Logger API support.
org.ops4j.pax.logging.pax-logging-api[org.ops4j.pax.logging.internal.Activator] : Disabling
JULI Logger API support.
org.apache.aries.jpa.container[org.apache.aries.jpa.container.impl.PersistenceBundleTracker]
: removing persistence units for PAXEXAM-PROBE-9a2c4db5-d371-4e74-9d23-c3a09c4bac2f null
org.apache.aries.jpa.container[org.apache.aries.jpa.container.impl.PersistenceProviderTracker]
: Lost provider for test-unit org.eclipse.persistence.jpa.PersistenceProvider
org.ops4j.pax.logging.pax-logging-api[org.ops4j.pax.logging.internal.Activator] : Disabling
SLF4J API support.
org.ops4j.pax.logging.pax-logging-api[org.ops4j.pax.logging.internal.Activator] : Disabling
Jakarta Commons Logging API support.
org.ops4j.pax.logging.pax-logging-api[org.ops4j.pax.logging.internal.Activator] : Disabling
Log4J API support.
org.ops4j.pax.logging.pax-logging-api[org.ops4j.pax.logging.internal.Activator] : Disabling
Avalon Logger API support.
org.ops4j.pax.logging.pax-logging-api[org.ops4j.pax.logging.internal.Activator] : Disabling
JULI Logger API support.
12:11:14.602 [main] DEBUG org.ops4j.exec.DefaultJavaRunner - Shutdown in progress...

12:11:14.603 [main] DEBUG org.ops4j.exec.DefaultJavaRunner - Unwrapping stream I/O.
12:11:14.603 [main] INFO  org.ops4j.exec.DefaultJavaRunner - Platform has been shutdown.
12:11:14.603 [main] INFO  o.o.p.e.spi.reactors.ReactorManager - suite finished
Tests run: 14, Failures: 0, Errors: 0, Skipped: 0, Time elapsed: 10.072 sec - in org.apache.aries.tx.control.itests.SimpleEclipseLink_2_6_0_Test

Results :

Tests in error: 
  XAHibernate_5_0_9_Test.org.apache.aries.tx.control.itests.XAHibernate_5_0_9_Test ยป TestContainer

Tests run: 47, Failures: 0, Errors: 1, Skipped: 0

[INFO] ------------------------------------------------------------------------
[INFO] Reactor Summary:
[INFO] 
[INFO] tx-control ......................................... SUCCESS [  2.223 s]
[INFO] OSGi Transaction Control API ....................... SUCCESS [  3.301 s]
[INFO] OSGi Transaction Control Service - Common Code ..... SUCCESS [  1.234 s]
[INFO] OSGi Transaction Control Service - Local Transactions SUCCESS [  1.529 s]
[INFO] OSGi Transaction Control Service - XA Transactions . SUCCESS [  6.087 s]
[INFO] OSGi Transaction Control JDBC Resource Provider - Common Code SUCCESS [  1.015 s]
[INFO] OSGi Transaction Control JDBC Resource Provider - Local Transactions SUCCESS [  1.247
s]
[INFO] OSGi Transaction Control JDBC Resource Provider - XA Transactions SUCCESS [  1.271
s]
[INFO] OSGi Transaction Control JPA Resource Provider - Local Transactions SUCCESS [  1.483
s]
[INFO] OSGi Transaction Control JPA Resource Provider - XA Transactions SUCCESS [  3.909 s]
[INFO] Apache Aries Transaction Control iTests ............ SUCCESS [03:20 min]
[INFO] Apache Aries Transaction Control JPA iTests ........ FAILURE [01:07 min]
[INFO] ------------------------------------------------------------------------
[INFO] BUILD FAILURE
[INFO] ------------------------------------------------------------------------
[INFO] Total time: 04:54 min
[INFO] Finished at: 2016-08-16T12:11:15+00:00
[INFO] Final Memory: 50M/545M
[INFO] ------------------------------------------------------------------------
[ERROR] Failed to execute goal org.apache.maven.plugins:maven-surefire-plugin:2.18.1:test
(default-test) on project org.apache.aries.tx-control-jpa-itests: There are test failures.
[ERROR] 
[ERROR] Please refer to <https://builds.apache.org/job/Aries-Tx-Control-Trunk-JDK8/ws/tx-control-jpa-itests/target/surefire-reports>
for the individual test results.
[ERROR] -> [Help 1]
org.apache.maven.lifecycle.LifecycleExecutionException: Failed to execute goal org.apache.maven.plugins:maven-surefire-plugin:2.18.1:test
(default-test) on project org.apache.aries.tx-control-jpa-itests: There are test failures.

Please refer to <https://builds.apache.org/job/Aries-Tx-Control-Trunk-JDK8/ws/tx-control-jpa-itests/target/surefire-reports>
for the individual test results.
	at org.apache.maven.lifecycle.internal.MojoExecutor.execute(MojoExecutor.java:212)
	at org.apache.maven.lifecycle.internal.MojoExecutor.execute(MojoExecutor.java:153)
	at org.apache.maven.lifecycle.internal.MojoExecutor.execute(MojoExecutor.java:145)
	at org.apache.maven.lifecycle.internal.LifecycleModuleBuilder.buildProject(LifecycleModuleBuilder.java:116)
	at org.apache.maven.lifecycle.internal.LifecycleModuleBuilder.buildProject(LifecycleModuleBuilder.java:80)
	at org.apache.maven.lifecycle.internal.builder.singlethreaded.SingleThreadedBuilder.build(SingleThreadedBuilder.java:51)
	at org.apache.maven.lifecycle.internal.LifecycleStarter.execute(LifecycleStarter.java:120)
	at org.apache.maven.DefaultMaven.doExecute(DefaultMaven.java:355)
	at org.apache.maven.DefaultMaven.execute(DefaultMaven.java:155)
	at org.jvnet.hudson.maven3.launcher.Maven32Launcher.main(Maven32Launcher.java:132)
	at sun.reflect.NativeMethodAccessorImpl.invoke0(Native Method)
	at sun.reflect.NativeMethodAccessorImpl.invoke(NativeMethodAccessorImpl.java:62)
	at sun.reflect.DelegatingMethodAccessorImpl.invoke(DelegatingMethodAccessorImpl.java:43)
	at java.lang.reflect.Method.invoke(Method.java:498)
	at org.codehaus.plexus.classworlds.launcher.Launcher.launchStandard(Launcher.java:330)
	at org.codehaus.plexus.classworlds.launcher.Launcher.launch(Launcher.java:238)
	at jenkins.maven3.agent.Maven32Main.launch(Maven32Main.java:186)
	at sun.reflect.NativeMethodAccessorImpl.invoke0(Native Method)
	at sun.reflect.NativeMethodAccessorImpl.invoke(NativeMethodAccessorImpl.java:62)
	at sun.reflect.DelegatingMethodAccessorImpl.invoke(DelegatingMethodAccessorImpl.java:43)
	at java.lang.reflect.Method.invoke(Method.java:498)
	at hudson.maven.Maven3Builder.call(Maven3Builder.java:136)
	at hudson.maven.Maven3Builder.call(Maven3Builder.java:71)
	at hudson.remoting.UserRequest.perform(UserRequest.java:153)
	at hudson.remoting.UserRequest.perform(UserRequest.java:50)
	at hudson.remoting.Request$2.run(Request.java:332)
	at hudson.remoting.InterceptingExecutorService$1.call(InterceptingExecutorService.java:68)
	at java.util.concurrent.FutureTask.run(FutureTask.java:266)
	at java.util.concurrent.ThreadPoolExecutor.runWorker(ThreadPoolExecutor.java:1142)
	at java.util.concurrent.ThreadPoolExecutor$Worker.run(ThreadPoolExecutor.java:617)
	at java.lang.Thread.run(Thread.java:745)
Caused by: org.apache.maven.plugin.MojoFailureException: There are test failures.

Please refer to <https://builds.apache.org/job/Aries-Tx-Control-Trunk-JDK8/ws/tx-control-jpa-itests/target/surefire-reports>
for the individual test results.
	at org.apache.maven.plugin.surefire.SurefireHelper.reportExecution(SurefireHelper.java:82)
	at org.apache.maven.plugin.surefire.SurefirePlugin.handleSummary(SurefirePlugin.java:254)
	at org.apache.maven.plugin.surefire.AbstractSurefireMojo.executeAfterPreconditionsChecked(AbstractSurefireMojo.java:854)
	at org.apache.maven.plugin.surefire.AbstractSurefireMojo.execute(AbstractSurefireMojo.java:722)
	at org.apache.maven.plugin.DefaultBuildPluginManager.executeMojo(DefaultBuildPluginManager.java:132)
	at org.apache.maven.lifecycle.internal.MojoExecutor.execute(MojoExecutor.java:208)
	... 30 more
[ERROR] 
[ERROR] Re-run Maven using the -X switch to enable full debug logging.
[ERROR] 
[ERROR] For more information about the errors and possible solutions, please read the following
articles:
[ERROR] [Help 1] http://cwiki.apache.org/confluence/display/MAVEN/MojoFailureException
[ERROR] 
[ERROR] After correcting the problems, you can resume the build with the command
[ERROR]   mvn <goals> -rf :org.apache.aries.tx-control-jpa-itests
[JENKINS] Archiving <https://builds.apache.org/job/Aries-Tx-Control-Trunk-JDK8/ws/pom.xml>
to org.apache.aries.tx-control/tx-control/0.0.2-SNAPSHOT/tx-control-0.0.2-SNAPSHOT.pom
channel stopped

Mime
View raw message