aries-dev mailing list archives

Site index · List index
Message view « Date » · « Thread »
Top « Date » · « Thread »
From Apache Jenkins Server <jenk...@builds.apache.org>
Subject Build failed in Jenkins: Aries-Tx-Control-Trunk-JDK8 #36
Date Tue, 16 Aug 2016 16:56:20 GMT
See <https://builds.apache.org/job/Aries-Tx-Control-Trunk-JDK8/36/changes>

Changes:

[timothyjward] [tx-control] Avoid tying XA JPA resources to a single Transaction Control service

------------------------------------------
[...truncated 24619 lines...]
16:55:59.357 [Thread-7] DEBUG o.o.p.t.core.intern.RawBuilder - Copying resource org/apache/aries/tx/control/itests/SimpleEclipseLink_2_6_0_Test.class
16:55:59.357 [Thread-7] DEBUG o.o.p.t.core.intern.RawBuilder - Copying resource org/apache/aries/tx/control/itests/AbstractSimpleTransactionTest.class
16:55:59.360 [main] DEBUG o.ops4j.store.intern.TemporaryStore - Exit store(): 9389249a3d96f16d75fe3ac90dbeb4bb15b87d3b
16:55:59.368 [main] DEBUG o.o.pax.exam.junit.impl.ProbeRunner - Invoke testNestedTxOuterRollback:org.apache.aries.tx.control.itests.SimpleEclipseLink_2_6_0_Test.testNestedTxOuterRollback:Forked:FrameworkFactory[0]
@ [TestAddress:PaxExam-a67e2daa-b2dd-4786-b183-3d355d7e34a5 root:PaxExam-daa8b286-e782-4506-b56d-d2fe772a753b]
Arguments: [Ljava.lang.Object;@3f49dace
[RMI TCP Connection(1)-67.195.81.190] INFO org.ops4j.pax.exam.invoker.junit.internal.ContainerTestRunner
- running testNestedTxOuterRollback in reactor
Configuring connection provider with pid org.apache.aries.tx.control.jpa.local
[CM Configuration Updater (Update: pid=org.apache.aries.tx.control.jpa.local.33c9c27d-9aab-4faf-ab52-b5247722d3dc)]
INFO com.zaxxer.hikari.HikariDataSource - HikariPool-0 - is starting.
[CM Configuration Updater (Update: pid=org.apache.aries.tx.control.jpa.local.33c9c27d-9aab-4faf-ab52-b5247722d3dc)]
INFO org.apache.aries.jpa.container.weaving.impl.JPAWeavingHook - Adding transformer org.eclipse.persistence.internal.jpa.weaving.PersistenceWeaver
[EL Info]: 2016-08-16 16:55:59.782--ServerSession(849851062)--EclipseLink, version: Eclipse
Persistence Services - 2.6.0.v20150309-bf26070
[EL Info]: 2016-08-16 16:55:59.787--ServerSession(849851062)--/bundle://29.0:1/_test-unit_transactionType=RESOURCE_LOCAL_nonJtaDataSource=903162695
login successful
[Message [id=2, message=Hello Nested World!]]
16:56:00.246 [main] DEBUG o.o.pax.exam.junit.impl.ProbeRunner - Invoke reassignTxControl:org.apache.aries.tx.control.itests.SimpleEclipseLink_2_6_0_Test.reassignTxControl:Forked:FrameworkFactory[0]
@ [TestAddress:PaxExam-05905abe-3d20-4c89-99c7-303497e79321 root:PaxExam-6777739e-0d24-4e5c-87a9-efb919608836]
Arguments: [Ljava.lang.Object;@56ac3a89
[RMI TCP Connection(1)-67.195.81.190] INFO org.ops4j.pax.exam.invoker.junit.internal.ContainerTestRunner
- running reassignTxControl in reactor
Configuring connection provider with pid org.apache.aries.tx.control.jpa.local
[CM Configuration Updater (Update: pid=org.apache.aries.tx.control.jpa.local.9231ef38-3dcd-438a-96c9-6d5e758cc8cd)]
INFO com.zaxxer.hikari.HikariDataSource - HikariPool-1 - is starting.
[CM Configuration Updater (Update: pid=org.apache.aries.tx.control.jpa.local.9231ef38-3dcd-438a-96c9-6d5e758cc8cd)]
INFO org.apache.aries.jpa.container.weaving.impl.JPAWeavingHook - Adding transformer org.eclipse.persistence.internal.jpa.weaving.PersistenceWeaver
[EL Info]: 2016-08-16 16:56:00.298--ServerSession(438628015)--EclipseLink, version: Eclipse
Persistence Services - 2.6.0.v20150309-bf26070
[EL Info]: 2016-08-16 16:56:00.301--ServerSession(438628015)--/bundle://29.0:1/_test-unit_transactionType=RESOURCE_LOCAL_nonJtaDataSource=701654578
login successful
16:56:00.616 [main] DEBUG o.o.pax.exam.junit.impl.ProbeRunner - Invoke testTx:org.apache.aries.tx.control.itests.SimpleEclipseLink_2_6_0_Test.testTx:Forked:FrameworkFactory[0]
@ [TestAddress:PaxExam-9539b020-35a3-40b5-a98a-b66dcc7be3de root:PaxExam-e92a030c-359c-49de-9cd1-aa664bd8a48b]
Arguments: [Ljava.lang.Object;@27c20538
[RMI TCP Connection(1)-67.195.81.190] INFO org.ops4j.pax.exam.invoker.junit.internal.ContainerTestRunner
- running testTx in reactor
Configuring connection provider with pid org.apache.aries.tx.control.jpa.local
[CM Configuration Updater (Update: pid=org.apache.aries.tx.control.jpa.local.00f9e45f-90e7-4573-b201-c7dcd69a228c)]
INFO com.zaxxer.hikari.HikariDataSource - HikariPool-2 - is starting.
[CM Configuration Updater (Update: pid=org.apache.aries.tx.control.jpa.local.00f9e45f-90e7-4573-b201-c7dcd69a228c)]
INFO org.apache.aries.jpa.container.weaving.impl.JPAWeavingHook - Adding transformer org.eclipse.persistence.internal.jpa.weaving.PersistenceWeaver
[EL Info]: 2016-08-16 16:56:00.662--ServerSession(1509909529)--EclipseLink, version: Eclipse
Persistence Services - 2.6.0.v20150309-bf26070
[EL Info]: 2016-08-16 16:56:00.664--ServerSession(1509909529)--/bundle://29.0:1/_test-unit_transactionType=RESOURCE_LOCAL_nonJtaDataSource=2099605315
login successful
16:56:00.967 [main] DEBUG o.o.pax.exam.junit.impl.ProbeRunner - Invoke testRequiredInheritsTx:org.apache.aries.tx.control.itests.SimpleEclipseLink_2_6_0_Test.testRequiredInheritsTx:Forked:FrameworkFactory[0]
@ [TestAddress:PaxExam-949b3148-8f74-40c5-88d7-537fb3f61990 root:PaxExam-eafe7c43-fc72-4c49-ac62-faa368d4607b]
Arguments: [Ljava.lang.Object;@72d818d1
[RMI TCP Connection(1)-67.195.81.190] INFO org.ops4j.pax.exam.invoker.junit.internal.ContainerTestRunner
- running testRequiredInheritsTx in reactor
Configuring connection provider with pid org.apache.aries.tx.control.jpa.local
[CM Configuration Updater (Update: pid=org.apache.aries.tx.control.jpa.local.da858e87-d9b9-4840-9398-d105a20f3ddd)]
INFO com.zaxxer.hikari.HikariDataSource - HikariPool-3 - is starting.
[CM Configuration Updater (Update: pid=org.apache.aries.tx.control.jpa.local.da858e87-d9b9-4840-9398-d105a20f3ddd)]
INFO org.apache.aries.jpa.container.weaving.impl.JPAWeavingHook - Adding transformer org.eclipse.persistence.internal.jpa.weaving.PersistenceWeaver
[EL Info]: 2016-08-16 16:56:01.007--ServerSession(665381742)--EclipseLink, version: Eclipse
Persistence Services - 2.6.0.v20150309-bf26070
[EL Info]: 2016-08-16 16:56:01.009--ServerSession(665381742)--/bundle://29.0:1/_test-unit_transactionType=RESOURCE_LOCAL_nonJtaDataSource=771979914
login successful
[Message [id=2, message=Hello Nested World!], Message [id=1, message=Hello World!]]
16:56:01.307 [main] DEBUG o.o.pax.exam.junit.impl.ProbeRunner - Invoke testSuspendedTx:org.apache.aries.tx.control.itests.SimpleEclipseLink_2_6_0_Test.testSuspendedTx:Forked:FrameworkFactory[0]
@ [TestAddress:PaxExam-5d3920ed-2667-43be-9d09-392b895c8a0a root:PaxExam-bb6c865a-e167-4216-91a7-7f15e7e1563d]
Arguments: [Ljava.lang.Object;@6e06451e
[RMI TCP Connection(1)-67.195.81.190] INFO org.ops4j.pax.exam.invoker.junit.internal.ContainerTestRunner
- running testSuspendedTx in reactor
Configuring connection provider with pid org.apache.aries.tx.control.jpa.local
[CM Configuration Updater (Update: pid=org.apache.aries.tx.control.jpa.local.abf5502a-891c-4a39-8b25-4c7111d780da)]
INFO com.zaxxer.hikari.HikariDataSource - HikariPool-4 - is starting.
[CM Configuration Updater (Update: pid=org.apache.aries.tx.control.jpa.local.abf5502a-891c-4a39-8b25-4c7111d780da)]
INFO org.apache.aries.jpa.container.weaving.impl.JPAWeavingHook - Adding transformer org.eclipse.persistence.internal.jpa.weaving.PersistenceWeaver
[EL Info]: 2016-08-16 16:56:01.343--ServerSession(466509095)--EclipseLink, version: Eclipse
Persistence Services - 2.6.0.v20150309-bf26070
[EL Info]: 2016-08-16 16:56:01.346--ServerSession(466509095)--/bundle://29.0:1/_test-unit_transactionType=RESOURCE_LOCAL_nonJtaDataSource=327679566
login successful
16:56:01.646 [main] DEBUG o.o.pax.exam.junit.impl.ProbeRunner - Invoke testRollback:org.apache.aries.tx.control.itests.SimpleEclipseLink_2_6_0_Test.testRollback:Forked:FrameworkFactory[0]
@ [TestAddress:PaxExam-f52ed5f6-ccc7-49ab-b934-da95bd7fbf27 root:PaxExam-9cd744c6-89b0-41df-8fcf-437cfd1da673]
Arguments: [Ljava.lang.Object;@59494225
[RMI TCP Connection(1)-67.195.81.190] INFO org.ops4j.pax.exam.invoker.junit.internal.ContainerTestRunner
- running testRollback in reactor
Configuring connection provider with pid org.apache.aries.tx.control.jpa.local
[CM Configuration Updater (Update: pid=org.apache.aries.tx.control.jpa.local.c6f572be-e47d-44c0-8583-4d626964d571)]
INFO com.zaxxer.hikari.HikariDataSource - HikariPool-5 - is starting.
[CM Configuration Updater (Update: pid=org.apache.aries.tx.control.jpa.local.c6f572be-e47d-44c0-8583-4d626964d571)]
INFO org.apache.aries.jpa.container.weaving.impl.JPAWeavingHook - Adding transformer org.eclipse.persistence.internal.jpa.weaving.PersistenceWeaver
[EL Info]: 2016-08-16 16:56:01.684--ServerSession(520902723)--EclipseLink, version: Eclipse
Persistence Services - 2.6.0.v20150309-bf26070
[EL Info]: 2016-08-16 16:56:01.687--ServerSession(520902723)--/bundle://29.0:1/_test-unit_transactionType=RESOURCE_LOCAL_nonJtaDataSource=2071362620
login successful
16:56:01.975 [main] DEBUG o.o.pax.exam.junit.impl.ProbeRunner - Invoke testNestedTxInnerRollback:org.apache.aries.tx.control.itests.SimpleEclipseLink_2_6_0_Test.testNestedTxInnerRollback:Forked:FrameworkFactory[0]
@ [TestAddress:PaxExam-d50f1fb8-02dc-4824-8a45-cb4dd5eb9e2e root:PaxExam-f4f821e8-6e6c-4a7f-8648-39e32dea5477]
Arguments: [Ljava.lang.Object;@6e1567f1
[RMI TCP Connection(1)-67.195.81.190] INFO org.ops4j.pax.exam.invoker.junit.internal.ContainerTestRunner
- running testNestedTxInnerRollback in reactor
Configuring connection provider with pid org.apache.aries.tx.control.jpa.local
[CM Configuration Updater (Update: pid=org.apache.aries.tx.control.jpa.local.8b3be451-ad16-4e52-83ab-8dd07ae17da2)]
INFO com.zaxxer.hikari.HikariDataSource - HikariPool-6 - is starting.
[CM Configuration Updater (Update: pid=org.apache.aries.tx.control.jpa.local.8b3be451-ad16-4e52-83ab-8dd07ae17da2)]
INFO org.apache.aries.jpa.container.weaving.impl.JPAWeavingHook - Adding transformer org.eclipse.persistence.internal.jpa.weaving.PersistenceWeaver
[EL Info]: 2016-08-16 16:56:02.014--ServerSession(2079276223)--EclipseLink, version: Eclipse
Persistence Services - 2.6.0.v20150309-bf26070
[EL Info]: 2016-08-16 16:56:02.016--ServerSession(2079276223)--/bundle://29.0:1/_test-unit_transactionType=RESOURCE_LOCAL_nonJtaDataSource=84826158
login successful
[Message [id=1, message=Hello World!]]
16:56:02.302 [main] DEBUG o.o.pax.exam.junit.impl.ProbeRunner - Invoke testNestedTx:org.apache.aries.tx.control.itests.SimpleEclipseLink_2_6_0_Test.testNestedTx:Forked:FrameworkFactory[0]
@ [TestAddress:PaxExam-cb2f0cc3-2aec-44bb-877d-85f66df4b867 root:PaxExam-8815604d-d4e0-4633-b5b0-5b64add2d861]
Arguments: [Ljava.lang.Object;@5cb9f472
[RMI TCP Connection(1)-67.195.81.190] INFO org.ops4j.pax.exam.invoker.junit.internal.ContainerTestRunner
- running testNestedTx in reactor
Configuring connection provider with pid org.apache.aries.tx.control.jpa.local
[CM Configuration Updater (Update: pid=org.apache.aries.tx.control.jpa.local.c984144f-f7d9-43fd-a87a-98053a83df4d)]
INFO com.zaxxer.hikari.HikariDataSource - HikariPool-7 - is starting.
[CM Configuration Updater (Update: pid=org.apache.aries.tx.control.jpa.local.c984144f-f7d9-43fd-a87a-98053a83df4d)]
INFO org.apache.aries.jpa.container.weaving.impl.JPAWeavingHook - Adding transformer org.eclipse.persistence.internal.jpa.weaving.PersistenceWeaver
[EL Info]: 2016-08-16 16:56:02.338--ServerSession(181369163)--EclipseLink, version: Eclipse
Persistence Services - 2.6.0.v20150309-bf26070
[EL Info]: 2016-08-16 16:56:02.339--ServerSession(181369163)--/bundle://29.0:1/_test-unit_transactionType=RESOURCE_LOCAL_nonJtaDataSource=2061482989
login successful
[Message [id=2, message=Hello Nested World!], Message [id=1, message=Hello World!]]
16:56:02.627 [main] DEBUG o.o.pax.exam.junit.impl.ProbeRunner - Invoke testNestedTxOuterRollback:org.apache.aries.tx.control.itests.SimpleEclipseLink_2_6_0_Test.testNestedTxOuterRollback:Forked:FrameworkFactory[1]
@ [TestAddress:PaxExam-37f57ff3-4efe-4bfd-b2fa-5212076c9731 root:PaxExam-daa8b286-e782-4506-b56d-d2fe772a753b]
Arguments: [Ljava.lang.Object;@3f49dace
[RMI TCP Connection(1)-67.195.81.190] INFO org.ops4j.pax.exam.invoker.junit.internal.ContainerTestRunner
- running testNestedTxOuterRollback in reactor
Configuring connection provider with pid org.apache.aries.tx.control.jpa.xa
[CM Configuration Updater (Update: pid=org.apache.aries.tx.control.jpa.xa.43a573ed-948b-4931-883b-1fc313b625ee)]
INFO com.zaxxer.hikari.HikariDataSource - HikariPool-0 - is starting.
[RMI TCP Connection(1)-67.195.81.190] INFO org.apache.aries.jpa.container.weaving.impl.JPAWeavingHook
- Adding transformer org.eclipse.persistence.internal.jpa.weaving.PersistenceWeaver
[EL Info]: 2016-08-16 16:56:03.438--ServerSession(2007596398)--EclipseLink, version: Eclipse
Persistence Services - 2.6.0.v20150309-bf26070
[EL Info]: 2016-08-16 16:56:03.447--ServerSession(2007596398)--/bundle://29.0:1/_test-unit_transactionType=JTA_jtaDataSource=1234643072_nonJtaDataSource=701137
login successful
[Message [id=2, message=Hello Nested World!]]
16:56:03.901 [main] DEBUG o.o.pax.exam.junit.impl.ProbeRunner - Invoke reassignTxControl:org.apache.aries.tx.control.itests.SimpleEclipseLink_2_6_0_Test.reassignTxControl:Forked:FrameworkFactory[1]
@ [TestAddress:PaxExam-3b5a48cf-ad33-4f84-9329-18ad4cfad27c root:PaxExam-6777739e-0d24-4e5c-87a9-efb919608836]
Arguments: [Ljava.lang.Object;@56ac3a89
[RMI TCP Connection(1)-67.195.81.190] INFO org.ops4j.pax.exam.invoker.junit.internal.ContainerTestRunner
- running reassignTxControl in reactor
Configuring connection provider with pid org.apache.aries.tx.control.jpa.xa
[CM Configuration Updater (Update: pid=org.apache.aries.tx.control.jpa.xa.b6fb5663-cf56-4d95-bd00-fa6d227b55c6)]
INFO com.zaxxer.hikari.HikariDataSource - HikariPool-1 - is starting.
[RMI TCP Connection(1)-67.195.81.190] INFO org.apache.aries.jpa.container.weaving.impl.JPAWeavingHook
- Adding transformer org.eclipse.persistence.internal.jpa.weaving.PersistenceWeaver
[EL Info]: 2016-08-16 16:56:03.954--ServerSession(391411582)--EclipseLink, version: Eclipse
Persistence Services - 2.6.0.v20150309-bf26070
[EL Info]: 2016-08-16 16:56:03.96--ServerSession(391411582)--/bundle://29.0:1/_test-unit_transactionType=JTA_jtaDataSource=1333423944_nonJtaDataSource=395247433
login successful
[CM Configuration Updater (ManagedServiceFactory Update: factoryPid=[org.apache.aries.tx.control.jpa.xa])]
INFO com.zaxxer.hikari.HikariDataSource - HikariPool-2 - is starting.
[RMI TCP Connection(1)-67.195.81.190] INFO org.apache.aries.jpa.container.weaving.impl.JPAWeavingHook
- Adding transformer org.eclipse.persistence.internal.jpa.weaving.PersistenceWeaver
[EL Info]: 2016-08-16 16:56:04.0--ServerSession(1735798372)--EclipseLink, version: Eclipse
Persistence Services - 2.6.0.v20150309-bf26070
[EL Info]: 2016-08-16 16:56:04.002--ServerSession(1735798372)--/bundle://29.0:1/_test-unit_transactionType=JTA_jtaDataSource=1952498426_nonJtaDataSource=1932150105
login successful
16:56:04.330 [main] DEBUG o.o.pax.exam.junit.impl.ProbeRunner - Invoke testTx:org.apache.aries.tx.control.itests.SimpleEclipseLink_2_6_0_Test.testTx:Forked:FrameworkFactory[1]
@ [TestAddress:PaxExam-f86a0b40-5dec-447e-8a20-5d2092380285 root:PaxExam-e92a030c-359c-49de-9cd1-aa664bd8a48b]
Arguments: [Ljava.lang.Object;@27c20538
[RMI TCP Connection(1)-67.195.81.190] INFO org.ops4j.pax.exam.invoker.junit.internal.ContainerTestRunner
- running testTx in reactor
Configuring connection provider with pid org.apache.aries.tx.control.jpa.xa
[CM Configuration Updater (Update: pid=org.apache.aries.tx.control.jpa.xa.4938b8bd-61ac-4e49-b3a2-ecd77b5f87b9)]
INFO com.zaxxer.hikari.HikariDataSource - HikariPool-3 - is starting.
[RMI TCP Connection(1)-67.195.81.190] INFO org.apache.aries.jpa.container.weaving.impl.JPAWeavingHook
- Adding transformer org.eclipse.persistence.internal.jpa.weaving.PersistenceWeaver
[EL Info]: 2016-08-16 16:56:04.38--ServerSession(1498949078)--EclipseLink, version: Eclipse
Persistence Services - 2.6.0.v20150309-bf26070
[EL Info]: 2016-08-16 16:56:04.382--ServerSession(1498949078)--/bundle://29.0:1/_test-unit_transactionType=JTA_jtaDataSource=697432875_nonJtaDataSource=1457040044
login successful
16:56:04.683 [main] DEBUG o.o.pax.exam.junit.impl.ProbeRunner - Invoke testRequiredInheritsTx:org.apache.aries.tx.control.itests.SimpleEclipseLink_2_6_0_Test.testRequiredInheritsTx:Forked:FrameworkFactory[1]
@ [TestAddress:PaxExam-e16d8202-5ee1-430d-951e-37daea52e272 root:PaxExam-eafe7c43-fc72-4c49-ac62-faa368d4607b]
Arguments: [Ljava.lang.Object;@72d818d1
[RMI TCP Connection(1)-67.195.81.190] INFO org.ops4j.pax.exam.invoker.junit.internal.ContainerTestRunner
- running testRequiredInheritsTx in reactor
Configuring connection provider with pid org.apache.aries.tx.control.jpa.xa
[CM Configuration Updater (Update: pid=org.apache.aries.tx.control.jpa.xa.75d1edbe-5dbe-419d-b82a-7bbc72d0b537)]
INFO com.zaxxer.hikari.HikariDataSource - HikariPool-4 - is starting.
[RMI TCP Connection(1)-67.195.81.190] INFO org.apache.aries.jpa.container.weaving.impl.JPAWeavingHook
- Adding transformer org.eclipse.persistence.internal.jpa.weaving.PersistenceWeaver
[EL Info]: 2016-08-16 16:56:04.725--ServerSession(1569503796)--EclipseLink, version: Eclipse
Persistence Services - 2.6.0.v20150309-bf26070
[EL Info]: 2016-08-16 16:56:04.728--ServerSession(1569503796)--/bundle://29.0:1/_test-unit_transactionType=JTA_jtaDataSource=15689101_nonJtaDataSource=1972454230
login successful
[Message [id=2, message=Hello Nested World!], Message [id=1, message=Hello World!]]
16:56:05.022 [main] DEBUG o.o.pax.exam.junit.impl.ProbeRunner - Invoke testSuspendedTx:org.apache.aries.tx.control.itests.SimpleEclipseLink_2_6_0_Test.testSuspendedTx:Forked:FrameworkFactory[1]
@ [TestAddress:PaxExam-79586547-9268-47ac-b01d-8982e180b192 root:PaxExam-bb6c865a-e167-4216-91a7-7f15e7e1563d]
Arguments: [Ljava.lang.Object;@6e06451e
[RMI TCP Connection(1)-67.195.81.190] INFO org.ops4j.pax.exam.invoker.junit.internal.ContainerTestRunner
- running testSuspendedTx in reactor
Configuring connection provider with pid org.apache.aries.tx.control.jpa.xa
[CM Configuration Updater (Update: pid=org.apache.aries.tx.control.jpa.xa.3905a44d-1dec-4da0-b2cc-ff7453c3b1ed)]
INFO com.zaxxer.hikari.HikariDataSource - HikariPool-5 - is starting.
[RMI TCP Connection(1)-67.195.81.190] INFO org.apache.aries.jpa.container.weaving.impl.JPAWeavingHook
- Adding transformer org.eclipse.persistence.internal.jpa.weaving.PersistenceWeaver
[EL Info]: 2016-08-16 16:56:05.063--ServerSession(1182217561)--EclipseLink, version: Eclipse
Persistence Services - 2.6.0.v20150309-bf26070
[EL Info]: 2016-08-16 16:56:05.065--ServerSession(1182217561)--/bundle://29.0:1/_test-unit_transactionType=JTA_jtaDataSource=1077787852_nonJtaDataSource=680377210
login successful
16:56:05.367 [main] DEBUG o.o.pax.exam.junit.impl.ProbeRunner - Invoke testRollback:org.apache.aries.tx.control.itests.SimpleEclipseLink_2_6_0_Test.testRollback:Forked:FrameworkFactory[1]
@ [TestAddress:PaxExam-4bf39382-fe6d-42ec-a9eb-54b910fa192d root:PaxExam-9cd744c6-89b0-41df-8fcf-437cfd1da673]
Arguments: [Ljava.lang.Object;@59494225
[RMI TCP Connection(1)-67.195.81.190] INFO org.ops4j.pax.exam.invoker.junit.internal.ContainerTestRunner
- running testRollback in reactor
Configuring connection provider with pid org.apache.aries.tx.control.jpa.xa
[CM Configuration Updater (Update: pid=org.apache.aries.tx.control.jpa.xa.332dad3f-1be3-46ff-b94a-8db89673c9ae)]
INFO com.zaxxer.hikari.HikariDataSource - HikariPool-6 - is starting.
[RMI TCP Connection(1)-67.195.81.190] INFO org.apache.aries.jpa.container.weaving.impl.JPAWeavingHook
- Adding transformer org.eclipse.persistence.internal.jpa.weaving.PersistenceWeaver
[EL Info]: 2016-08-16 16:56:05.407--ServerSession(273934793)--EclipseLink, version: Eclipse
Persistence Services - 2.6.0.v20150309-bf26070
[EL Info]: 2016-08-16 16:56:05.41--ServerSession(273934793)--/bundle://29.0:1/_test-unit_transactionType=JTA_jtaDataSource=1929889258_nonJtaDataSource=96443289
login successful
16:56:05.700 [main] DEBUG o.o.pax.exam.junit.impl.ProbeRunner - Invoke testNestedTxInnerRollback:org.apache.aries.tx.control.itests.SimpleEclipseLink_2_6_0_Test.testNestedTxInnerRollback:Forked:FrameworkFactory[1]
@ [TestAddress:PaxExam-3f5796fa-0e1e-43a7-ae14-1db41e629de0 root:PaxExam-f4f821e8-6e6c-4a7f-8648-39e32dea5477]
Arguments: [Ljava.lang.Object;@6e1567f1
[RMI TCP Connection(1)-67.195.81.190] INFO org.ops4j.pax.exam.invoker.junit.internal.ContainerTestRunner
- running testNestedTxInnerRollback in reactor
Configuring connection provider with pid org.apache.aries.tx.control.jpa.xa
[CM Configuration Updater (Update: pid=org.apache.aries.tx.control.jpa.xa.c476f1b9-39d8-4c58-acb6-f15ebddeac7a)]
INFO com.zaxxer.hikari.HikariDataSource - HikariPool-7 - is starting.
[RMI TCP Connection(1)-67.195.81.190] INFO org.apache.aries.jpa.container.weaving.impl.JPAWeavingHook
- Adding transformer org.eclipse.persistence.internal.jpa.weaving.PersistenceWeaver
[EL Info]: 2016-08-16 16:56:05.741--ServerSession(663586316)--EclipseLink, version: Eclipse
Persistence Services - 2.6.0.v20150309-bf26070
[EL Info]: 2016-08-16 16:56:05.743--ServerSession(663586316)--/bundle://29.0:1/_test-unit_transactionType=JTA_jtaDataSource=349566598_nonJtaDataSource=1997550027
login successful
[Message [id=1, message=Hello World!]]
16:56:06.035 [main] DEBUG o.o.pax.exam.junit.impl.ProbeRunner - Invoke testNestedTx:org.apache.aries.tx.control.itests.SimpleEclipseLink_2_6_0_Test.testNestedTx:Forked:FrameworkFactory[1]
@ [TestAddress:PaxExam-68e3a136-854a-46c5-9b60-1856349b21de root:PaxExam-8815604d-d4e0-4633-b5b0-5b64add2d861]
Arguments: [Ljava.lang.Object;@5cb9f472
[RMI TCP Connection(1)-67.195.81.190] INFO org.ops4j.pax.exam.invoker.junit.internal.ContainerTestRunner
- running testNestedTx in reactor
Configuring connection provider with pid org.apache.aries.tx.control.jpa.xa
[CM Configuration Updater (Update: pid=org.apache.aries.tx.control.jpa.xa.0ff889e6-59c8-47d3-b319-43b5dbd2d41b)]
INFO com.zaxxer.hikari.HikariDataSource - HikariPool-8 - is starting.
[RMI TCP Connection(1)-67.195.81.190] INFO org.apache.aries.jpa.container.weaving.impl.JPAWeavingHook
- Adding transformer org.eclipse.persistence.internal.jpa.weaving.PersistenceWeaver
[EL Info]: 2016-08-16 16:56:06.074--ServerSession(449598803)--EclipseLink, version: Eclipse
Persistence Services - 2.6.0.v20150309-bf26070
[EL Info]: 2016-08-16 16:56:06.076--ServerSession(449598803)--/bundle://29.0:1/_test-unit_transactionType=JTA_jtaDataSource=1790086488_nonJtaDataSource=1447682719
login successful
[Message [id=2, message=Hello Nested World!], Message [id=1, message=Hello World!]]
org.ops4j.pax.logging.pax-logging-api[org.ops4j.pax.logging.internal.Activator] : Disabling
SLF4J API support.
org.ops4j.pax.logging.pax-logging-api[org.ops4j.pax.logging.internal.Activator] : Disabling
Jakarta Commons Logging API support.
org.ops4j.pax.logging.pax-logging-api[org.ops4j.pax.logging.internal.Activator] : Disabling
Log4J API support.
org.ops4j.pax.logging.pax-logging-api[org.ops4j.pax.logging.internal.Activator] : Disabling
Avalon Logger API support.
org.ops4j.pax.logging.pax-logging-api[org.ops4j.pax.logging.internal.Activator] : Disabling
JULI Logger API support.
org.apache.aries.jpa.container[org.apache.aries.jpa.container.impl.PersistenceBundleTracker]
: removing persistence units for PAXEXAM-PROBE-d486e44a-6127-4928-9c74-27da0c3e0dcc null
org.apache.aries.jpa.container[org.apache.aries.jpa.container.impl.PersistenceProviderTracker]
: Lost provider for test-unit org.eclipse.persistence.jpa.PersistenceProvider
org.ops4j.pax.logging.pax-logging-api[org.ops4j.pax.logging.internal.Activator] : Disabling
SLF4J API support.
org.ops4j.pax.logging.pax-logging-api[org.ops4j.pax.logging.internal.Activator] : Disabling
Jakarta Commons Logging API support.
org.ops4j.pax.logging.pax-logging-api[org.ops4j.pax.logging.internal.Activator] : Disabling
Log4J API support.
org.ops4j.pax.logging.pax-logging-api[org.ops4j.pax.logging.internal.Activator] : Disabling
Avalon Logger API support.
org.ops4j.pax.logging.pax-logging-api[org.ops4j.pax.logging.internal.Activator] : Disabling
JULI Logger API support.
16:56:06.408 [main] DEBUG org.ops4j.exec.DefaultJavaRunner - Shutdown in progress...

16:56:06.408 [main] DEBUG org.ops4j.exec.DefaultJavaRunner - Unwrapping stream I/O.
16:56:06.408 [main] INFO  org.ops4j.exec.DefaultJavaRunner - Platform has been shutdown.
org.ops4j.pax.logging.pax-logging-api[org.ops4j.pax.logging.internal.Activator] : Disabling
SLF4J API support.
org.ops4j.pax.logging.pax-logging-api[org.ops4j.pax.logging.internal.Activator] : Disabling
Jakarta Commons Logging API support.
org.ops4j.pax.logging.pax-logging-api[org.ops4j.pax.logging.internal.Activator] : Disabling
Log4J API support.
org.ops4j.pax.logging.pax-logging-api[org.ops4j.pax.logging.internal.Activator] : Disabling
Avalon Logger API support.
org.ops4j.pax.logging.pax-logging-api[org.ops4j.pax.logging.internal.Activator] : Disabling
JULI Logger API support.
org.apache.aries.jpa.container[org.apache.aries.jpa.container.impl.PersistenceBundleTracker]
: removing persistence units for PAXEXAM-PROBE-d486e44a-6127-4928-9c74-27da0c3e0dcc null
org.apache.aries.jpa.container[org.apache.aries.jpa.container.impl.PersistenceProviderTracker]
: Lost provider for test-unit org.eclipse.persistence.jpa.PersistenceProvider
org.ops4j.pax.logging.pax-logging-api[org.ops4j.pax.logging.internal.Activator] : Disabling
SLF4J API support.
org.ops4j.pax.logging.pax-logging-api[org.ops4j.pax.logging.internal.Activator] : Disabling
Jakarta Commons Logging API support.
org.ops4j.pax.logging.pax-logging-api[org.ops4j.pax.logging.internal.Activator] : Disabling
Log4J API support.
org.ops4j.pax.logging.pax-logging-api[org.ops4j.pax.logging.internal.Activator] : Disabling
Avalon Logger API support.
org.ops4j.pax.logging.pax-logging-api[org.ops4j.pax.logging.internal.Activator] : Disabling
JULI Logger API support.
16:56:06.436 [main] DEBUG org.ops4j.exec.DefaultJavaRunner - Shutdown in progress...

16:56:06.437 [main] DEBUG org.ops4j.exec.DefaultJavaRunner - Unwrapping stream I/O.
16:56:06.438 [main] INFO  org.ops4j.exec.DefaultJavaRunner - Platform has been shutdown.
16:56:06.438 [main] INFO  o.o.p.e.spi.reactors.ReactorManager - suite finished
Tests run: 16, Failures: 0, Errors: 0, Skipped: 0, Time elapsed: 11.24 sec - in org.apache.aries.tx.control.itests.SimpleEclipseLink_2_6_0_Test

Results :

Tests in error: 
  XAHibernate_5_0_9_Test.org.apache.aries.tx.control.itests.XAHibernate_5_0_9_Test ยป TestContainer

Tests run: 53, Failures: 0, Errors: 1, Skipped: 0

[INFO] ------------------------------------------------------------------------
[INFO] Reactor Summary:
[INFO] 
[INFO] tx-control ......................................... SUCCESS [  2.722 s]
[INFO] OSGi Transaction Control API ....................... SUCCESS [  1.505 s]
[INFO] OSGi Transaction Control Service - Common Code ..... SUCCESS [  1.218 s]
[INFO] OSGi Transaction Control Service - Local Transactions SUCCESS [  1.370 s]
[INFO] OSGi Transaction Control Service - XA Transactions . SUCCESS [  5.080 s]
[INFO] OSGi Transaction Control JDBC Resource Provider - Common Code SUCCESS [  0.824 s]
[INFO] OSGi Transaction Control JDBC Resource Provider - Local Transactions SUCCESS [  1.401
s]
[INFO] OSGi Transaction Control JDBC Resource Provider - XA Transactions SUCCESS [  1.208
s]
[INFO] OSGi Transaction Control JPA Resource Provider - Local Transactions SUCCESS [  1.453
s]
[INFO] OSGi Transaction Control JPA Resource Provider - XA Transactions SUCCESS [  1.970 s]
[INFO] Apache Aries Transaction Control iTests ............ SUCCESS [03:19 min]
[INFO] Apache Aries Transaction Control JPA iTests ........ FAILURE [01:11 min]
[INFO] ------------------------------------------------------------------------
[INFO] BUILD FAILURE
[INFO] ------------------------------------------------------------------------
[INFO] Total time: 04:59 min
[INFO] Finished at: 2016-08-16T16:56:15+00:00
[INFO] Final Memory: 46M/521M
[INFO] ------------------------------------------------------------------------
[ERROR] Failed to execute goal org.apache.maven.plugins:maven-surefire-plugin:2.18.1:test
(default-test) on project org.apache.aries.tx-control-jpa-itests: There are test failures.
[ERROR] 
[ERROR] Please refer to <https://builds.apache.org/job/Aries-Tx-Control-Trunk-JDK8/ws/tx-control-jpa-itests/target/surefire-reports>
for the individual test results.
[ERROR] -> [Help 1]
org.apache.maven.lifecycle.LifecycleExecutionException: Failed to execute goal org.apache.maven.plugins:maven-surefire-plugin:2.18.1:test
(default-test) on project org.apache.aries.tx-control-jpa-itests: There are test failures.

Please refer to <https://builds.apache.org/job/Aries-Tx-Control-Trunk-JDK8/ws/tx-control-jpa-itests/target/surefire-reports>
for the individual test results.
	at org.apache.maven.lifecycle.internal.MojoExecutor.execute(MojoExecutor.java:212)
	at org.apache.maven.lifecycle.internal.MojoExecutor.execute(MojoExecutor.java:153)
	at org.apache.maven.lifecycle.internal.MojoExecutor.execute(MojoExecutor.java:145)
	at org.apache.maven.lifecycle.internal.LifecycleModuleBuilder.buildProject(LifecycleModuleBuilder.java:116)
	at org.apache.maven.lifecycle.internal.LifecycleModuleBuilder.buildProject(LifecycleModuleBuilder.java:80)
	at org.apache.maven.lifecycle.internal.builder.singlethreaded.SingleThreadedBuilder.build(SingleThreadedBuilder.java:51)
	at org.apache.maven.lifecycle.internal.LifecycleStarter.execute(LifecycleStarter.java:120)
	at org.apache.maven.DefaultMaven.doExecute(DefaultMaven.java:355)
	at org.apache.maven.DefaultMaven.execute(DefaultMaven.java:155)
	at org.jvnet.hudson.maven3.launcher.Maven32Launcher.main(Maven32Launcher.java:132)
	at sun.reflect.NativeMethodAccessorImpl.invoke0(Native Method)
	at sun.reflect.NativeMethodAccessorImpl.invoke(NativeMethodAccessorImpl.java:62)
	at sun.reflect.DelegatingMethodAccessorImpl.invoke(DelegatingMethodAccessorImpl.java:43)
	at java.lang.reflect.Method.invoke(Method.java:498)
	at org.codehaus.plexus.classworlds.launcher.Launcher.launchStandard(Launcher.java:330)
	at org.codehaus.plexus.classworlds.launcher.Launcher.launch(Launcher.java:238)
	at jenkins.maven3.agent.Maven32Main.launch(Maven32Main.java:186)
	at sun.reflect.NativeMethodAccessorImpl.invoke0(Native Method)
	at sun.reflect.NativeMethodAccessorImpl.invoke(NativeMethodAccessorImpl.java:62)
	at sun.reflect.DelegatingMethodAccessorImpl.invoke(DelegatingMethodAccessorImpl.java:43)
	at java.lang.reflect.Method.invoke(Method.java:498)
	at hudson.maven.Maven3Builder.call(Maven3Builder.java:136)
	at hudson.maven.Maven3Builder.call(Maven3Builder.java:71)
	at hudson.remoting.UserRequest.perform(UserRequest.java:153)
	at hudson.remoting.UserRequest.perform(UserRequest.java:50)
	at hudson.remoting.Request$2.run(Request.java:332)
	at hudson.remoting.InterceptingExecutorService$1.call(InterceptingExecutorService.java:68)
	at java.util.concurrent.FutureTask.run(FutureTask.java:266)
	at java.util.concurrent.ThreadPoolExecutor.runWorker(ThreadPoolExecutor.java:1142)
	at java.util.concurrent.ThreadPoolExecutor$Worker.run(ThreadPoolExecutor.java:617)
	at java.lang.Thread.run(Thread.java:745)
Caused by: org.apache.maven.plugin.MojoFailureException: There are test failures.

Please refer to <https://builds.apache.org/job/Aries-Tx-Control-Trunk-JDK8/ws/tx-control-jpa-itests/target/surefire-reports>
for the individual test results.
	at org.apache.maven.plugin.surefire.SurefireHelper.reportExecution(SurefireHelper.java:82)
	at org.apache.maven.plugin.surefire.SurefirePlugin.handleSummary(SurefirePlugin.java:254)
	at org.apache.maven.plugin.surefire.AbstractSurefireMojo.executeAfterPreconditionsChecked(AbstractSurefireMojo.java:854)
	at org.apache.maven.plugin.surefire.AbstractSurefireMojo.execute(AbstractSurefireMojo.java:722)
	at org.apache.maven.plugin.DefaultBuildPluginManager.executeMojo(DefaultBuildPluginManager.java:132)
	at org.apache.maven.lifecycle.internal.MojoExecutor.execute(MojoExecutor.java:208)
	... 30 more
[ERROR] 
[ERROR] Re-run Maven using the -X switch to enable full debug logging.
[ERROR] 
[ERROR] For more information about the errors and possible solutions, please read the following
articles:
[ERROR] [Help 1] http://cwiki.apache.org/confluence/display/MAVEN/MojoFailureException
[ERROR] 
[ERROR] After correcting the problems, you can resume the build with the command
[ERROR]   mvn <goals> -rf :org.apache.aries.tx-control-jpa-itests
[JENKINS] Archiving <https://builds.apache.org/job/Aries-Tx-Control-Trunk-JDK8/ws/pom.xml>
to org.apache.aries.tx-control/tx-control/0.0.2-SNAPSHOT/tx-control-0.0.2-SNAPSHOT.pom
channel stopped

Mime
View raw message