asterixdb-dev mailing list archives

Site index · List index
Message view « Date » · « Thread »
Top « Date » · « Thread »
From Asterix build server <jenk...@asterix-jenkins.ics.uci.edu>
Subject Build failed in Jenkins: asterix-integration-tests 23d990ca
Date Fri, 29 Mar 2019 17:14:24 GMT
See <https://asterix-jenkins.ics.uci.edu/job/asterix-integration-tests/1557/>

------------------------------------------
[...truncated 118880 lines...]
[INFO] Analysing <https://asterix-jenkins.ics.uci.edu/job/asterix-integration-tests/ws/target/jacoco-merged.exec>
[INFO] Analysing <https://asterix-jenkins.ics.uci.edu/job/asterix-integration-tests/ws/asterixdb/asterix-client-helper/target/sonar/jacoco-overall.exec>
[INFO] No information about coverage per test.
[INFO] Sensor JaCoCoOverallSensor (done) | time=70ms
[INFO] Sensor XmlFileSensor
[INFO] Sensor XmlFileSensor (done) | time=0ms
[INFO] Sensor Zero Coverage Sensor
[INFO] Sensor Zero Coverage Sensor (done) | time=1ms
[INFO] Sensor Code Colorizer Sensor
[INFO] Sensor Code Colorizer Sensor (done) | time=0ms
[INFO] Sensor CPD Block Indexer
[INFO] JavaCpdBlockIndexer is used for java
[INFO] Sensor CPD Block Indexer (done) | time=5ms
[INFO] -------------  Scan Apache AsterixDB + Hyracks
[INFO] Base dir: <https://asterix-jenkins.ics.uci.edu/job/asterix-integration-tests/ws/asterixdb/asterix-license>
[INFO] Working dir: <https://asterix-jenkins.ics.uci.edu/job/asterix-integration-tests/ws/asterixdb/asterix-license/target/sonar>
[INFO] Source paths: pom.xml
[INFO] Binary dirs: target/classes
[INFO] Source encoding: UTF-8, default locale: en_US
[INFO] Index files
[INFO] 0 files indexed
[INFO] Sensor Lines Sensor
[INFO] Sensor Lines Sensor (done) | time=0ms
[INFO] Sensor SCM Sensor
[INFO] Sensor SCM Sensor (done) | time=0ms
[INFO] Sensor XmlFileSensor
[INFO] Sensor XmlFileSensor (done) | time=0ms
[INFO] Sensor Zero Coverage Sensor
[INFO] Sensor Zero Coverage Sensor (done) | time=0ms
[INFO] Sensor Code Colorizer Sensor
[INFO] Sensor Code Colorizer Sensor (done) | time=0ms
[INFO] Sensor CPD Block Indexer
[INFO] Sensor CPD Block Indexer (done) | time=1ms
[INFO] -------------  Scan Apache AsterixDB + Hyracks
[INFO] Base dir: <https://asterix-jenkins.ics.uci.edu/job/asterix-integration-tests/ws/asterixdb/asterix-geo>
[INFO] Working dir: <https://asterix-jenkins.ics.uci.edu/job/asterix-integration-tests/ws/asterixdb/asterix-geo/target/sonar>
[INFO] Source paths: pom.xml, src/main/java
[INFO] Binary dirs: target/classes
[INFO] Source encoding: UTF-8, default locale: en_US
[INFO] Index files
[INFO] 69 files indexed
[INFO] Quality profile for java: Sonar way
[INFO] Sensor Lines Sensor
[INFO] Sensor Lines Sensor (done) | time=5ms
[INFO] Sensor JavaSquidSensor
[INFO] Configured Java source version (sonar.java.source): 6
[INFO] JavaClasspath initialization
[INFO] JavaClasspath initialization (done) | time=1ms
[INFO] JavaTestClasspath initialization
[INFO] JavaTestClasspath initialization (done) | time=1ms
[INFO] Java Main Files AST scan
[INFO] 69 source files to be analyzed
[INFO] 69/69 source files have been analyzed
[INFO] Java Main Files AST scan (done) | time=2661ms
[INFO] Java Test Files AST scan
[INFO] 0 source files to be analyzed
[INFO] Java Test Files AST scan (done) | time=1ms
[INFO] Sensor JavaSquidSensor (done) | time=2670ms
[INFO] Sensor SCM Sensor
[INFO] SCM provider for this project is: git
[INFO] 69 files to be analyzed
[INFO] 0/0 source files have been analyzed
[INFO] 69/69 files analyzed
[INFO] Sensor SCM Sensor (done) | time=4040ms
[INFO] Sensor SurefireSensor
[INFO] parsing <https://asterix-jenkins.ics.uci.edu/job/asterix-integration-tests/ws/asterixdb/asterix-geo/target/surefire-reports>
[INFO] Sensor SurefireSensor (done) | time=0ms
[INFO] Sensor JaCoCoSensor
[INFO] Analysing <https://asterix-jenkins.ics.uci.edu/job/asterix-integration-tests/ws/target/jacoco-merged.exec>
[INFO] No information about coverage per test.
[INFO] Sensor JaCoCoSensor (done) | time=68ms
[INFO] Sensor JaCoCoItSensor
[INFO] JaCoCoItSensor: JaCoCo IT report not found: <https://asterix-jenkins.ics.uci.edu/job/asterix-integration-tests/ws/asterixdb/asterix-geo/target/jacoco-it.exec>
[INFO] Sensor JaCoCoItSensor (done) | time=1ms
[INFO] Sensor JaCoCoOverallSensor
[INFO] Analysing <https://asterix-jenkins.ics.uci.edu/job/asterix-integration-tests/ws/target/jacoco-merged.exec>
[INFO] Analysing <https://asterix-jenkins.ics.uci.edu/job/asterix-integration-tests/ws/asterixdb/asterix-geo/target/sonar/jacoco-overall.exec>
[INFO] No information about coverage per test.
[INFO] Sensor JaCoCoOverallSensor (done) | time=76ms
[INFO] Sensor XmlFileSensor
[INFO] Sensor XmlFileSensor (done) | time=0ms
[INFO] Sensor Zero Coverage Sensor
[INFO] Sensor Zero Coverage Sensor (done) | time=5ms
[INFO] Sensor Code Colorizer Sensor
[INFO] Sensor Code Colorizer Sensor (done) | time=2ms
[INFO] Sensor CPD Block Indexer
[INFO] JavaCpdBlockIndexer is used for java
[INFO] Sensor CPD Block Indexer (done) | time=81ms
[INFO] -------------  Scan Apache AsterixDB + Hyracks
[INFO] Base dir: <https://asterix-jenkins.ics.uci.edu/job/asterix-integration-tests/ws/asterixdb>
[INFO] Working dir: <https://asterix-jenkins.ics.uci.edu/job/asterix-integration-tests/ws/asterixdb/target/sonar>
[INFO] Source encoding: UTF-8, default locale: en_US
[INFO] Sensor Lines Sensor
[INFO] Sensor Lines Sensor (done) | time=0ms
[INFO] Sensor SCM Sensor
[INFO] Sensor SCM Sensor (done) | time=1ms
[INFO] Sensor XmlFileSensor
[INFO] Sensor XmlFileSensor (done) | time=0ms
[INFO] Sensor Zero Coverage Sensor
[INFO] Sensor Zero Coverage Sensor (done) | time=0ms
[INFO] Sensor Code Colorizer Sensor
[INFO] Sensor Code Colorizer Sensor (done) | time=0ms
[INFO] Sensor CPD Block Indexer
[INFO] Sensor CPD Block Indexer (done) | time=0ms
[INFO] -------------  Scan Apache AsterixDB + Hyracks
[INFO] Base dir: <https://asterix-jenkins.ics.uci.edu/job/asterix-integration-tests/ws/>
[INFO] Working dir: <https://asterix-jenkins.ics.uci.edu/job/asterix-integration-tests/ws/target/sonar>
[INFO] Source encoding: UTF-8, default locale: en_US
[INFO] Sensor Lines Sensor
[INFO] Sensor Lines Sensor (done) | time=0ms
[INFO] Sensor SCM Sensor
[INFO] Sensor SCM Sensor (done) | time=0ms
[INFO] Sensor XmlFileSensor
[INFO] Sensor XmlFileSensor (done) | time=0ms
[INFO] Sensor Zero Coverage Sensor
[INFO] Sensor Zero Coverage Sensor (done) | time=0ms
[INFO] Sensor Code Colorizer Sensor
[INFO] Sensor Code Colorizer Sensor (done) | time=1ms
[INFO] Sensor CPD Block Indexer
[INFO] Sensor CPD Block Indexer (done) | time=0ms
[INFO] Calculating CPD for 3308 files
[INFO] CPD calculation finished
[INFO] Analysis report generated in 5771ms, dir size=53 MB
[INFO] Analysis reports compressed in 10426ms, zip size=23 MB
[INFO] ------------------------------------------------------------------------
[INFO] Reactor Summary:
[INFO] 
[INFO] hyracks-ecosystem-full-stack ....................... SKIPPED
[INFO] hyracks ............................................ SKIPPED
[INFO] hyracks-util ....................................... SKIPPED
[INFO] hyracks-ipc ........................................ SKIPPED
[INFO] hyracks-api ........................................ SKIPPED
[INFO] hyracks-net ........................................ SKIPPED
[INFO] hyracks-comm ....................................... SKIPPED
[INFO] hyracks-control .................................... SKIPPED
[INFO] hyracks-control-common ............................. SKIPPED
[INFO] hyracks-control-nc ................................. SKIPPED
[INFO] hyracks-data ....................................... SKIPPED
[INFO] hyracks-data-std ................................... SKIPPED
[INFO] hyracks-dataflow-common ............................ SKIPPED
[INFO] hyracks-storage-common ............................. SKIPPED
[INFO] hyracks-dataflow-std ............................... SKIPPED
[INFO] hyracks-storage-am-common .......................... SKIPPED
[INFO] hyracks-storage-am-btree ........................... SKIPPED
[INFO] hyracks-storage-am-rtree ........................... SKIPPED
[INFO] hyracks-storage-am-bloomfilter ..................... SKIPPED
[INFO] hyracks-storage-am-lsm-common ...................... SKIPPED
[INFO] hyracks-test-support ............................... SKIPPED
[INFO] hyracks-http ....................................... SKIPPED
[INFO] hyracks-control-cc ................................. SKIPPED
[INFO] hyracks-client ..................................... SKIPPED
[INFO] hyracks-nc-service ................................. SKIPPED
[INFO] hyracks-storage-am-lsm-invertedindex ............... SKIPPED
[INFO] hyracks-storage-am-lsm-btree ....................... SKIPPED
[INFO] hyracks-storage-am-lsm-rtree ....................... SKIPPED
[INFO] hyracks-tests ...................................... SKIPPED
[INFO] hyracks-storage-common-test ........................ SKIPPED
[INFO] hyracks-storage-am-btree-test ...................... SKIPPED
[INFO] hyracks-storage-am-rtree-test ...................... SKIPPED
[INFO] hyracks-storage-am-lsm-common-test ................. SKIPPED
[INFO] hyracks-storage-am-lsm-btree-test .................. SKIPPED
[INFO] hyracks-storage-am-lsm-rtree-test .................. SKIPPED
[INFO] hyracks-storage-am-lsm-invertedindex-test .......... SKIPPED
[INFO] hyracks-storage-am-bloomfilter-test ................ SKIPPED
[INFO] hyracks-server ..................................... SKIPPED
[INFO] hyracks-examples ................................... SKIPPED
[INFO] tpch-example ....................................... SKIPPED
[INFO] tpchclient ......................................... SKIPPED
[INFO] tpchserver ......................................... SKIPPED
[INFO] text-example ....................................... SKIPPED
[INFO] texthelper ......................................... SKIPPED
[INFO] textclient ......................................... SKIPPED
[INFO] hyracks-maven-plugins .............................. SKIPPED
[INFO] Hyracks VirtualCluster Maven Plugin ................ SKIPPED
[INFO] textserver ......................................... SKIPPED
[INFO] btree-example ...................................... SKIPPED
[INFO] btreehelper ........................................ SKIPPED
[INFO] btreeclient ........................................ SKIPPED
[INFO] btreeserver ........................................ SKIPPED
[INFO] hyracks-integration-tests .......................... SKIPPED
[INFO] hyracks-shutdown-test .............................. SKIPPED
[INFO] hyracks-documentation .............................. SKIPPED
[INFO] license-automation-plugin .......................... SKIPPED
[INFO] hyracks-hdfs ....................................... SKIPPED
[INFO] hyracks-dist ....................................... SKIPPED
[INFO] algebricks ......................................... SKIPPED
[INFO] algebricks-common .................................. SKIPPED
[INFO] algebricks-data .................................... SKIPPED
[INFO] algebricks-runtime ................................. SKIPPED
[INFO] algebricks-core .................................... SKIPPED
[INFO] algebricks-compiler ................................ SKIPPED
[INFO] algebricks-rewriter ................................ SKIPPED
[INFO] algebricks-tests ................................... SKIPPED
[INFO] hyracks-fullstack-license .......................... SKIPPED
[INFO] apache-asterixdb ................................... SKIPPED
[INFO] asterix-common ..................................... SKIPPED
[INFO] asterix-om ......................................... SKIPPED
[INFO] asterix-maven-plugins .............................. SKIPPED
[INFO] record-manager-generator-maven-plugin .............. SKIPPED
[INFO] asterix-transactions ............................... SKIPPED
[INFO] asterix-evaluator-generator-maven-plugin ........... SKIPPED
[INFO] asterix-runtime .................................... SKIPPED
[INFO] asterix-active ..................................... SKIPPED
[INFO] asterix-hivecompat ................................. SKIPPED
[INFO] lexer-generator-maven-plugin ....................... SKIPPED
[INFO] asterix-external-data .............................. SKIPPED
[INFO] asterix-metadata ................................... SKIPPED
[INFO] asterix-lang-common ................................ SKIPPED
[INFO] asterix-lang-aql ................................... SKIPPED
[INFO] asterix-lang-sqlpp ................................. SKIPPED
[INFO] asterix-grammar-extension-maven-plugin ............. SKIPPED
[INFO] asterix-algebra .................................... SKIPPED
[INFO] asterix-test-framework ............................. SKIPPED
[INFO] asterix-replication ................................ SKIPPED
[INFO] asterix-fuzzyjoin .................................. SKIPPED
[INFO] asterix-geo ........................................ SKIPPED
[INFO] asterix-test-datagenerator-maven-plugin ............ SKIPPED
[INFO] asterix-app ........................................ SKIPPED
[INFO] asterix-dashboard .................................. SKIPPED
[INFO] asterix-tools ...................................... SKIPPED
[INFO] asterix-examples ................................... SKIPPED
[INFO] asterix-client-helper .............................. SKIPPED
[INFO] asterix-server ..................................... SKIPPED
[INFO] asterix-docker ..................................... SKIPPED
[INFO] asterix-doc ........................................ SKIPPED
[INFO] asterix-benchmark .................................. SKIPPED
[INFO] asterix-coverage ................................... SKIPPED
[INFO] asterix-license .................................... SKIPPED
[INFO] hyracks-asterix .................................... FAILURE [39:56 min]
[INFO] ------------------------------------------------------------------------
[INFO] BUILD FAILURE
[INFO] ------------------------------------------------------------------------
[INFO] Total time: 40:06 min
[INFO] Finished at: 2019-03-29T17:14:12+00:00
[INFO] Final Memory: 93M/1469M
[INFO] ------------------------------------------------------------------------
[ERROR] Failed to execute goal org.sonarsource.scanner.maven:sonar-maven-plugin:3.6.0.1398:sonar
(default-cli) on project apache-asterixdb-fullstack: Insufficient privileges -> [Help 1]
[ERROR] 
[ERROR] To see the full stack trace of the errors, re-run Maven with the -e switch.
[ERROR] Re-run Maven using the -X switch to enable full debug logging.
[ERROR] 
[ERROR] For more information about the errors and possible solutions, please read the following
articles:
[ERROR] [Help 1] http://cwiki.apache.org/confluence/display/MAVEN/MojoExecutionException
[ERROR] 
[ERROR] After correcting the problems, you can resume the build with the command
[ERROR]   mvn <goals> -rf :apache-asterixdb-fullstack
Build step 'Invoke top-level Maven targets' marked build as failure
Archiving artifacts
Injecting SonarQube environment variables using the configuration: asterix-sonarqube

Mime
View raw message