atlas-dev mailing list archives

Site index · List index
Message view « Date » · « Thread »
Top « Date » · « Thread »
From Apache Jenkins Server <jenk...@builds.apache.org>
Subject Build failed in Jenkins: apache-atlas-nightly #496
Date Fri, 25 Nov 2016 08:05:23 GMT
See <https://builds.apache.org/job/apache-atlas-nightly/496/>

------------------------------------------
[...truncated 200346 lines...]
18/27 KB   
20/27 KB   
22/27 KB   
24/27 KB   
26/27 KB   
27/27 KB   
           
Uploaded: https://repository.apache.org/content/repositories/snapshots/org/apache/atlas/storm-bridge/0.8-incubating-SNAPSHOT/storm-bridge-0.8-incubating-20161125.074225-127.pom
(27 KB at 30.0 KB/sec)
Downloading: https://repository.apache.org/content/repositories/snapshots/org/apache/atlas/storm-bridge/maven-metadata.xml
366/366 B   
            
Downloaded: https://repository.apache.org/content/repositories/snapshots/org/apache/atlas/storm-bridge/maven-metadata.xml
(366 B at 0.7 KB/sec)
Uploading: https://repository.apache.org/content/repositories/snapshots/org/apache/atlas/storm-bridge/0.8-incubating-SNAPSHOT/maven-metadata.xml
2/2 KB      
         
Uploaded: https://repository.apache.org/content/repositories/snapshots/org/apache/atlas/storm-bridge/0.8-incubating-SNAPSHOT/maven-metadata.xml
(2 KB at 1.5 KB/sec)
Uploading: https://repository.apache.org/content/repositories/snapshots/org/apache/atlas/storm-bridge/maven-metadata.xml
366/366 B   
            
Uploaded: https://repository.apache.org/content/repositories/snapshots/org/apache/atlas/storm-bridge/maven-metadata.xml
(366 B at 0.4 KB/sec)
Uploading: https://repository.apache.org/content/repositories/snapshots/org/apache/atlas/storm-bridge/0.8-incubating-SNAPSHOT/storm-bridge-0.8-incubating-20161125.074225-127-sources.jar
2/18 KB     
4/18 KB   
6/18 KB   
8/18 KB   
10/18 KB   
12/18 KB   
14/18 KB   
16/18 KB   
18/18 KB   
           
Uploaded: https://repository.apache.org/content/repositories/snapshots/org/apache/atlas/storm-bridge/0.8-incubating-SNAPSHOT/storm-bridge-0.8-incubating-20161125.074225-127-sources.jar
(18 KB at 19.9 KB/sec)
Uploading: https://repository.apache.org/content/repositories/snapshots/org/apache/atlas/storm-bridge/0.8-incubating-SNAPSHOT/maven-metadata.xml
2/2 KB     
         
Uploaded: https://repository.apache.org/content/repositories/snapshots/org/apache/atlas/storm-bridge/0.8-incubating-SNAPSHOT/maven-metadata.xml
(2 KB at 1.5 KB/sec)
Uploading: https://repository.apache.org/content/repositories/snapshots/org/apache/atlas/storm-bridge/0.8-incubating-SNAPSHOT/storm-bridge-0.8-incubating-20161125.074225-127-test-sources.jar
2/13 KB   
4/13 KB   
6/13 KB   
8/13 KB   
10/13 KB   
12/13 KB   
13/13 KB   
           
Uploaded: https://repository.apache.org/content/repositories/snapshots/org/apache/atlas/storm-bridge/0.8-incubating-SNAPSHOT/storm-bridge-0.8-incubating-20161125.074225-127-test-sources.jar
(13 KB at 14.1 KB/sec)
Uploading: https://repository.apache.org/content/repositories/snapshots/org/apache/atlas/storm-bridge/0.8-incubating-SNAPSHOT/maven-metadata.xml
2/2 KB     
         
Uploaded: https://repository.apache.org/content/repositories/snapshots/org/apache/atlas/storm-bridge/0.8-incubating-SNAPSHOT/maven-metadata.xml
(2 KB at 1.5 KB/sec)
[INFO]                                                                         
[INFO] ------------------------------------------------------------------------
[INFO] Building Apache Atlas Distribution 0.8-incubating-SNAPSHOT
[INFO] ------------------------------------------------------------------------
[INFO] 
[INFO] --- buildnumber-maven-plugin:1.4:create (default) @ atlas-distro ---
[INFO] Executing: /bin/sh -c cd '<https://builds.apache.org/job/apache-atlas-nightly/ws/distro'>
&& 'git' 'rev-parse' '--verify' 'HEAD'
[INFO] Working directory: <https://builds.apache.org/job/apache-atlas-nightly/ws/distro>
[INFO] Storing buildNumber: 86740c148b16940930bdbfe88998b31046d781f6 at timestamp: 1480059752559
[WARNING] Cannot get the branch information from the git repository: 
Detecting the current branch failed: fatal: ref HEAD is not a symbolic ref

[INFO] Executing: /bin/sh -c cd '<https://builds.apache.org/job/apache-atlas-nightly/ws/distro'>
&& 'git' 'rev-parse' '--verify' 'HEAD'
[INFO] Working directory: <https://builds.apache.org/job/apache-atlas-nightly/ws/distro>
[INFO] Storing buildScmBranch: UNKNOWN
[INFO] 
[INFO] --- maven-remote-resources-plugin:1.5:process (default) @ atlas-distro ---
[INFO] 
[INFO] --- maven-resources-plugin:2.7:resources (default-resources) @ atlas-distro ---
[INFO] Using 'UTF-8' encoding to copy filtered resources.
[INFO] Copying 9 resources to bin
[INFO] Copying 13 resources to conf
[INFO] Copying 3 resources
[INFO] 
[INFO] --- maven-compiler-plugin:3.1:compile (default-compile) @ atlas-distro ---
[INFO] No sources to compile
[INFO] 
[INFO] --- maven-resources-plugin:2.7:testResources (default-testResources) @ atlas-distro
---
[INFO] Using 'UTF-8' encoding to copy filtered resources.
[INFO] skip non existing resourceDirectory <https://builds.apache.org/job/apache-atlas-nightly/ws/distro/src/test/resources>
[INFO] skip non existing resourceDirectory <https://builds.apache.org/job/apache-atlas-nightly/ws/distro/typesystem/src/test/resources>
[INFO] Copying 3 resources
[INFO] 
[INFO] --- maven-compiler-plugin:3.1:testCompile (default-testCompile) @ atlas-distro ---
[INFO] No sources to compile
[INFO] 
[INFO] --- maven-surefire-plugin:2.18.1:test (default-test) @ atlas-distro ---
[WARNING] The parameter forkMode is deprecated since version 2.14. Use forkCount and reuseForks
instead.
[INFO] 
[INFO] --- exec-maven-plugin:1.2.1:exec (python-test) @ atlas-distro ---
test_jar_java_lookups_fail (TestMetadata.TestMetadata) ... ok
test_jar_java_lookups_succeed_from_path (TestMetadata.TestMetadata) ... ok
test_main_default (TestMetadata.TestMetadata) ... Apache Atlas Server started!!!

ok
test_main_embedded (TestMetadata.TestMetadata) ... configured for local hbase.
hbase started.
configured for local solr.
solr started.
setting up solr collections...
Apache Atlas Server started!!!

ok

----------------------------------------------------------------------
Ran 4 tests in 0.011s

OK
[INFO] 
[INFO] --- maven-jar-plugin:2.5:jar (default-jar) @ atlas-distro ---
[INFO] Building jar: <https://builds.apache.org/job/apache-atlas-nightly/ws/distro/target/atlas-distro-0.8-incubating-SNAPSHOT.jar>
[INFO] ------------------------------------------------------------------------
[INFO] Reactor Summary:
[INFO] 
[INFO] apache-atlas ....................................... SUCCESS [ 12.942 s]
[INFO] Apache Atlas Integration ........................... SUCCESS [ 52.750 s]
[INFO] Apache Atlas Common ................................ SUCCESS [ 24.872 s]
[INFO] Apache Atlas Typesystem ............................ SUCCESS [01:47 min]
[INFO] Apache Atlas Client ................................ SUCCESS [ 26.584 s]
[INFO] Apache Atlas Server API ............................ SUCCESS [ 18.707 s]
[INFO] Apache Atlas Notification .......................... SUCCESS [ 49.901 s]
[INFO] Apache Atlas Graph Database Projects ............... SUCCESS [  4.235 s]
[INFO] Apache Atlas Graph Database API .................... SUCCESS [ 15.368 s]
[INFO] Graph Database Common Code ......................... SUCCESS [ 15.772 s]
[INFO] Shaded version of Apache hbase client .............. SUCCESS [ 18.370 s]
[INFO] Apache Atlas Titan 0.5.4 Graph DB Impl ............. SUCCESS [02:10 min]
[INFO] Apache Atlas Graph Database Implementation Dependencies SUCCESS [  4.361 s]
[INFO] Shaded version of Apache hbase server .............. SUCCESS [ 49.939 s]
[INFO] Apache Atlas Repository ............................ SUCCESS [13:21 min]
[INFO] Apache Atlas Authorization ......................... SUCCESS [ 22.287 s]
[INFO] Apache Atlas Business Catalog ...................... SUCCESS [ 39.766 s]
[INFO] Apache Atlas UI .................................... SUCCESS [ 24.265 s]
[INFO] Apache Atlas Web Application ....................... SUCCESS [14:09 min]
[INFO] Apache Atlas Documentation ......................... SUCCESS [ 12.177 s]
[INFO] Apache Atlas FileSystem Model ...................... SUCCESS [  9.926 s]
[INFO] Apache Atlas Plugin Classloader .................... SUCCESS [ 18.153 s]
[INFO] Apache Atlas Hive Bridge Shim ...................... SUCCESS [ 15.292 s]
[INFO] Apache Atlas Hive Bridge ........................... SUCCESS [02:12 min]
[INFO] Apache Atlas Falcon Bridge Shim .................... SUCCESS [ 16.409 s]
[INFO] Apache Atlas Falcon Bridge ......................... SUCCESS [01:39 min]
[INFO] Apache Atlas Sqoop Bridge Shim ..................... SUCCESS [ 14.629 s]
[INFO] Apache Atlas Sqoop Bridge .......................... SUCCESS [02:29 min]
[INFO] Apache Atlas Storm Bridge Shim ..................... SUCCESS [ 14.726 s]
[INFO] Apache Atlas Storm Bridge .......................... SUCCESS [02:26 min]
[INFO] Apache Atlas Distribution .......................... FAILURE [ 23.217 s]
[INFO] ------------------------------------------------------------------------
[INFO] BUILD FAILURE
[INFO] ------------------------------------------------------------------------
[INFO] Total time: 48:44 min
[INFO] Finished at: 2016-11-25T07:42:55+00:00
[INFO] Final Memory: 898M/2454M
[INFO] ------------------------------------------------------------------------
[ERROR] Failed to execute goal org.apache.maven.plugins:maven-jar-plugin:2.5:jar (default-jar)
on project atlas-distro: Error assembling JAR: A zip file cannot include itself -> [Help
1]
[ERROR] 
[ERROR] To see the full stack trace of the errors, re-run Maven with the -e switch.
[ERROR] Re-run Maven using the -X switch to enable full debug logging.
[ERROR] 
[ERROR] For more information about the errors and possible solutions, please read the following
articles:
[ERROR] [Help 1] http://cwiki.apache.org/confluence/display/MAVEN/MojoExecutionException
[ERROR] 
[ERROR] After correcting the problems, you can resume the build with the command
[ERROR]   mvn <goals> -rf :atlas-distro
Build step 'Execute shell' marked build as failure
[CHECKSTYLE] Collecting checkstyle analysis files...
[CHECKSTYLE] Finding all files that match the pattern **/target/checkstyle-result.xml
[CHECKSTYLE] Parsing 32 files in <https://builds.apache.org/job/apache-atlas-nightly/ws/>
[CHECKSTYLE] Successfully parsed file <https://builds.apache.org/job/apache-atlas-nightly/ws/addons/falcon-bridge-shim/target/checkstyle-result.xml>
with 0 unique warnings and 0 duplicates.
[CHECKSTYLE] Successfully parsed file <https://builds.apache.org/job/apache-atlas-nightly/ws/addons/falcon-bridge/target/checkstyle-result.xml>
with 42 unique warnings and 0 duplicates.
[CHECKSTYLE] Successfully parsed file <https://builds.apache.org/job/apache-atlas-nightly/ws/addons/hdfs-model/target/checkstyle-result.xml>
with 42 unique warnings and 0 duplicates.
[CHECKSTYLE] Successfully parsed file <https://builds.apache.org/job/apache-atlas-nightly/ws/addons/hive-bridge-shim/target/checkstyle-result.xml>
with 42 unique warnings and 0 duplicates.
[CHECKSTYLE] Successfully parsed file <https://builds.apache.org/job/apache-atlas-nightly/ws/addons/hive-bridge/target/checkstyle-result.xml>
with 355 unique warnings and 0 duplicates.
[CHECKSTYLE] Successfully parsed file <https://builds.apache.org/job/apache-atlas-nightly/ws/addons/sqoop-bridge-shim/target/checkstyle-result.xml>
with 355 unique warnings and 0 duplicates.
[CHECKSTYLE] Successfully parsed file <https://builds.apache.org/job/apache-atlas-nightly/ws/addons/sqoop-bridge/target/checkstyle-result.xml>
with 363 unique warnings and 0 duplicates.
[CHECKSTYLE] Successfully parsed file <https://builds.apache.org/job/apache-atlas-nightly/ws/addons/storm-bridge-shim/target/checkstyle-result.xml>
with 363 unique warnings and 0 duplicates.
[CHECKSTYLE] Successfully parsed file <https://builds.apache.org/job/apache-atlas-nightly/ws/addons/storm-bridge/target/checkstyle-result.xml>
with 442 unique warnings and 0 duplicates.
[CHECKSTYLE] Successfully parsed file <https://builds.apache.org/job/apache-atlas-nightly/ws/authorization/target/checkstyle-result.xml>
with 580 unique warnings and 0 duplicates.
[CHECKSTYLE] Successfully parsed file <https://builds.apache.org/job/apache-atlas-nightly/ws/catalog/target/checkstyle-result.xml>
with 885 unique warnings and 0 duplicates.
[CHECKSTYLE] Successfully parsed file <https://builds.apache.org/job/apache-atlas-nightly/ws/client/target/checkstyle-result.xml>
with 1015 unique warnings and 0 duplicates.
[CHECKSTYLE] Successfully parsed file <https://builds.apache.org/job/apache-atlas-nightly/ws/common/target/checkstyle-result.xml>
with 1015 unique warnings and 0 duplicates.
[CHECKSTYLE] Successfully parsed file <https://builds.apache.org/job/apache-atlas-nightly/ws/dashboardv2/target/checkstyle-result.xml>
with 1015 unique warnings and 0 duplicates.
[CHECKSTYLE] Successfully parsed file <https://builds.apache.org/job/apache-atlas-nightly/ws/distro/target/checkstyle-result.xml>
with 1015 unique warnings and 0 duplicates.
[CHECKSTYLE] Successfully parsed file <https://builds.apache.org/job/apache-atlas-nightly/ws/docs/target/checkstyle-result.xml>
with 1015 unique warnings and 0 duplicates.
[CHECKSTYLE] Successfully parsed file <https://builds.apache.org/job/apache-atlas-nightly/ws/graphdb/api/target/checkstyle-result.xml>
with 1015 unique warnings and 0 duplicates.
[CHECKSTYLE] Successfully parsed file <https://builds.apache.org/job/apache-atlas-nightly/ws/graphdb/common/target/checkstyle-result.xml>
with 1015 unique warnings and 0 duplicates.
[CHECKSTYLE] Successfully parsed file <https://builds.apache.org/job/apache-atlas-nightly/ws/graphdb/graphdb-impls/target/checkstyle-result.xml>
with 1015 unique warnings and 0 duplicates.
[CHECKSTYLE] Successfully parsed file <https://builds.apache.org/job/apache-atlas-nightly/ws/graphdb/target/checkstyle-result.xml>
with 1015 unique warnings and 0 duplicates.
[CHECKSTYLE] Successfully parsed file <https://builds.apache.org/job/apache-atlas-nightly/ws/graphdb/titan0/target/checkstyle-result.xml>
with 1015 unique warnings and 0 duplicates.
[CHECKSTYLE] Successfully parsed file <https://builds.apache.org/job/apache-atlas-nightly/ws/intg/target/checkstyle-result.xml>
with 1215 unique warnings and 0 duplicates.
[CHECKSTYLE] Successfully parsed file <https://builds.apache.org/job/apache-atlas-nightly/ws/notification/target/checkstyle-result.xml>
with 1215 unique warnings and 0 duplicates.
[CHECKSTYLE] Successfully parsed file <https://builds.apache.org/job/apache-atlas-nightly/ws/plugin-classloader/target/checkstyle-result.xml>
with 1215 unique warnings and 0 duplicates.
[CHECKSTYLE] Successfully parsed file <https://builds.apache.org/job/apache-atlas-nightly/ws/repository/target/checkstyle-result.xml>
with 2712 unique warnings and 0 duplicates.
[CHECKSTYLE] Successfully parsed file <https://builds.apache.org/job/apache-atlas-nightly/ws/server-api/target/checkstyle-result.xml>
with 2758 unique warnings and 0 duplicates.
[CHECKSTYLE] Successfully parsed file <https://builds.apache.org/job/apache-atlas-nightly/ws/shaded/hbase-client-shaded/target/checkstyle-result.xml>
with 2758 unique warnings and 0 duplicates.
[CHECKSTYLE] Successfully parsed file <https://builds.apache.org/job/apache-atlas-nightly/ws/shaded/hbase-server-shaded/target/checkstyle-result.xml>
with 2758 unique warnings and 0 duplicates.
[CHECKSTYLE] Successfully parsed file <https://builds.apache.org/job/apache-atlas-nightly/ws/target/checkstyle-result.xml>
with 2758 unique warnings and 0 duplicates.
[CHECKSTYLE] Successfully parsed file <https://builds.apache.org/job/apache-atlas-nightly/ws/titan/target/checkstyle-result.xml>
with 3220 unique warnings and 0 duplicates.
[CHECKSTYLE] Successfully parsed file <https://builds.apache.org/job/apache-atlas-nightly/ws/typesystem/target/checkstyle-result.xml>
with 4031 unique warnings and 0 duplicates.
[CHECKSTYLE] Successfully parsed file <https://builds.apache.org/job/apache-atlas-nightly/ws/webapp/target/checkstyle-result.xml>
with 5019 unique warnings and 0 duplicates.
[CHECKSTYLE] Computing warning deltas based on reference build #270
[FINDBUGS] Collecting findbugs analysis files...
[FINDBUGS] Finding all files that match the pattern **/target/findbugs.xml
[FINDBUGS] Parsing 23 files in <https://builds.apache.org/job/apache-atlas-nightly/ws/>
[FINDBUGS] Successfully parsed file <https://builds.apache.org/job/apache-atlas-nightly/ws/addons/falcon-bridge-shim/target/findbugs.xml>
with 0 unique warnings and 0 duplicates.
[FINDBUGS] Successfully parsed file <https://builds.apache.org/job/apache-atlas-nightly/ws/addons/falcon-bridge/target/findbugs.xml>
with 0 unique warnings and 0 duplicates.
[FINDBUGS] Successfully parsed file <https://builds.apache.org/job/apache-atlas-nightly/ws/addons/hive-bridge-shim/target/findbugs.xml>
with 0 unique warnings and 0 duplicates.
[FINDBUGS] Successfully parsed file <https://builds.apache.org/job/apache-atlas-nightly/ws/addons/hive-bridge/target/findbugs.xml>
with 0 unique warnings and 0 duplicates.
[FINDBUGS] Successfully parsed file <https://builds.apache.org/job/apache-atlas-nightly/ws/addons/sqoop-bridge-shim/target/findbugs.xml>
with 0 unique warnings and 0 duplicates.
[FINDBUGS] Successfully parsed file <https://builds.apache.org/job/apache-atlas-nightly/ws/addons/sqoop-bridge/target/findbugs.xml>
with 0 unique warnings and 0 duplicates.
[FINDBUGS] Successfully parsed file <https://builds.apache.org/job/apache-atlas-nightly/ws/addons/storm-bridge-shim/target/findbugs.xml>
with 0 unique warnings and 0 duplicates.
[FINDBUGS] Successfully parsed file <https://builds.apache.org/job/apache-atlas-nightly/ws/addons/storm-bridge/target/findbugs.xml>
with 0 unique warnings and 0 duplicates.
[FINDBUGS] Successfully parsed file <https://builds.apache.org/job/apache-atlas-nightly/ws/authorization/target/findbugs.xml>
with 0 unique warnings and 0 duplicates.
[FINDBUGS] Successfully parsed file <https://builds.apache.org/job/apache-atlas-nightly/ws/catalog/target/findbugs.xml>
with 0 unique warnings and 0 duplicates.
[FINDBUGS] Successfully parsed file <https://builds.apache.org/job/apache-atlas-nightly/ws/client/target/findbugs.xml>
with 0 unique warnings and 0 duplicates.
[FINDBUGS] Successfully parsed file <https://builds.apache.org/job/apache-atlas-nightly/ws/common/target/findbugs.xml>
with 0 unique warnings and 0 duplicates.
[FINDBUGS] Successfully parsed file <https://builds.apache.org/job/apache-atlas-nightly/ws/graphdb/api/target/findbugs.xml>
with 0 unique warnings and 0 duplicates.
[FINDBUGS] Successfully parsed file <https://builds.apache.org/job/apache-atlas-nightly/ws/graphdb/common/target/findbugs.xml>
with 0 unique warnings and 0 duplicates.
[FINDBUGS] Successfully parsed file <https://builds.apache.org/job/apache-atlas-nightly/ws/graphdb/titan0/target/findbugs.xml>
with 0 unique warnings and 0 duplicates.
[FINDBUGS] Successfully parsed file <https://builds.apache.org/job/apache-atlas-nightly/ws/intg/target/findbugs.xml>
with 0 unique warnings and 0 duplicates.
[FINDBUGS] Successfully parsed file <https://builds.apache.org/job/apache-atlas-nightly/ws/notification/target/findbugs.xml>
with 0 unique warnings and 0 duplicates.
[FINDBUGS] Successfully parsed file <https://builds.apache.org/job/apache-atlas-nightly/ws/plugin-classloader/target/findbugs.xml>
with 0 unique warnings and 0 duplicates.
[FINDBUGS] Successfully parsed file <https://builds.apache.org/job/apache-atlas-nightly/ws/repository/target/findbugs.xml>
with 0 unique warnings and 0 duplicates.
[FINDBUGS] Successfully parsed file <https://builds.apache.org/job/apache-atlas-nightly/ws/server-api/target/findbugs.xml>
with 0 unique warnings and 0 duplicates.
[FINDBUGS] Successfully parsed file <https://builds.apache.org/job/apache-atlas-nightly/ws/titan/target/findbugs.xml>
with 0 unique warnings and 0 duplicates.
[FINDBUGS] Successfully parsed file <https://builds.apache.org/job/apache-atlas-nightly/ws/typesystem/target/findbugs.xml>
with 0 unique warnings and 0 duplicates.
[FINDBUGS] Successfully parsed file <https://builds.apache.org/job/apache-atlas-nightly/ws/webapp/target/findbugs.xml>
with 0 unique warnings and 0 duplicates.
[FINDBUGS] Computing warning deltas based on reference build #270
Archiving artifacts
TestNG Reports Processing: START
Looking for TestNG results report in workspace using pattern: **/target/surefire-reports/testng-results.xml,**/target/failsafe-reports/testng-results.xml
testng-results.xml was last modified before this build started. Ignoring it.
Saving reports...
Processing '/x1/jenkins/jenkins-home/jobs/apache-atlas-nightly/builds/496/testng/testng-results-1.xml'
Processing '/x1/jenkins/jenkins-home/jobs/apache-atlas-nightly/builds/496/testng/testng-results-10.xml'
Processing '/x1/jenkins/jenkins-home/jobs/apache-atlas-nightly/builds/496/testng/testng-results-11.xml'
Processing '/x1/jenkins/jenkins-home/jobs/apache-atlas-nightly/builds/496/testng/testng-results-12.xml'
Processing '/x1/jenkins/jenkins-home/jobs/apache-atlas-nightly/builds/496/testng/testng-results-13.xml'
Processing '/x1/jenkins/jenkins-home/jobs/apache-atlas-nightly/builds/496/testng/testng-results-14.xml'
Processing '/x1/jenkins/jenkins-home/jobs/apache-atlas-nightly/builds/496/testng/testng-results-15.xml'
Processing '/x1/jenkins/jenkins-home/jobs/apache-atlas-nightly/builds/496/testng/testng-results-16.xml'
Processing '/x1/jenkins/jenkins-home/jobs/apache-atlas-nightly/builds/496/testng/testng-results-2.xml'
Processing '/x1/jenkins/jenkins-home/jobs/apache-atlas-nightly/builds/496/testng/testng-results-3.xml'
Processing '/x1/jenkins/jenkins-home/jobs/apache-atlas-nightly/builds/496/testng/testng-results-4.xml'
Processing '/x1/jenkins/jenkins-home/jobs/apache-atlas-nightly/builds/496/testng/testng-results-5.xml'
Processing '/x1/jenkins/jenkins-home/jobs/apache-atlas-nightly/builds/496/testng/testng-results-6.xml'
Processing '/x1/jenkins/jenkins-home/jobs/apache-atlas-nightly/builds/496/testng/testng-results-7.xml'
Processing '/x1/jenkins/jenkins-home/jobs/apache-atlas-nightly/builds/496/testng/testng-results-8.xml'
Processing '/x1/jenkins/jenkins-home/jobs/apache-atlas-nightly/builds/496/testng/testng-results-9.xml'
Processing '/x1/jenkins/jenkins-home/jobs/apache-atlas-nightly/builds/496/testng/testng-results.xml'
TestNG Reports Processing: FINISH

Mime
View raw message