atlas-dev mailing list archives

Site index · List index
Message view « Date » · « Thread »
Top « Date » · « Thread »
From Apache Jenkins Server <jenk...@builds.apache.org>
Subject Build failed in Jenkins: apache-atlas-nightly #500
Date Mon, 28 Nov 2016 06:20:11 GMT
See <https://builds.apache.org/job/apache-atlas-nightly/500/>

------------------------------------------
[...truncated 8071 lines...]
[WARNING] 'build.plugins.plugin.version' for net.alchim31.maven:scala-maven-plugin is missing.
@ org.apache.atlas:apache-atlas:0.8-incubating-SNAPSHOT, <https://builds.apache.org/job/apache-atlas-nightly/ws/pom.xml,>
line 1797, column 21
[WARNING] 
[WARNING] Some problems were encountered while building the effective model for org.apache.atlas:atlas-webapp:war:0.8-incubating-SNAPSHOT
[WARNING] 'build.plugins.plugin.version' for net.alchim31.maven:scala-maven-plugin is missing.
@ org.apache.atlas:atlas-webapp:[unknown-version], <https://builds.apache.org/job/apache-atlas-nightly/ws/webapp/pom.xml,>
line 594, column 21
[WARNING] 'build.plugins.plugin.version' for org.codehaus.mojo:keytool-maven-plugin is missing.
@ org.apache.atlas:atlas-webapp:[unknown-version], <https://builds.apache.org/job/apache-atlas-nightly/ws/webapp/pom.xml,>
line 429, column 21
[WARNING] 
[WARNING] Some problems were encountered while building the effective model for org.apache.atlas:atlas-docs:jar:0.8-incubating-SNAPSHOT
[WARNING] 'build.plugins.plugin.version' for net.alchim31.maven:scala-maven-plugin is missing.
@ org.apache.atlas:apache-atlas:0.8-incubating-SNAPSHOT, <https://builds.apache.org/job/apache-atlas-nightly/ws/pom.xml,>
line 1797, column 21
[WARNING] 
[WARNING] Some problems were encountered while building the effective model for org.apache.atlas:hdfs-model:jar:0.8-incubating-SNAPSHOT
[WARNING] 'build.plugins.plugin.(groupId:artifactId)' must be unique but found duplicate declaration
of plugin net.alchim31.maven:scala-maven-plugin @ org.apache.atlas:hdfs-model:[unknown-version],
<https://builds.apache.org/job/apache-atlas-nightly/ws/addons/hdfs-model/pom.xml,> line
186, column 21
[WARNING] 
[WARNING] Some problems were encountered while building the effective model for org.apache.atlas:atlas-plugin-classloader:jar:0.8-incubating-SNAPSHOT
[WARNING] 'build.plugins.plugin.version' for net.alchim31.maven:scala-maven-plugin is missing.
@ org.apache.atlas:apache-atlas:0.8-incubating-SNAPSHOT, <https://builds.apache.org/job/apache-atlas-nightly/ws/pom.xml,>
line 1797, column 21
[WARNING] 
[WARNING] Some problems were encountered while building the effective model for org.apache.atlas:hive-bridge-shim:jar:0.8-incubating-SNAPSHOT
[WARNING] 'build.plugins.plugin.version' for net.alchim31.maven:scala-maven-plugin is missing.
@ org.apache.atlas:apache-atlas:0.8-incubating-SNAPSHOT, <https://builds.apache.org/job/apache-atlas-nightly/ws/pom.xml,>
line 1797, column 21
[WARNING] 
[WARNING] Some problems were encountered while building the effective model for org.apache.atlas:hive-bridge:jar:0.8-incubating-SNAPSHOT
[WARNING] 'build.plugins.plugin.version' for net.alchim31.maven:scala-maven-plugin is missing.
@ org.apache.atlas:apache-atlas:0.8-incubating-SNAPSHOT, <https://builds.apache.org/job/apache-atlas-nightly/ws/pom.xml,>
line 1797, column 21
[WARNING] 
[WARNING] Some problems were encountered while building the effective model for org.apache.atlas:falcon-bridge-shim:jar:0.8-incubating-SNAPSHOT
[WARNING] 'build.plugins.plugin.version' for net.alchim31.maven:scala-maven-plugin is missing.
@ org.apache.atlas:apache-atlas:0.8-incubating-SNAPSHOT, <https://builds.apache.org/job/apache-atlas-nightly/ws/pom.xml,>
line 1797, column 21
[WARNING] 
[WARNING] Some problems were encountered while building the effective model for org.apache.atlas:falcon-bridge:jar:0.8-incubating-SNAPSHOT
[WARNING] 'build.plugins.plugin.version' for net.alchim31.maven:scala-maven-plugin is missing.
@ org.apache.atlas:apache-atlas:0.8-incubating-SNAPSHOT, <https://builds.apache.org/job/apache-atlas-nightly/ws/pom.xml,>
line 1797, column 21
[WARNING] 
[WARNING] Some problems were encountered while building the effective model for org.apache.atlas:sqoop-bridge-shim:jar:0.8-incubating-SNAPSHOT
[WARNING] 'build.plugins.plugin.version' for net.alchim31.maven:scala-maven-plugin is missing.
@ org.apache.atlas:apache-atlas:0.8-incubating-SNAPSHOT, <https://builds.apache.org/job/apache-atlas-nightly/ws/pom.xml,>
line 1797, column 21
[WARNING] 
[WARNING] Some problems were encountered while building the effective model for org.apache.atlas:sqoop-bridge:jar:0.8-incubating-SNAPSHOT
[WARNING] 'build.plugins.plugin.version' for net.alchim31.maven:scala-maven-plugin is missing.
@ org.apache.atlas:apache-atlas:0.8-incubating-SNAPSHOT, <https://builds.apache.org/job/apache-atlas-nightly/ws/pom.xml,>
line 1797, column 21
[WARNING] 
[WARNING] Some problems were encountered while building the effective model for org.apache.atlas:storm-bridge-shim:jar:0.8-incubating-SNAPSHOT
[WARNING] 'build.plugins.plugin.version' for net.alchim31.maven:scala-maven-plugin is missing.
@ org.apache.atlas:apache-atlas:0.8-incubating-SNAPSHOT, <https://builds.apache.org/job/apache-atlas-nightly/ws/pom.xml,>
line 1797, column 21
[WARNING] 
[WARNING] Some problems were encountered while building the effective model for org.apache.atlas:storm-bridge:jar:0.8-incubating-SNAPSHOT
[WARNING] 'build.plugins.plugin.(groupId:artifactId)' must be unique but found duplicate declaration
of plugin net.alchim31.maven:scala-maven-plugin @ org.apache.atlas:storm-bridge:[unknown-version],
<https://builds.apache.org/job/apache-atlas-nightly/ws/addons/storm-bridge/pom.xml,>
line 530, column 21
[WARNING] 
[WARNING] Some problems were encountered while building the effective model for org.apache.atlas:atlas-distro:jar:0.8-incubating-SNAPSHOT
[WARNING] 'build.plugins.plugin.version' for net.alchim31.maven:scala-maven-plugin is missing.
@ org.apache.atlas:apache-atlas:0.8-incubating-SNAPSHOT, <https://builds.apache.org/job/apache-atlas-nightly/ws/pom.xml,>
line 1797, column 21
[WARNING] 
[WARNING] Some problems were encountered while building the effective model for org.apache.atlas:apache-atlas:pom:0.8-incubating-SNAPSHOT
[WARNING] 'build.plugins.plugin.version' for net.alchim31.maven:scala-maven-plugin is missing.
@ line 1797, column 21
[WARNING] 
[WARNING] It is highly recommended to fix these problems because they threaten the stability
of your build.
[WARNING] 
[WARNING] For this reason, future Maven versions might no longer support building such malformed
projects.
[WARNING] 
[INFO] ------------------------------------------------------------------------
[INFO] Reactor Build Order:
[INFO] 
[INFO] Apache Atlas Server Build Tools
[INFO] apache-atlas
[INFO] Apache Atlas Integration
[INFO] Apache Atlas Common
[INFO] Apache Atlas Typesystem
[INFO] Apache Atlas Client
[INFO] Apache Atlas Server API
[INFO] Apache Atlas Notification
[INFO] Apache Atlas Graph Database Projects
[INFO] Apache Atlas Graph Database API
[INFO] Graph Database Common Code
[INFO] Shaded version of Apache hbase client
[INFO] Apache Atlas Titan 0.5.4 Graph DB Impl
[INFO] Apache Atlas Graph Database Implementation Dependencies
[INFO] Shaded version of Apache hbase server
[INFO] Apache Atlas Repository
[INFO] Apache Atlas Authorization
[INFO] Apache Atlas Business Catalog
[INFO] Apache Atlas UI
[INFO] Apache Atlas Web Application
[INFO] Apache Atlas Documentation
[INFO] Apache Atlas FileSystem Model
[INFO] Apache Atlas Plugin Classloader
[INFO] Apache Atlas Hive Bridge Shim
[INFO] Apache Atlas Hive Bridge
[INFO] Apache Atlas Falcon Bridge Shim
[INFO] Apache Atlas Falcon Bridge
[INFO] Apache Atlas Sqoop Bridge Shim
[INFO] Apache Atlas Sqoop Bridge
[INFO] Apache Atlas Storm Bridge Shim
[INFO] Apache Atlas Storm Bridge
[INFO] Apache Atlas Distribution
[INFO]                                                                         
[INFO] ------------------------------------------------------------------------
[INFO] Building Apache Atlas Server Build Tools 0.8-incubating-SNAPSHOT
[INFO] ------------------------------------------------------------------------
[INFO] 
[INFO] --- maven-resources-plugin:2.6:resources (default-resources) @ atlas-buildtools ---
[WARNING] Using platform encoding (UTF-8 actually) to copy filtered resources, i.e. build
is platform dependent!
[INFO] Copying 6 resources
[INFO] 
[INFO] --- maven-compiler-plugin:3.1:compile (default-compile) @ atlas-buildtools ---
[INFO] No sources to compile
[INFO] 
[INFO] --- maven-resources-plugin:2.6:testResources (default-testResources) @ atlas-buildtools
---
[WARNING] Using platform encoding (UTF-8 actually) to copy filtered resources, i.e. build
is platform dependent!
[INFO] skip non existing resourceDirectory <https://builds.apache.org/job/apache-atlas-nightly/ws/build-tools/src/test/resources>
[INFO] 
[INFO] --- maven-compiler-plugin:3.1:testCompile (default-testCompile) @ atlas-buildtools
---
[INFO] No sources to compile
[INFO] 
[INFO] --- maven-surefire-plugin:2.12.4:test (default-test) @ atlas-buildtools ---
[INFO] No tests to run.
[INFO] 
[INFO] --- maven-jar-plugin:2.4:jar (default-jar) @ atlas-buildtools ---
[INFO] 
[INFO] --- maven-install-plugin:2.4:install (default-install) @ atlas-buildtools ---
[INFO] Installing <https://builds.apache.org/job/apache-atlas-nightly/ws/build-tools/target/atlas-buildtools-0.8-incubating-SNAPSHOT.jar>
to /home/jenkins/.m2/repository/org/apache/atlas/atlas-buildtools/0.8-incubating-SNAPSHOT/atlas-buildtools-0.8-incubating-SNAPSHOT.jar
[INFO] Installing <https://builds.apache.org/job/apache-atlas-nightly/ws/build-tools/pom.xml>
to /home/jenkins/.m2/repository/org/apache/atlas/atlas-buildtools/0.8-incubating-SNAPSHOT/atlas-buildtools-0.8-incubating-SNAPSHOT.pom
[INFO] 
[INFO] --- maven-deploy-plugin:2.7:deploy (default-deploy) @ atlas-buildtools ---
[INFO] ------------------------------------------------------------------------
[INFO] Reactor Summary:
[INFO] 
[INFO] Apache Atlas Server Build Tools .................... FAILURE [  0.856 s]
[INFO] apache-atlas ....................................... SKIPPED
[INFO] Apache Atlas Integration ........................... SKIPPED
[INFO] Apache Atlas Common ................................ SKIPPED
[INFO] Apache Atlas Typesystem ............................ SKIPPED
[INFO] Apache Atlas Client ................................ SKIPPED
[INFO] Apache Atlas Server API ............................ SKIPPED
[INFO] Apache Atlas Notification .......................... SKIPPED
[INFO] Apache Atlas Graph Database Projects ............... SKIPPED
[INFO] Apache Atlas Graph Database API .................... SKIPPED
[INFO] Graph Database Common Code ......................... SKIPPED
[INFO] Shaded version of Apache hbase client .............. SKIPPED
[INFO] Apache Atlas Titan 0.5.4 Graph DB Impl ............. SKIPPED
[INFO] Apache Atlas Graph Database Implementation Dependencies SKIPPED
[INFO] Shaded version of Apache hbase server .............. SKIPPED
[INFO] Apache Atlas Repository ............................ SKIPPED
[INFO] Apache Atlas Authorization ......................... SKIPPED
[INFO] Apache Atlas Business Catalog ...................... SKIPPED
[INFO] Apache Atlas UI .................................... SKIPPED
[INFO] Apache Atlas Web Application ....................... SKIPPED
[INFO] Apache Atlas Documentation ......................... SKIPPED
[INFO] Apache Atlas FileSystem Model ...................... SKIPPED
[INFO] Apache Atlas Plugin Classloader .................... SKIPPED
[INFO] Apache Atlas Hive Bridge Shim ...................... SKIPPED
[INFO] Apache Atlas Hive Bridge ........................... SKIPPED
[INFO] Apache Atlas Falcon Bridge Shim .................... SKIPPED
[INFO] Apache Atlas Falcon Bridge ......................... SKIPPED
[INFO] Apache Atlas Sqoop Bridge Shim ..................... SKIPPED
[INFO] Apache Atlas Sqoop Bridge .......................... SKIPPED
[INFO] Apache Atlas Storm Bridge Shim ..................... SKIPPED
[INFO] Apache Atlas Storm Bridge .......................... SKIPPED
[INFO] Apache Atlas Distribution .......................... SKIPPED
[INFO] ------------------------------------------------------------------------
[INFO] BUILD FAILURE
[INFO] ------------------------------------------------------------------------
[INFO] Total time: 3.251 s
[INFO] Finished at: 2016-11-28T06:13:42+00:00
[INFO] Final Memory: 33M/913M
[INFO] ------------------------------------------------------------------------
[ERROR] Failed to execute goal org.apache.maven.plugins:maven-deploy-plugin:2.7:deploy (default-deploy)
on project atlas-buildtools: Deployment failed: repository element was not specified in the
POM inside distributionManagement element or in -DaltDeploymentRepository=id::layout::url
parameter -> [Help 1]
[ERROR] 
[ERROR] To see the full stack trace of the errors, re-run Maven with the -e switch.
[ERROR] Re-run Maven using the -X switch to enable full debug logging.
[ERROR] 
[ERROR] For more information about the errors and possible solutions, please read the following
articles:
[ERROR] [Help 1] http://cwiki.apache.org/confluence/display/MAVEN/MojoExecutionException
Build step 'Execute shell' marked build as failure
[CHECKSTYLE] Collecting checkstyle analysis files...
[CHECKSTYLE] Finding all files that match the pattern **/target/checkstyle-result.xml
[CHECKSTYLE] Parsing 32 files in <https://builds.apache.org/job/apache-atlas-nightly/ws/>
[CHECKSTYLE] Successfully parsed file <https://builds.apache.org/job/apache-atlas-nightly/ws/addons/falcon-bridge-shim/target/checkstyle-result.xml>
with 31 unique warnings and 0 duplicates.
[CHECKSTYLE] Successfully parsed file <https://builds.apache.org/job/apache-atlas-nightly/ws/addons/falcon-bridge/target/checkstyle-result.xml>
with 424 unique warnings and 0 duplicates.
[CHECKSTYLE] Successfully parsed file <https://builds.apache.org/job/apache-atlas-nightly/ws/addons/hdfs-model/target/checkstyle-result.xml>
with 424 unique warnings and 0 duplicates.
[CHECKSTYLE] Successfully parsed file <https://builds.apache.org/job/apache-atlas-nightly/ws/addons/hive-bridge-shim/target/checkstyle-result.xml>
with 439 unique warnings and 0 duplicates.
[CHECKSTYLE] Successfully parsed file <https://builds.apache.org/job/apache-atlas-nightly/ws/addons/hive-bridge/target/checkstyle-result.xml>
with 2237 unique warnings and 0 duplicates.
[CHECKSTYLE] Successfully parsed file <https://builds.apache.org/job/apache-atlas-nightly/ws/addons/sqoop-bridge-shim/target/checkstyle-result.xml>
with 2253 unique warnings and 0 duplicates.
[CHECKSTYLE] Successfully parsed file <https://builds.apache.org/job/apache-atlas-nightly/ws/addons/sqoop-bridge/target/checkstyle-result.xml>
with 2378 unique warnings and 0 duplicates.
[CHECKSTYLE] Successfully parsed file <https://builds.apache.org/job/apache-atlas-nightly/ws/addons/storm-bridge-shim/target/checkstyle-result.xml>
with 2399 unique warnings and 0 duplicates.
[CHECKSTYLE] Successfully parsed file <https://builds.apache.org/job/apache-atlas-nightly/ws/addons/storm-bridge/target/checkstyle-result.xml>
with 2669 unique warnings and 0 duplicates.
[CHECKSTYLE] Successfully parsed file <https://builds.apache.org/job/apache-atlas-nightly/ws/authorization/target/checkstyle-result.xml>
with 3159 unique warnings and 0 duplicates.
[CHECKSTYLE] Successfully parsed file <https://builds.apache.org/job/apache-atlas-nightly/ws/catalog/target/checkstyle-result.xml>
with 5303 unique warnings and 0 duplicates.
[CHECKSTYLE] Successfully parsed file <https://builds.apache.org/job/apache-atlas-nightly/ws/client/target/checkstyle-result.xml>
with 6731 unique warnings and 0 duplicates.
[CHECKSTYLE] Successfully parsed file <https://builds.apache.org/job/apache-atlas-nightly/ws/common/target/checkstyle-result.xml>
with 7556 unique warnings and 0 duplicates.
[CHECKSTYLE] Successfully parsed file <https://builds.apache.org/job/apache-atlas-nightly/ws/dashboardv2/target/checkstyle-result.xml>
with 7556 unique warnings and 0 duplicates.
[CHECKSTYLE] Successfully parsed file <https://builds.apache.org/job/apache-atlas-nightly/ws/distro/target/checkstyle-result.xml>
with 7556 unique warnings and 0 duplicates.
[CHECKSTYLE] Successfully parsed file <https://builds.apache.org/job/apache-atlas-nightly/ws/docs/target/checkstyle-result.xml>
with 7556 unique warnings and 0 duplicates.
[CHECKSTYLE] Successfully parsed file <https://builds.apache.org/job/apache-atlas-nightly/ws/graphdb/api/target/checkstyle-result.xml>
with 7785 unique warnings and 0 duplicates.
[CHECKSTYLE] Successfully parsed file <https://builds.apache.org/job/apache-atlas-nightly/ws/graphdb/common/target/checkstyle-result.xml>
with 7930 unique warnings and 0 duplicates.
[CHECKSTYLE] Successfully parsed file <https://builds.apache.org/job/apache-atlas-nightly/ws/graphdb/graphdb-impls/target/checkstyle-result.xml>
with 7930 unique warnings and 0 duplicates.
[CHECKSTYLE] Successfully parsed file <https://builds.apache.org/job/apache-atlas-nightly/ws/graphdb/target/checkstyle-result.xml>
with 7930 unique warnings and 0 duplicates.
[CHECKSTYLE] Successfully parsed file <https://builds.apache.org/job/apache-atlas-nightly/ws/graphdb/titan0/target/checkstyle-result.xml>
with 10167 unique warnings and 0 duplicates.
[CHECKSTYLE] Successfully parsed file <https://builds.apache.org/job/apache-atlas-nightly/ws/intg/target/checkstyle-result.xml>
with 14676 unique warnings and 0 duplicates.
[CHECKSTYLE] Successfully parsed file <https://builds.apache.org/job/apache-atlas-nightly/ws/notification/target/checkstyle-result.xml>
with 15840 unique warnings and 0 duplicates.
[CHECKSTYLE] Successfully parsed file <https://builds.apache.org/job/apache-atlas-nightly/ws/plugin-classloader/target/checkstyle-result.xml>
with 15947 unique warnings and 0 duplicates.
[CHECKSTYLE] Successfully parsed file <https://builds.apache.org/job/apache-atlas-nightly/ws/repository/target/checkstyle-result.xml>
with 24498 unique warnings and 0 duplicates.
[CHECKSTYLE] Successfully parsed file <https://builds.apache.org/job/apache-atlas-nightly/ws/server-api/target/checkstyle-result.xml>
with 24810 unique warnings and 0 duplicates.
[CHECKSTYLE] Successfully parsed file <https://builds.apache.org/job/apache-atlas-nightly/ws/shaded/hbase-client-shaded/target/checkstyle-result.xml>
with 24810 unique warnings and 0 duplicates.
[CHECKSTYLE] Successfully parsed file <https://builds.apache.org/job/apache-atlas-nightly/ws/shaded/hbase-server-shaded/target/checkstyle-result.xml>
with 24810 unique warnings and 0 duplicates.
[CHECKSTYLE] Successfully parsed file <https://builds.apache.org/job/apache-atlas-nightly/ws/target/checkstyle-result.xml>
with 24810 unique warnings and 0 duplicates.
[CHECKSTYLE] Successfully parsed file <https://builds.apache.org/job/apache-atlas-nightly/ws/titan/target/checkstyle-result.xml>
with 25272 unique warnings and 0 duplicates.
[CHECKSTYLE] Successfully parsed file <https://builds.apache.org/job/apache-atlas-nightly/ws/typesystem/target/checkstyle-result.xml>
with 29413 unique warnings and 0 duplicates.
[CHECKSTYLE] Successfully parsed file <https://builds.apache.org/job/apache-atlas-nightly/ws/webapp/target/checkstyle-result.xml>
with 36485 unique warnings and 0 duplicates.
[CHECKSTYLE] Computing warning deltas based on reference build #270
[FINDBUGS] Collecting findbugs analysis files...
[FINDBUGS] Finding all files that match the pattern **/target/findbugs.xml
[FINDBUGS] Parsing 23 files in <https://builds.apache.org/job/apache-atlas-nightly/ws/>
[FINDBUGS] Successfully parsed file <https://builds.apache.org/job/apache-atlas-nightly/ws/addons/falcon-bridge-shim/target/findbugs.xml>
with 0 unique warnings and 0 duplicates.
[FINDBUGS] Successfully parsed file <https://builds.apache.org/job/apache-atlas-nightly/ws/addons/falcon-bridge/target/findbugs.xml>
with 0 unique warnings and 0 duplicates.
[FINDBUGS] Successfully parsed file <https://builds.apache.org/job/apache-atlas-nightly/ws/addons/hive-bridge-shim/target/findbugs.xml>
with 0 unique warnings and 0 duplicates.
[FINDBUGS] Successfully parsed file <https://builds.apache.org/job/apache-atlas-nightly/ws/addons/hive-bridge/target/findbugs.xml>
with 0 unique warnings and 0 duplicates.
[FINDBUGS] Successfully parsed file <https://builds.apache.org/job/apache-atlas-nightly/ws/addons/sqoop-bridge-shim/target/findbugs.xml>
with 0 unique warnings and 0 duplicates.
[FINDBUGS] Successfully parsed file <https://builds.apache.org/job/apache-atlas-nightly/ws/addons/sqoop-bridge/target/findbugs.xml>
with 0 unique warnings and 0 duplicates.
[FINDBUGS] Successfully parsed file <https://builds.apache.org/job/apache-atlas-nightly/ws/addons/storm-bridge-shim/target/findbugs.xml>
with 0 unique warnings and 0 duplicates.
[FINDBUGS] Successfully parsed file <https://builds.apache.org/job/apache-atlas-nightly/ws/addons/storm-bridge/target/findbugs.xml>
with 0 unique warnings and 0 duplicates.
[FINDBUGS] Successfully parsed file <https://builds.apache.org/job/apache-atlas-nightly/ws/authorization/target/findbugs.xml>
with 0 unique warnings and 0 duplicates.
[FINDBUGS] Successfully parsed file <https://builds.apache.org/job/apache-atlas-nightly/ws/catalog/target/findbugs.xml>
with 0 unique warnings and 0 duplicates.
[FINDBUGS] Successfully parsed file <https://builds.apache.org/job/apache-atlas-nightly/ws/client/target/findbugs.xml>
with 0 unique warnings and 0 duplicates.
[FINDBUGS] Successfully parsed file <https://builds.apache.org/job/apache-atlas-nightly/ws/common/target/findbugs.xml>
with 0 unique warnings and 0 duplicates.
[FINDBUGS] Successfully parsed file <https://builds.apache.org/job/apache-atlas-nightly/ws/graphdb/api/target/findbugs.xml>
with 0 unique warnings and 0 duplicates.
[FINDBUGS] Successfully parsed file <https://builds.apache.org/job/apache-atlas-nightly/ws/graphdb/common/target/findbugs.xml>
with 0 unique warnings and 0 duplicates.
[FINDBUGS] Successfully parsed file <https://builds.apache.org/job/apache-atlas-nightly/ws/graphdb/titan0/target/findbugs.xml>
with 0 unique warnings and 0 duplicates.
[FINDBUGS] Successfully parsed file <https://builds.apache.org/job/apache-atlas-nightly/ws/intg/target/findbugs.xml>
with 0 unique warnings and 0 duplicates.
[FINDBUGS] Successfully parsed file <https://builds.apache.org/job/apache-atlas-nightly/ws/notification/target/findbugs.xml>
with 0 unique warnings and 0 duplicates.
[FINDBUGS] Successfully parsed file <https://builds.apache.org/job/apache-atlas-nightly/ws/plugin-classloader/target/findbugs.xml>
with 0 unique warnings and 0 duplicates.
[FINDBUGS] Successfully parsed file <https://builds.apache.org/job/apache-atlas-nightly/ws/repository/target/findbugs.xml>
with 0 unique warnings and 0 duplicates.
[FINDBUGS] Successfully parsed file <https://builds.apache.org/job/apache-atlas-nightly/ws/server-api/target/findbugs.xml>
with 0 unique warnings and 0 duplicates.
[FINDBUGS] Successfully parsed file <https://builds.apache.org/job/apache-atlas-nightly/ws/titan/target/findbugs.xml>
with 0 unique warnings and 0 duplicates.
[FINDBUGS] Successfully parsed file <https://builds.apache.org/job/apache-atlas-nightly/ws/typesystem/target/findbugs.xml>
with 0 unique warnings and 0 duplicates.
[FINDBUGS] Successfully parsed file <https://builds.apache.org/job/apache-atlas-nightly/ws/webapp/target/findbugs.xml>
with 0 unique warnings and 0 duplicates.
[FINDBUGS] Computing warning deltas based on reference build #270
Archiving artifacts
TestNG Reports Processing: START
Looking for TestNG results report in workspace using pattern: **/target/surefire-reports/testng-results.xml,**/target/failsafe-reports/testng-results.xml
testng-results.xml was last modified before this build started. Ignoring it.
testng-results.xml was last modified before this build started. Ignoring it.
testng-results.xml was last modified before this build started. Ignoring it.
testng-results.xml was last modified before this build started. Ignoring it.
Saving reports...
Processing '/x1/jenkins/jenkins-home/jobs/apache-atlas-nightly/builds/500/testng/testng-results-1.xml'
Processing '/x1/jenkins/jenkins-home/jobs/apache-atlas-nightly/builds/500/testng/testng-results-10.xml'
Processing '/x1/jenkins/jenkins-home/jobs/apache-atlas-nightly/builds/500/testng/testng-results-11.xml'
Processing '/x1/jenkins/jenkins-home/jobs/apache-atlas-nightly/builds/500/testng/testng-results-12.xml'
Processing '/x1/jenkins/jenkins-home/jobs/apache-atlas-nightly/builds/500/testng/testng-results-13.xml'
Processing '/x1/jenkins/jenkins-home/jobs/apache-atlas-nightly/builds/500/testng/testng-results-2.xml'
Processing '/x1/jenkins/jenkins-home/jobs/apache-atlas-nightly/builds/500/testng/testng-results-3.xml'
Processing '/x1/jenkins/jenkins-home/jobs/apache-atlas-nightly/builds/500/testng/testng-results-4.xml'
Processing '/x1/jenkins/jenkins-home/jobs/apache-atlas-nightly/builds/500/testng/testng-results-5.xml'
Processing '/x1/jenkins/jenkins-home/jobs/apache-atlas-nightly/builds/500/testng/testng-results-6.xml'
Processing '/x1/jenkins/jenkins-home/jobs/apache-atlas-nightly/builds/500/testng/testng-results-7.xml'
Processing '/x1/jenkins/jenkins-home/jobs/apache-atlas-nightly/builds/500/testng/testng-results-8.xml'
Processing '/x1/jenkins/jenkins-home/jobs/apache-atlas-nightly/builds/500/testng/testng-results-9.xml'
Processing '/x1/jenkins/jenkins-home/jobs/apache-atlas-nightly/builds/500/testng/testng-results.xml'
TestNG Reports Processing: FINISH

Mime
View raw message