atlas-dev mailing list archives

Site index · List index
Message view « Date » · « Thread »
Top « Date » · « Thread »
From Apache Jenkins Server <jenk...@builds.apache.org>
Subject Build failed in Jenkins: apache-atlas-nightly #493
Date Thu, 24 Nov 2016 02:45:55 GMT
See <https://builds.apache.org/job/apache-atlas-nightly/493/changes>

Changes:

[madhan] ATLAS-1319: fix converters between v1 and v2 to handle struct type

------------------------------------------
[...truncated 8579 lines...]
127.0.0.1 - - [24/Nov/2016:02:33:22 +0000] "POST /api/atlas/entities HTTP/1.1" 201 - "-" "Java/1.7.0_80"
127.0.0.1 - - [24/Nov/2016:02:33:22 +0000] "POST /api/atlas/entities HTTP/1.1" 201 - "-" "Java/1.7.0_80"
127.0.0.1 - - [24/Nov/2016:02:33:23 +0000] "POST /api/atlas/entities HTTP/1.1" 201 - "-" "Java/1.7.0_80"
127.0.0.1 - - [24/Nov/2016:02:33:23 +0000] "POST /api/atlas/entities HTTP/1.1" 201 - "-" "Java/1.7.0_80"
127.0.0.1 - - [24/Nov/2016:02:33:23 +0000] "POST /api/atlas/entities HTTP/1.1" 201 - "-" "Java/1.7.0_80"
127.0.0.1 - - [24/Nov/2016:02:33:23 +0000] "POST /api/atlas/entities HTTP/1.1" 201 - "-" "Java/1.7.0_80"
127.0.0.1 - - [24/Nov/2016:02:33:23 +0000] "GET /api/atlas/lineage/hive/table/sales_fact_monthly_mvGo4gR80LSI/inputs/graph
HTTP/1.1" 200 - "-" "Java/1.7.0_80"
127.0.0.1 - - [24/Nov/2016:02:33:25 +0000] "GET /api/atlas/entities?type=hive_table&property=qualifiedName&value=sales_fact_monthly_mvGo4gR80LSI
HTTP/1.1" 200 - "-" "Java/1.7.0_80"
127.0.0.1 - - [24/Nov/2016:02:33:25 +0000] "GET /api/atlas/lineage/7c8b2aa4-ccfa-407f-9bea-6912b83e7b8d/inputs/graph
HTTP/1.1" 200 - "-" "Java/1.7.0_80"
127.0.0.1 - - [24/Nov/2016:02:33:27 +0000] "GET /api/atlas/lineage/hive/table/sales_fact1tk0cCwnUn/outputs/graph
HTTP/1.1" 200 - "-" "Java/1.7.0_80"
127.0.0.1 - - [24/Nov/2016:02:33:29 +0000] "GET /api/atlas/entities?type=hive_table&property=qualifiedName&value=sales_fact1tk0cCwnUn
HTTP/1.1" 200 - "-" "Java/1.7.0_80"
127.0.0.1 - - [24/Nov/2016:02:33:29 +0000] "GET /api/atlas/lineage/275006eb-a9a7-4cdf-814a-fcca34642a84/outputs/graph
HTTP/1.1" 200 - "-" "Java/1.7.0_80"
127.0.0.1 - - [24/Nov/2016:02:33:31 +0000] "GET /api/atlas/lineage/hive/table/sales_fact1tk0cCwnUn/schema
HTTP/1.1" 200 - "-" "Java/1.7.0_80"
127.0.0.1 - - [24/Nov/2016:02:33:32 +0000] "GET /api/atlas/lineage/hive/table/SalesxWJMW5j8YT/schema
HTTP/1.1" 404 - "-" "Java/1.7.0_80"
127.0.0.1 - - [24/Nov/2016:02:33:32 +0000] "GET /api/atlas/entities?type=hive_table&property=qualifiedName&value=sales_fact1tk0cCwnUn
HTTP/1.1" 200 - "-" "Java/1.7.0_80"
127.0.0.1 - - [24/Nov/2016:02:33:32 +0000] "GET /api/atlas/lineage/275006eb-a9a7-4cdf-814a-fcca34642a84/schema
HTTP/1.1" 200 - "-" "Java/1.7.0_80"
127.0.0.1 - - [24/Nov/2016:02:33:33 +0000] "GET /api/atlas/lineage/hive/table/blah/schema
HTTP/1.1" 404 - "-" "Java/1.7.0_80"
127.0.0.1 - - [24/Nov/2016:02:33:33 +0000] "GET /api/atlas/entities?type=hive_table&property=qualifiedName&value=sales_fact_monthly_mvN4S3thjU0e
HTTP/1.1" 200 - "-" "Java/1.7.0_80"
127.0.0.1 - - [24/Nov/2016:02:33:33 +0000] "GET /api/atlas/v2/lineage/e5d3bccc-a8f0-4cf4-ae9f-293fe7699bbb?direction=INPUT&depth=5
HTTP/1.1" 404 - "-" "Java/1.7.0_80"
127.0.0.1 - - [24/Nov/2016:02:33:33 +0000] "GET /api/atlas/entities?type=hive_table&property=qualifiedName&value=sales_fact_monthly_mvN4S3thjU0e
HTTP/1.1" 200 - "-" "Java/1.7.0_80"
127.0.0.1 - - [24/Nov/2016:02:33:33 +0000] "GET /api/atlas/v2/lineage/e5d3bccc-a8f0-4cf4-ae9f-293fe7699bbb?direction=BOTH&depth=5
HTTP/1.1" 404 - "-" "Java/1.7.0_80"
127.0.0.1 - - [24/Nov/2016:02:33:33 +0000] "GET /api/atlas/entities?type=hive_table&property=qualifiedName&value=sales_factjmwDQTXKBn
HTTP/1.1" 200 - "-" "Java/1.7.0_80"
127.0.0.1 - - [24/Nov/2016:02:33:33 +0000] "GET /api/atlas/v2/lineage/d8a1490d-c569-49d9-81f1-13938aac5118?direction=OUTPUT&depth=5
HTTP/1.1" 404 - "-" "Java/1.7.0_80"
Tests run: 11, Failures: 3, Errors: 0, Skipped: 0, Time elapsed: 14.258 sec <<< FAILURE!
- in org.apache.atlas.web.resources.EntityLineageJerseyResourceIT
testInputLineageInfo(org.apache.atlas.web.resources.EntityLineageJerseyResourceIT)  Time elapsed:
0.046 sec  <<< FAILURE!
java.lang.AssertionError: expected:<200> but was:<404>
	at org.apache.atlas.web.resources.EntityLineageJerseyResourceIT.testInputLineageInfo(EntityLineageJerseyResourceIT.java:74)

testLineageInfo(org.apache.atlas.web.resources.EntityLineageJerseyResourceIT)  Time elapsed:
0.036 sec  <<< FAILURE!
java.lang.AssertionError: expected:<200> but was:<404>
	at org.apache.atlas.web.resources.EntityLineageJerseyResourceIT.testLineageInfo(EntityLineageJerseyResourceIT.java:134)

testOutputLineageInfo(org.apache.atlas.web.resources.EntityLineageJerseyResourceIT)  Time
elapsed: 0.031 sec  <<< FAILURE!
java.lang.AssertionError: expected:<200> but was:<404>
	at org.apache.atlas.web.resources.EntityLineageJerseyResourceIT.testOutputLineageInfo(EntityLineageJerseyResourceIT.java:104)

Running org.apache.atlas.CredentialProviderUtilityIT
Tests run: 4, Failures: 0, Errors: 0, Skipped: 0, Time elapsed: 1.556 sec - in org.apache.atlas.CredentialProviderUtilityIT
Running org.apache.atlas.notification.EntityNotificationIT
127.0.0.1 - - [24/Nov/2016:02:33:38 +0000] "GET /api/atlas/types/tableType HTTP/1.1" 200 -
"-" "Java/1.7.0_80"
127.0.0.1 - - [24/Nov/2016:02:33:38 +0000] "GET /api/atlas/types/serdeType HTTP/1.1" 200 -
"-" "Java/1.7.0_80"
127.0.0.1 - - [24/Nov/2016:02:33:38 +0000] "GET /api/atlas/types/classification HTTP/1.1"
200 - "-" "Java/1.7.0_80"
127.0.0.1 - - [24/Nov/2016:02:33:38 +0000] "GET /api/atlas/types/hive_db HTTP/1.1" 200 - "-"
"Java/1.7.0_80"
127.0.0.1 - - [24/Nov/2016:02:33:39 +0000] "POST /api/atlas/entities HTTP/1.1" 201 - "-" "Java/1.7.0_80"
127.0.0.1 - - [24/Nov/2016:02:33:40 +0000] "POST /api/atlas/entities HTTP/1.1" 201 - "-" "Java/1.7.0_80"
127.0.0.1 - - [24/Nov/2016:02:33:41 +0000] "POST /api/atlas/types HTTP/1.1" 201 - "-" "Java/1.7.0_80"
127.0.0.1 - - [24/Nov/2016:02:33:41 +0000] "POST /api/atlas/types HTTP/1.1" 201 - "-" "Java/1.7.0_80"
127.0.0.1 - - [24/Nov/2016:02:33:41 +0000] "POST /api/atlas/types HTTP/1.1" 201 - "-" "Java/1.7.0_80"
127.0.0.1 - - [24/Nov/2016:02:33:41 +0000] "POST /api/atlas/entities/570a784c-5aae-4f43-a9fb-9a8a6052f96d/traits
HTTP/1.1" 201 - "-" "Java/1.7.0_80"
127.0.0.1 - - [24/Nov/2016:02:33:41 +0000] "POST /api/atlas/types HTTP/1.1" 201 - "-" "Java/1.7.0_80"
127.0.0.1 - - [24/Nov/2016:02:33:41 +0000] "POST /api/atlas/entities/570a784c-5aae-4f43-a9fb-9a8a6052f96d/traits
HTTP/1.1" 201 - "-" "Java/1.7.0_80"
127.0.0.1 - - [24/Nov/2016:02:33:41 +0000] "DELETE /api/atlas/entities/570a784c-5aae-4f43-a9fb-9a8a6052f96d/traits/TraittfOuogEADe
HTTP/1.1" 200 - "-" "Java/1.7.0_80"
127.0.0.1 - - [24/Nov/2016:02:33:41 +0000] "POST /api/atlas/entities/570a784c-5aae-4f43-a9fb-9a8a6052f96d?property=description
HTTP/1.1" 200 - "-" "Java/1.7.0_80"
127.0.0.1 - - [24/Nov/2016:02:33:41 +0000] "POST /api/atlas/entities HTTP/1.1" 201 - "-" "Java/1.7.0_80"
127.0.0.1 - - [24/Nov/2016:02:33:41 +0000] "POST /api/atlas/entities HTTP/1.1" 201 - "-" "Java/1.7.0_80"
127.0.0.1 - - [24/Nov/2016:02:33:42 +0000] "DELETE /api/atlas/entities?type=hive_table&property=qualifiedName&value=table-AAfM36yFL5
HTTP/1.1" 200 - "-" "Java/1.7.0_80"
Tests run: 5, Failures: 0, Errors: 0, Skipped: 0, Time elapsed: 5.963 sec - in org.apache.atlas.notification.EntityNotificationIT
Running org.apache.atlas.notification.NotificationHookConsumerIT
127.0.0.1 - - [24/Nov/2016:02:33:45 +0000] "GET /api/atlas/types/tableType HTTP/1.1" 200 -
"-" "Java/1.7.0_80"
127.0.0.1 - - [24/Nov/2016:02:33:45 +0000] "GET /api/atlas/types/serdeType HTTP/1.1" 200 -
"-" "Java/1.7.0_80"
127.0.0.1 - - [24/Nov/2016:02:33:45 +0000] "GET /api/atlas/types/classification HTTP/1.1"
200 - "-" "Java/1.7.0_80"
127.0.0.1 - - [24/Nov/2016:02:33:45 +0000] "GET /api/atlas/types/hive_db HTTP/1.1" 200 - "-"
"Java/1.7.0_80"
127.0.0.1 - - [24/Nov/2016:02:33:46 +0000] "GET /api/atlas/discovery/search/dsl?query=hive_db+where+qualifiedName%3D'dbSneMIIOa8b'&limit=10&offset=0
HTTP/1.1" 200 - "-" "Java/1.7.0_80"
127.0.0.1 - - [24/Nov/2016:02:33:47 +0000] "GET /api/atlas/entities?type=hive_db&property=qualifiedName&value=dbSneMIIOa8b
HTTP/1.1" 200 - "-" "Java/1.7.0_80"
127.0.0.1 - - [24/Nov/2016:02:33:47 +0000] "GET /api/atlas/entities/e77a7740-a4c8-487a-8029-c492d0c029a1/audit?count=1
HTTP/1.1" 200 - "-" "Java/1.7.0_80"
127.0.0.1 - - [24/Nov/2016:02:33:47 +0000] "POST /api/atlas/entities HTTP/1.1" 201 - "-" "Java/1.7.0_80"
127.0.0.1 - - [24/Nov/2016:02:33:47 +0000] "GET /api/atlas/entities/eccfde8d-5978-4fc3-a1f9-f9605f07558d
HTTP/1.1" 200 - "-" "Java/1.7.0_80"
127.0.0.1 - - [24/Nov/2016:02:33:47 +0000] "GET /api/atlas/entities/eccfde8d-5978-4fc3-a1f9-f9605f07558d
HTTP/1.1" 200 - "-" "Java/1.7.0_80"
127.0.0.1 - - [24/Nov/2016:02:33:47 +0000] "GET /api/atlas/discovery/search/dsl?query=hive_db+where+name%3D'dbMlEGsAldLg'&limit=10&offset=0
HTTP/1.1" 200 - "-" "Java/1.7.0_80"
127.0.0.1 - - [24/Nov/2016:02:33:48 +0000] "GET /api/atlas/discovery/search/dsl?query=hive_db+where+name%3D'dbMlEGsAldLg'&limit=10&offset=0
HTTP/1.1" 200 - "-" "Java/1.7.0_80"
127.0.0.1 - - [24/Nov/2016:02:33:49 +0000] "POST /api/atlas/entities HTTP/1.1" 201 - "-" "Java/1.7.0_80"
127.0.0.1 - - [24/Nov/2016:02:33:49 +0000] "GET /api/atlas/discovery/search/dsl?query=hive_db+where+qualifiedName%3D'dbjDoDNhxUgp'&limit=10&offset=0
HTTP/1.1" 200 - "-" "Java/1.7.0_80"
127.0.0.1 - - [24/Nov/2016:02:33:50 +0000] "GET /api/atlas/entities?type=hive_db&property=qualifiedName&value=dbjDoDNhxUgp
HTTP/1.1" 200 - "-" "Java/1.7.0_80"
127.0.0.1 - - [24/Nov/2016:02:33:50 +0000] "POST /api/atlas/entities HTTP/1.1" 201 - "-" "Java/1.7.0_80"
127.0.0.1 - - [24/Nov/2016:02:33:50 +0000] "GET /api/atlas/entities?type=hive_db&property=qualifiedName&value=dbPb61EYCXp1
HTTP/1.1" 200 - "-" "Java/1.7.0_80"
127.0.0.1 - - [24/Nov/2016:02:33:50 +0000] "GET /api/atlas/entities?type=hive_db&property=qualifiedName&value=dbPb61EYCXp1
HTTP/1.1" 200 - "-" "Java/1.7.0_80"
127.0.0.1 - - [24/Nov/2016:02:33:50 +0000] "GET /api/atlas/entities?type=hive_db&property=qualifiedName&value=dbPb61EYCXp1
HTTP/1.1" 200 - "-" "Java/1.7.0_80"
127.0.0.1 - - [24/Nov/2016:02:33:50 +0000] "POST /api/atlas/entities HTTP/1.1" 201 - "-" "Java/1.7.0_80"
127.0.0.1 - - [24/Nov/2016:02:33:50 +0000] "GET /api/atlas/discovery/search/dsl?query=hive_db+where+qualifiedName%3D'dbYEOD2vF5na'&limit=10&offset=0
HTTP/1.1" 200 - "-" "Java/1.7.0_80"
127.0.0.1 - - [24/Nov/2016:02:33:51 +0000] "GET /api/atlas/discovery/search/dsl?query=hive_db+where+qualifiedName%3D'dbIV6qszrf4s'&limit=10&offset=0
HTTP/1.1" 200 - "-" "Java/1.7.0_80"
Tests run: 6, Failures: 0, Errors: 0, Skipped: 0, Time elapsed: 9.293 sec - in org.apache.atlas.notification.NotificationHookConsumerIT

Results :

Failed tests: 
  EntityLineageJerseyResourceIT.testInputLineageInfo:74 expected:<200> but was:<404>
  EntityLineageJerseyResourceIT.testLineageInfo:134 expected:<200> but was:<404>
  EntityLineageJerseyResourceIT.testOutputLineageInfo:104 expected:<200> but was:<404>

Tests run: 76, Failures: 3, Errors: 0, Skipped: 0

[INFO] 
[INFO] --- jetty-maven-plugin:9.2.12.v20150709:stop (stop-jetty) @ atlas-webapp ---
[INFO] Waiting 10 seconds for jetty to stop
[INFO] Stopped ServerConnector@2a1c9d1e{HTTP/1.1}{0.0.0.0:31000}
[INFO] Closing Spring root WebApplicationContext
[INFO] Shutting down log4j
log4j:WARN No appenders could be found for logger (org.apache.atlas.web.listeners.GuiceServletConfig).
log4j:WARN Please initialize the log4j system properly.
log4j:WARN See http://logging.apache.org/log4j/1.2/faq.html#noconfig for more info.
[INFO] Stopped o.e.j.m.p.JettyWebAppContext@5e1349d0{/,<https://builds.apache.org/job/apache-atlas-nightly/ws/webapp/target/atlas-webapp-0.8-incubating-SNAPSHOT/,UNAVAILABLE}{/home/jenkins/jenkins-slave/workspace/apache-atlas-nightly/webapp/target/atlas-webapp-0.8-incubating-SNAPSHOT.war}>
[INFO] Server reports itself as stopped
[INFO] 
[INFO] --- maven-source-plugin:2.4:jar-no-fork (attach-sources) @ atlas-webapp ---
[INFO] Building jar: <https://builds.apache.org/job/apache-atlas-nightly/ws/webapp/target/atlas-webapp-0.8-incubating-SNAPSHOT-sources.jar>
[INFO] 
[INFO] --- maven-source-plugin:2.4:test-jar-no-fork (attach-sources) @ atlas-webapp ---
[INFO] Building jar: <https://builds.apache.org/job/apache-atlas-nightly/ws/webapp/target/atlas-webapp-0.8-incubating-SNAPSHOT-test-sources.jar>
[INFO] 
[INFO] --- maven-failsafe-plugin:2.19.1:verify (verify) @ atlas-webapp ---
[INFO] ------------------------------------------------------------------------
[INFO] Reactor Summary:
[INFO] 
[INFO] apache-atlas ....................................... SUCCESS [ 13.486 s]
[INFO] Apache Atlas Integration ........................... SUCCESS [ 49.479 s]
[INFO] Apache Atlas Common ................................ SUCCESS [ 16.422 s]
[INFO] Apache Atlas Typesystem ............................ SUCCESS [01:28 min]
[INFO] Apache Atlas Client ................................ SUCCESS [ 20.482 s]
[INFO] Apache Atlas Server API ............................ SUCCESS [ 11.705 s]
[INFO] Apache Atlas Notification .......................... SUCCESS [ 44.056 s]
[INFO] Apache Atlas Graph Database Projects ............... SUCCESS [  0.737 s]
[INFO] Apache Atlas Graph Database API .................... SUCCESS [  8.122 s]
[INFO] Graph Database Common Code ......................... SUCCESS [  8.187 s]
[INFO] Shaded version of Apache hbase client .............. SUCCESS [ 11.701 s]
[INFO] Apache Atlas Titan 0.5.4 Graph DB Impl ............. SUCCESS [02:12 min]
[INFO] Apache Atlas Graph Database Implementation Dependencies SUCCESS [  0.958 s]
[INFO] Shaded version of Apache hbase server .............. SUCCESS [ 25.813 s]
[INFO] Apache Atlas Repository ............................ SUCCESS [13:35 min]
[INFO] Apache Atlas Authorization ......................... SUCCESS [ 14.685 s]
[INFO] Apache Atlas Business Catalog ...................... SUCCESS [ 36.651 s]
[INFO] Apache Atlas UI .................................... SUCCESS [ 55.052 s]
[INFO] Apache Atlas Web Application ....................... FAILURE [10:18 min]
[INFO] Apache Atlas Documentation ......................... SKIPPED
[INFO] Apache Atlas FileSystem Model ...................... SKIPPED
[INFO] Apache Atlas Plugin Classloader .................... SKIPPED
[INFO] Apache Atlas Hive Bridge Shim ...................... SKIPPED
[INFO] Apache Atlas Hive Bridge ........................... SKIPPED
[INFO] Apache Atlas Falcon Bridge Shim .................... SKIPPED
[INFO] Apache Atlas Falcon Bridge ......................... SKIPPED
[INFO] Apache Atlas Sqoop Bridge Shim ..................... SKIPPED
[INFO] Apache Atlas Sqoop Bridge .......................... SKIPPED
[INFO] Apache Atlas Storm Bridge Shim ..................... SKIPPED
[INFO] Apache Atlas Storm Bridge .......................... SKIPPED
[INFO] Apache Atlas Distribution .......................... SKIPPED
[INFO] ------------------------------------------------------------------------
[INFO] BUILD FAILURE
[INFO] ------------------------------------------------------------------------
[INFO] Total time: 32:53 min
[INFO] Finished at: 2016-11-24T02:33:56+00:00
[INFO] Final Memory: 340M/1846M
[INFO] ------------------------------------------------------------------------
[ERROR] Failed to execute goal org.apache.maven.plugins:maven-failsafe-plugin:2.19.1:verify
(verify) on project atlas-webapp: There are test failures.
[ERROR] 
[ERROR] Please refer to <https://builds.apache.org/job/apache-atlas-nightly/ws/webapp/target/failsafe-reports>
for the individual test results.
[ERROR] -> [Help 1]
[ERROR] 
[ERROR] To see the full stack trace of the errors, re-run Maven with the -e switch.
[ERROR] Re-run Maven using the -X switch to enable full debug logging.
[ERROR] 
[ERROR] For more information about the errors and possible solutions, please read the following
articles:
[ERROR] [Help 1] http://cwiki.apache.org/confluence/display/MAVEN/MojoFailureException
[ERROR] 
[ERROR] After correcting the problems, you can resume the build with the command
[ERROR]   mvn <goals> -rf :atlas-webapp
Build step 'Execute shell' marked build as failure
[CHECKSTYLE] Collecting checkstyle analysis files...
[CHECKSTYLE] Finding all files that match the pattern **/target/checkstyle-result.xml
[CHECKSTYLE] Parsing 30 files in <https://builds.apache.org/job/apache-atlas-nightly/ws/>
[CHECKSTYLE] Successfully parsed file <https://builds.apache.org/job/apache-atlas-nightly/ws/addons/falcon-bridge-shim/target/checkstyle-result.xml>
with 0 unique warnings and 0 duplicates.
[CHECKSTYLE] Successfully parsed file <https://builds.apache.org/job/apache-atlas-nightly/ws/addons/falcon-bridge/target/checkstyle-result.xml>
with 59 unique warnings and 0 duplicates.
[CHECKSTYLE] Successfully parsed file <https://builds.apache.org/job/apache-atlas-nightly/ws/addons/hdfs-model/target/checkstyle-result.xml>
with 77 unique warnings and 0 duplicates.
[CHECKSTYLE] Successfully parsed file <https://builds.apache.org/job/apache-atlas-nightly/ws/addons/hive-bridge-shim/target/checkstyle-result.xml>
with 77 unique warnings and 0 duplicates.
[CHECKSTYLE] Successfully parsed file <https://builds.apache.org/job/apache-atlas-nightly/ws/addons/sqoop-bridge-shim/target/checkstyle-result.xml>
with 77 unique warnings and 0 duplicates.
[CHECKSTYLE] Successfully parsed file <https://builds.apache.org/job/apache-atlas-nightly/ws/addons/sqoop-bridge/target/checkstyle-result.xml>
with 95 unique warnings and 0 duplicates.
[CHECKSTYLE] Successfully parsed file <https://builds.apache.org/job/apache-atlas-nightly/ws/addons/storm-bridge-shim/target/checkstyle-result.xml>
with 95 unique warnings and 0 duplicates.
[CHECKSTYLE] Successfully parsed file <https://builds.apache.org/job/apache-atlas-nightly/ws/addons/storm-bridge/target/checkstyle-result.xml>
with 175 unique warnings and 0 duplicates.
[CHECKSTYLE] Successfully parsed file <https://builds.apache.org/job/apache-atlas-nightly/ws/authorization/target/checkstyle-result.xml>
with 313 unique warnings and 0 duplicates.
[CHECKSTYLE] Successfully parsed file <https://builds.apache.org/job/apache-atlas-nightly/ws/catalog/target/checkstyle-result.xml>
with 618 unique warnings and 0 duplicates.
[CHECKSTYLE] Successfully parsed file <https://builds.apache.org/job/apache-atlas-nightly/ws/client/target/checkstyle-result.xml>
with 748 unique warnings and 0 duplicates.
[CHECKSTYLE] Successfully parsed file <https://builds.apache.org/job/apache-atlas-nightly/ws/common/target/checkstyle-result.xml>
with 748 unique warnings and 0 duplicates.
[CHECKSTYLE] Successfully parsed file <https://builds.apache.org/job/apache-atlas-nightly/ws/dashboardv2/target/checkstyle-result.xml>
with 748 unique warnings and 0 duplicates.
[CHECKSTYLE] Successfully parsed file <https://builds.apache.org/job/apache-atlas-nightly/ws/distro/target/checkstyle-result.xml>
with 748 unique warnings and 0 duplicates.
[CHECKSTYLE] Successfully parsed file <https://builds.apache.org/job/apache-atlas-nightly/ws/docs/target/checkstyle-result.xml>
with 748 unique warnings and 0 duplicates.
[CHECKSTYLE] Successfully parsed file <https://builds.apache.org/job/apache-atlas-nightly/ws/graphdb/api/target/checkstyle-result.xml>
with 748 unique warnings and 0 duplicates.
[CHECKSTYLE] Successfully parsed file <https://builds.apache.org/job/apache-atlas-nightly/ws/graphdb/common/target/checkstyle-result.xml>
with 748 unique warnings and 0 duplicates.
[CHECKSTYLE] Successfully parsed file <https://builds.apache.org/job/apache-atlas-nightly/ws/graphdb/graphdb-impls/target/checkstyle-result.xml>
with 748 unique warnings and 0 duplicates.
[CHECKSTYLE] Successfully parsed file <https://builds.apache.org/job/apache-atlas-nightly/ws/graphdb/target/checkstyle-result.xml>
with 748 unique warnings and 0 duplicates.
[CHECKSTYLE] Successfully parsed file <https://builds.apache.org/job/apache-atlas-nightly/ws/graphdb/titan0/target/checkstyle-result.xml>
with 748 unique warnings and 0 duplicates.
[CHECKSTYLE] Successfully parsed file <https://builds.apache.org/job/apache-atlas-nightly/ws/intg/target/checkstyle-result.xml>
with 948 unique warnings and 0 duplicates.
[CHECKSTYLE] Successfully parsed file <https://builds.apache.org/job/apache-atlas-nightly/ws/notification/target/checkstyle-result.xml>
with 948 unique warnings and 0 duplicates.
[CHECKSTYLE] Successfully parsed file <https://builds.apache.org/job/apache-atlas-nightly/ws/plugin-classloader/target/checkstyle-result.xml>
with 948 unique warnings and 0 duplicates.
[CHECKSTYLE] Successfully parsed file <https://builds.apache.org/job/apache-atlas-nightly/ws/repository/target/checkstyle-result.xml>
with 2445 unique warnings and 0 duplicates.
[CHECKSTYLE] Successfully parsed file <https://builds.apache.org/job/apache-atlas-nightly/ws/server-api/target/checkstyle-result.xml>
with 2491 unique warnings and 0 duplicates.
[CHECKSTYLE] Successfully parsed file <https://builds.apache.org/job/apache-atlas-nightly/ws/shaded/hbase-client-shaded/target/checkstyle-result.xml>
with 2491 unique warnings and 0 duplicates.
[CHECKSTYLE] Successfully parsed file <https://builds.apache.org/job/apache-atlas-nightly/ws/shaded/hbase-server-shaded/target/checkstyle-result.xml>
with 2491 unique warnings and 0 duplicates.
[CHECKSTYLE] Successfully parsed file <https://builds.apache.org/job/apache-atlas-nightly/ws/target/checkstyle-result.xml>
with 2491 unique warnings and 0 duplicates.
[CHECKSTYLE] Successfully parsed file <https://builds.apache.org/job/apache-atlas-nightly/ws/titan/target/checkstyle-result.xml>
with 2953 unique warnings and 0 duplicates.
[CHECKSTYLE] Successfully parsed file <https://builds.apache.org/job/apache-atlas-nightly/ws/typesystem/target/checkstyle-result.xml>
with 3764 unique warnings and 0 duplicates.
[CHECKSTYLE] Computing warning deltas based on reference build #270
[FINDBUGS] Collecting findbugs analysis files...
[FINDBUGS] Finding all files that match the pattern **/target/findbugs.xml
[FINDBUGS] Parsing 22 files in <https://builds.apache.org/job/apache-atlas-nightly/ws/>
[FINDBUGS] Successfully parsed file <https://builds.apache.org/job/apache-atlas-nightly/ws/addons/falcon-bridge-shim/target/findbugs.xml>
with 0 unique warnings and 0 duplicates.
[FINDBUGS] Successfully parsed file <https://builds.apache.org/job/apache-atlas-nightly/ws/addons/falcon-bridge/target/findbugs.xml>
with 0 unique warnings and 0 duplicates.
[FINDBUGS] Successfully parsed file <https://builds.apache.org/job/apache-atlas-nightly/ws/addons/hdfs-model/target/findbugs.xml>
with 0 unique warnings and 0 duplicates.
[FINDBUGS] Successfully parsed file <https://builds.apache.org/job/apache-atlas-nightly/ws/addons/hive-bridge-shim/target/findbugs.xml>
with 0 unique warnings and 0 duplicates.
[FINDBUGS] Successfully parsed file <https://builds.apache.org/job/apache-atlas-nightly/ws/addons/sqoop-bridge-shim/target/findbugs.xml>
with 0 unique warnings and 0 duplicates.
[FINDBUGS] Successfully parsed file <https://builds.apache.org/job/apache-atlas-nightly/ws/addons/sqoop-bridge/target/findbugs.xml>
with 0 unique warnings and 0 duplicates.
[FINDBUGS] Successfully parsed file <https://builds.apache.org/job/apache-atlas-nightly/ws/addons/storm-bridge-shim/target/findbugs.xml>
with 0 unique warnings and 0 duplicates.
[FINDBUGS] Successfully parsed file <https://builds.apache.org/job/apache-atlas-nightly/ws/addons/storm-bridge/target/findbugs.xml>
with 0 unique warnings and 0 duplicates.
[FINDBUGS] Successfully parsed file <https://builds.apache.org/job/apache-atlas-nightly/ws/authorization/target/findbugs.xml>
with 0 unique warnings and 0 duplicates.
[FINDBUGS] Successfully parsed file <https://builds.apache.org/job/apache-atlas-nightly/ws/catalog/target/findbugs.xml>
with 0 unique warnings and 0 duplicates.
[FINDBUGS] Successfully parsed file <https://builds.apache.org/job/apache-atlas-nightly/ws/client/target/findbugs.xml>
with 0 unique warnings and 0 duplicates.
[FINDBUGS] Successfully parsed file <https://builds.apache.org/job/apache-atlas-nightly/ws/common/target/findbugs.xml>
with 0 unique warnings and 0 duplicates.
[FINDBUGS] Successfully parsed file <https://builds.apache.org/job/apache-atlas-nightly/ws/graphdb/api/target/findbugs.xml>
with 0 unique warnings and 0 duplicates.
[FINDBUGS] Successfully parsed file <https://builds.apache.org/job/apache-atlas-nightly/ws/graphdb/common/target/findbugs.xml>
with 0 unique warnings and 0 duplicates.
[FINDBUGS] Successfully parsed file <https://builds.apache.org/job/apache-atlas-nightly/ws/graphdb/titan0/target/findbugs.xml>
with 0 unique warnings and 0 duplicates.
[FINDBUGS] Successfully parsed file <https://builds.apache.org/job/apache-atlas-nightly/ws/intg/target/findbugs.xml>
with 0 unique warnings and 0 duplicates.
[FINDBUGS] Successfully parsed file <https://builds.apache.org/job/apache-atlas-nightly/ws/notification/target/findbugs.xml>
with 0 unique warnings and 0 duplicates.
[FINDBUGS] Successfully parsed file <https://builds.apache.org/job/apache-atlas-nightly/ws/plugin-classloader/target/findbugs.xml>
with 0 unique warnings and 0 duplicates.
[FINDBUGS] Successfully parsed file <https://builds.apache.org/job/apache-atlas-nightly/ws/repository/target/findbugs.xml>
with 0 unique warnings and 0 duplicates.
[FINDBUGS] Successfully parsed file <https://builds.apache.org/job/apache-atlas-nightly/ws/server-api/target/findbugs.xml>
with 0 unique warnings and 0 duplicates.
[FINDBUGS] Successfully parsed file <https://builds.apache.org/job/apache-atlas-nightly/ws/titan/target/findbugs.xml>
with 0 unique warnings and 0 duplicates.
[FINDBUGS] Successfully parsed file <https://builds.apache.org/job/apache-atlas-nightly/ws/typesystem/target/findbugs.xml>
with 0 unique warnings and 0 duplicates.
[FINDBUGS] Computing warning deltas based on reference build #270
Archiving artifacts
TestNG Reports Processing: START
Looking for TestNG results report in workspace using pattern: **/target/surefire-reports/testng-results.xml,**/target/failsafe-reports/testng-results.xml
testng-results.xml was last modified before this build started. Ignoring it.
testng-results.xml was last modified before this build started. Ignoring it.
testng-results.xml was last modified before this build started. Ignoring it.
testng-results.xml was last modified before this build started. Ignoring it.
testng-results.xml was last modified before this build started. Ignoring it.
testng-results.xml was last modified before this build started. Ignoring it.
testng-results.xml was last modified before this build started. Ignoring it.
testng-results.xml was last modified before this build started. Ignoring it.
testng-results.xml was last modified before this build started. Ignoring it.
testng-results.xml was last modified before this build started. Ignoring it.
testng-results.xml was last modified before this build started. Ignoring it.
Saving reports...
Processing '/x1/jenkins/jenkins-home/jobs/apache-atlas-nightly/builds/493/testng/testng-results-1.xml'
Processing '/x1/jenkins/jenkins-home/jobs/apache-atlas-nightly/builds/493/testng/testng-results-2.xml'
Processing '/x1/jenkins/jenkins-home/jobs/apache-atlas-nightly/builds/493/testng/testng-results-3.xml'
Processing '/x1/jenkins/jenkins-home/jobs/apache-atlas-nightly/builds/493/testng/testng-results-4.xml'
Processing '/x1/jenkins/jenkins-home/jobs/apache-atlas-nightly/builds/493/testng/testng-results-5.xml'
Processing '/x1/jenkins/jenkins-home/jobs/apache-atlas-nightly/builds/493/testng/testng-results-6.xml'
Processing '/x1/jenkins/jenkins-home/jobs/apache-atlas-nightly/builds/493/testng/testng-results-7.xml'
Processing '/x1/jenkins/jenkins-home/jobs/apache-atlas-nightly/builds/493/testng/testng-results.xml'
TestNG Reports Processing: FINISH

Mime
View raw message