atlas-dev mailing list archives

Site index · List index
Message view « Date » · « Thread »
Top « Date » · « Thread »
From Apache Jenkins Server <jenk...@builds.apache.org>
Subject Build failed in Jenkins: apache-atlas-nightly #649
Date Wed, 01 Mar 2017 03:51:37 GMT
See <https://builds.apache.org/job/apache-atlas-nightly/649/display/redirect?page=changes>

Changes:

[madhan] ATLAS-1606: introduced query provider to handle Gremlin version specific

------------------------------------------
[...truncated 504.95 KB...]
127.0.0.1 - - [01/Mar/2017:03:48:01 +0000] "POST /api/atlas/entities HTTP/1.1" 201 - "-" "Java/1.7.0_80"
127.0.0.1 - - [01/Mar/2017:03:48:01 +0000] "POST /api/atlas/entities HTTP/1.1" 201 - "-" "Java/1.7.0_80"
127.0.0.1 - - [01/Mar/2017:03:48:01 +0000] "GET /api/atlas/lineage/hive/table/sales_fact_monthly_mvnObz7fXzgg/inputs/graph
HTTP/1.1" 200 - "-" "Java/1.7.0_80"
127.0.0.1 - - [01/Mar/2017:03:48:03 +0000] "GET /api/atlas/entities?type=hive_table_v1&property=qualifiedName&value=sales_fact_monthly_mvnObz7fXzgg
HTTP/1.1" 200 - "-" "Java/1.7.0_80"
127.0.0.1 - - [01/Mar/2017:03:48:03 +0000] "GET /api/atlas/lineage/70ee984e-f8f9-4de0-a5f0-f056748bdf42/inputs/graph
HTTP/1.1" 200 - "-" "Java/1.7.0_80"
127.0.0.1 - - [01/Mar/2017:03:48:04 +0000] "GET /api/atlas/lineage/hive/table/sales_factOuS9DBQYnj/outputs/graph
HTTP/1.1" 200 - "-" "Java/1.7.0_80"
127.0.0.1 - - [01/Mar/2017:03:48:06 +0000] "GET /api/atlas/entities?type=hive_table_v1&property=qualifiedName&value=sales_factOuS9DBQYnj
HTTP/1.1" 200 - "-" "Java/1.7.0_80"
127.0.0.1 - - [01/Mar/2017:03:48:06 +0000] "GET /api/atlas/lineage/9899ffd8-390c-4dd3-899a-bb0f79a3215e/outputs/graph
HTTP/1.1" 200 - "-" "Java/1.7.0_80"
127.0.0.1 - - [01/Mar/2017:03:48:07 +0000] "GET /api/atlas/lineage/hive/table/sales_factOuS9DBQYnj/schema
HTTP/1.1" 200 - "-" "Java/1.7.0_80"
127.0.0.1 - - [01/Mar/2017:03:48:08 +0000] "GET /api/atlas/lineage/hive/table/Saleso5nOxSSW38/schema
HTTP/1.1" 404 - "-" "Java/1.7.0_80"
127.0.0.1 - - [01/Mar/2017:03:48:08 +0000] "GET /api/atlas/entities?type=hive_table_v1&property=qualifiedName&value=sales_factOuS9DBQYnj
HTTP/1.1" 200 - "-" "Java/1.7.0_80"
127.0.0.1 - - [01/Mar/2017:03:48:08 +0000] "GET /api/atlas/lineage/9899ffd8-390c-4dd3-899a-bb0f79a3215e/schema
HTTP/1.1" 200 - "-" "Java/1.7.0_80"
127.0.0.1 - - [01/Mar/2017:03:48:09 +0000] "GET /api/atlas/lineage/hive/table/blah/schema
HTTP/1.1" 404 - "-" "Java/1.7.0_80"
127.0.0.1 - - [01/Mar/2017:03:48:09 +0000] "GET /api/atlas/entities?type=hive_table_v1&property=qualifiedName&value=sales_fact_monthly_mvAJJn7ijBje
HTTP/1.1" 200 - "-" "Java/1.7.0_80"
127.0.0.1 - - [01/Mar/2017:03:48:09 +0000] "GET /api/atlas/v2/lineage/8d255d6f-551f-4f70-aaaf-aac7154af660?direction=INPUT&depth=5
HTTP/1.1" 200 - "-" "Java/1.7.0_80"
127.0.0.1 - - [01/Mar/2017:03:48:10 +0000] "GET /api/atlas/entities?type=hive_table_v1&property=qualifiedName&value=sales_fact_monthly_mvAJJn7ijBje
HTTP/1.1" 200 - "-" "Java/1.7.0_80"
127.0.0.1 - - [01/Mar/2017:03:48:10 +0000] "GET /api/atlas/v2/lineage/8d255d6f-551f-4f70-aaaf-aac7154af660?direction=BOTH&depth=5
HTTP/1.1" 200 - "-" "Java/1.7.0_80"
127.0.0.1 - - [01/Mar/2017:03:48:12 +0000] "GET /api/atlas/entities?type=hive_table_v1&property=qualifiedName&value=sales_factV3NsIVt4uM
HTTP/1.1" 200 - "-" "Java/1.7.0_80"
127.0.0.1 - - [01/Mar/2017:03:48:12 +0000] "GET /api/atlas/v2/lineage/8159bfaa-6913-4af4-b339-e2e54442978b?direction=OUTPUT&depth=5
HTTP/1.1" 200 - "-" "Java/1.7.0_80"
Tests run: 11, Failures: 0, Errors: 0, Skipped: 0, Time elapsed: 17.284 sec - in org.apache.atlas.web.resources.EntityLineageJerseyResourceIT
Running org.apache.atlas.CredentialProviderUtilityIT
Tests run: 4, Failures: 0, Errors: 0, Skipped: 0, Time elapsed: 1.712 sec - in org.apache.atlas.CredentialProviderUtilityIT
Running org.apache.atlas.notification.EntityNotificationIT
127.0.0.1 - - [01/Mar/2017:03:48:19 +0000] "GET /api/atlas/types/tableType HTTP/1.1" 200 -
"-" "Java/1.7.0_80"
127.0.0.1 - - [01/Mar/2017:03:48:20 +0000] "GET /api/atlas/types/serdeType HTTP/1.1" 200 -
"-" "Java/1.7.0_80"
127.0.0.1 - - [01/Mar/2017:03:48:20 +0000] "GET /api/atlas/types/classification HTTP/1.1"
200 - "-" "Java/1.7.0_80"
127.0.0.1 - - [01/Mar/2017:03:48:20 +0000] "GET /api/atlas/types/hive_db_v1 HTTP/1.1" 200
- "-" "Java/1.7.0_80"
127.0.0.1 - - [01/Mar/2017:03:48:20 +0000] "POST /api/atlas/entities HTTP/1.1" 201 - "-" "Java/1.7.0_80"
127.0.0.1 - - [01/Mar/2017:03:48:21 +0000] "POST /api/atlas/entities HTTP/1.1" 201 - "-" "Java/1.7.0_80"
127.0.0.1 - - [01/Mar/2017:03:48:22 +0000] "POST /api/atlas/types HTTP/1.1" 201 - "-" "Java/1.7.0_80"
127.0.0.1 - - [01/Mar/2017:03:48:22 +0000] "POST /api/atlas/types HTTP/1.1" 201 - "-" "Java/1.7.0_80"
127.0.0.1 - - [01/Mar/2017:03:48:23 +0000] "POST /api/atlas/types HTTP/1.1" 201 - "-" "Java/1.7.0_80"
127.0.0.1 - - [01/Mar/2017:03:48:23 +0000] "POST /api/atlas/entities/840da672-84c3-41b8-8caa-8d4670a39178/traits
HTTP/1.1" 201 - "-" "Java/1.7.0_80"
127.0.0.1 - - [01/Mar/2017:03:49:24 +0000] "POST /api/atlas/entities/840da672-84c3-41b8-8caa-8d4670a39178?property=description
HTTP/1.1" 200 - "-" "Java/1.7.0_80"
127.0.0.1 - - [01/Mar/2017:03:49:24 +0000] "POST /api/atlas/entities HTTP/1.1" 201 - "-" "Java/1.7.0_80"
127.0.0.1 - - [01/Mar/2017:03:49:24 +0000] "POST /api/atlas/entities HTTP/1.1" 201 - "-" "Java/1.7.0_80"
127.0.0.1 - - [01/Mar/2017:03:49:24 +0000] "DELETE /api/atlas/entities?type=hive_table&property=qualifiedName&value=table-gTwK5mb1Fp
HTTP/1.1" 200 - "-" "Java/1.7.0_80"
Tests run: 5, Failures: 1, Errors: 0, Skipped: 1, Time elapsed: 67.862 sec <<< FAILURE!
- in org.apache.atlas.notification.EntityNotificationIT
testAddTrait(org.apache.atlas.notification.EntityNotificationIT)  Time elapsed: 61.796 sec
 <<< FAILURE!
java.lang.Exception: Waiting timed out after 60000 msec
	at org.apache.atlas.notification.EntityNotificationIT.testAddTrait(EntityNotificationIT.java:141)

Running org.apache.atlas.notification.NotificationHookConsumerIT
127.0.0.1 - - [01/Mar/2017:03:49:28 +0000] "GET /api/atlas/types/tableType HTTP/1.1" 200 -
"-" "Java/1.7.0_80"
127.0.0.1 - - [01/Mar/2017:03:49:28 +0000] "GET /api/atlas/types/serdeType HTTP/1.1" 200 -
"-" "Java/1.7.0_80"
127.0.0.1 - - [01/Mar/2017:03:49:28 +0000] "GET /api/atlas/types/classification HTTP/1.1"
200 - "-" "Java/1.7.0_80"
127.0.0.1 - - [01/Mar/2017:03:49:28 +0000] "GET /api/atlas/types/hive_db_v1 HTTP/1.1" 200
- "-" "Java/1.7.0_80"
127.0.0.1 - - [01/Mar/2017:03:49:29 +0000] "GET /api/atlas/discovery/search/dsl?query=hive_db+where+qualifiedName%3D'dbQ0xCjMNqbX'&limit=10&offset=0
HTTP/1.1" 200 - "-" "Java/1.7.0_80"
127.0.0.1 - - [01/Mar/2017:03:49:30 +0000] "GET /api/atlas/entities?type=hive_db&property=qualifiedName&value=dbQ0xCjMNqbX
HTTP/1.1" 200 - "-" "Java/1.7.0_80"
127.0.0.1 - - [01/Mar/2017:03:49:30 +0000] "GET /api/atlas/entities/3d4b9727-6911-40a3-8841-d4e9eee94a22/audit?count=1
HTTP/1.1" 200 - "-" "Java/1.7.0_80"
127.0.0.1 - - [01/Mar/2017:03:49:30 +0000] "POST /api/atlas/entities HTTP/1.1" 201 - "-" "Java/1.7.0_80"
127.0.0.1 - - [01/Mar/2017:03:49:30 +0000] "GET /api/atlas/entities/ebb0d4c6-24ea-4921-930b-1cd79d3f06d9
HTTP/1.1" 200 - "-" "Java/1.7.0_80"
127.0.0.1 - - [01/Mar/2017:03:49:30 +0000] "GET /api/atlas/entities/ebb0d4c6-24ea-4921-930b-1cd79d3f06d9
HTTP/1.1" 200 - "-" "Java/1.7.0_80"
127.0.0.1 - - [01/Mar/2017:03:49:30 +0000] "GET /api/atlas/discovery/search/dsl?query=hive_db+where+name%3D'dbJMRPCGc0ww'&limit=10&offset=0
HTTP/1.1" 200 - "-" "Java/1.7.0_80"
127.0.0.1 - - [01/Mar/2017:03:49:31 +0000] "GET /api/atlas/discovery/search/dsl?query=hive_db+where+name%3D'dbJMRPCGc0ww'&limit=10&offset=0
HTTP/1.1" 200 - "-" "Java/1.7.0_80"
127.0.0.1 - - [01/Mar/2017:03:49:32 +0000] "POST /api/atlas/entities HTTP/1.1" 201 - "-" "Java/1.7.0_80"
127.0.0.1 - - [01/Mar/2017:03:49:32 +0000] "GET /api/atlas/discovery/search/dsl?query=hive_db+where+qualifiedName%3D'dbaW4Bdc7uwm'&limit=10&offset=0
HTTP/1.1" 200 - "-" "Java/1.7.0_80"
127.0.0.1 - - [01/Mar/2017:03:49:33 +0000] "GET /api/atlas/entities?type=hive_db&property=qualifiedName&value=dbaW4Bdc7uwm
HTTP/1.1" 200 - "-" "Java/1.7.0_80"
127.0.0.1 - - [01/Mar/2017:03:49:33 +0000] "POST /api/atlas/entities HTTP/1.1" 201 - "-" "Java/1.7.0_80"
127.0.0.1 - - [01/Mar/2017:03:49:33 +0000] "GET /api/atlas/entities?type=hive_db&property=qualifiedName&value=dbz0bZCEAKnf
HTTP/1.1" 200 - "-" "Java/1.7.0_80"
127.0.0.1 - - [01/Mar/2017:03:49:33 +0000] "GET /api/atlas/entities?type=hive_db&property=qualifiedName&value=dbz0bZCEAKnf
HTTP/1.1" 200 - "-" "Java/1.7.0_80"
127.0.0.1 - - [01/Mar/2017:03:49:33 +0000] "POST /api/atlas/entities HTTP/1.1" 201 - "-" "Java/1.7.0_80"
127.0.0.1 - - [01/Mar/2017:03:49:33 +0000] "GET /api/atlas/discovery/search/dsl?query=hive_db+where+qualifiedName%3D'dbAQaqpUjtgY'&limit=10&offset=0
HTTP/1.1" 200 - "-" "Java/1.7.0_80"
127.0.0.1 - - [01/Mar/2017:03:49:34 +0000] "GET /api/atlas/discovery/search/dsl?query=hive_db+where+qualifiedName%3D'dbjwkhj7cxOU'&limit=10&offset=0
HTTP/1.1" 200 - "-" "Java/1.7.0_80"
Tests run: 6, Failures: 0, Errors: 0, Skipped: 0, Time elapsed: 9.74 sec - in org.apache.atlas.notification.NotificationHookConsumerIT

Results :

Failed tests: 
  EntityNotificationIT.testAddTrait:141->BaseResourceIT.waitForNotification:679->BaseResourceIT.waitFor:671
» 
  EntityJerseyResourceIT.testAddNullPropertyValue:423 Expected AtlasServiceException
  EntityJerseyResourceIT.testAddReferenceProperty:449->addProperty:467 » AtlasService
  EntityJerseyResourceIT.testAddTrait:557->assertEntityAudit:298 Expected audit event with
action = TAG_ADD
  EntityJerseyResourceIT.testCompleteUpdate:805 » AtlasService Metadata service ...
  EntityJerseyResourceIT.testEntityDeduping:264 » AtlasService Metadata service ...
  EntityJerseyResourceIT.testPartialUpdate:739 » AtlasService Metadata service A...
  EntityJerseyResourceIT.testgetTraitDefinitionForEntity:584 expected:<9> but was:<10>
  EntityV2JerseyResourceIT.testAddNullPropertyValue:335->createHiveTable:443->createHiveTable:452
expected object to not be null
  EntityV2JerseyResourceIT.testEntityDeduping:197 » AtlasService Metadata servic...
org.apache.atlas.web.resources.EntityV2JerseyResourceIT.testEntityInvalidValue(org.apache.atlas.web.resources.EntityV2JerseyResourceIT)
  Run 1: PASS
  Run 2: EntityV2JerseyResourceIT.testEntityInvalidValue:272 expected:<null> but was:<AtlasEntityHeader{guid='e6550a96-d1a1-410d-8f31-3bd1930c27ec',
status=ACTIVE, displayText=null, classificationNames=[],, AtlasStruct{typeName='hive_db_v2',
attributes=[name:BQ1edsqg8L]}}>

  EntityV2JerseyResourceIT.testSubmitEntity:103->createDBAndTable:437->createHiveTable:443->createHiveTable:452
expected object to not be null
  EntityV2JerseyResourceIT.testSubmitEntityWithBadDateFormat:296 expected object to not be
null
  MetadataDiscoveryJerseyResourceIT.setUp:64->BaseResourceIT.createInstance:259 » AtlasService

Tests run: 135, Failures: 14, Errors: 0, Skipped: 20

[INFO] 
[INFO] --- jetty-maven-plugin:9.2.12.v20150709:stop (stop-jetty) @ atlas-webapp ---
[INFO] Waiting 10 seconds for jetty to stop
[INFO] Stopped ServerConnector@26d0a786{HTTP/1.1}{0.0.0.0:31000}
[INFO] Closing Spring root WebApplicationContext
[INFO] Shutting down log4j
[INFO] Stopped o.e.j.m.p.JettyWebAppContext@1e53597b{/,<https://builds.apache.org/job/apache-atlas-nightly/ws/webapp/target/atlas-webapp-0.8-incubating-SNAPSHOT/,UNAVAILABLE}{/home/jenkins/jenkins-slave/workspace/apache-atlas-nightly/webapp/target/atlas-webapp-0.8-incubating-SNAPSHOT.war}>
[INFO] Server reports itself as stopped
[INFO] 
[INFO] --- maven-source-plugin:2.4:jar-no-fork (attach-sources) @ atlas-webapp ---
[INFO] Building jar: <https://builds.apache.org/job/apache-atlas-nightly/ws/webapp/target/atlas-webapp-0.8-incubating-SNAPSHOT-sources.jar>
log4j:WARN No appenders could be found for logger (org.apache.zookeeper.ClientCnxn).
log4j:WARN Please initialize the log4j system properly.
log4j:WARN See http://logging.apache.org/log4j/1.2/faq.html#noconfig for more info.
[INFO] 
[INFO] --- maven-source-plugin:2.4:test-jar-no-fork (attach-sources) @ atlas-webapp ---
[INFO] Building jar: <https://builds.apache.org/job/apache-atlas-nightly/ws/webapp/target/atlas-webapp-0.8-incubating-SNAPSHOT-test-sources.jar>
[INFO] 
[INFO] --- maven-failsafe-plugin:2.19.1:verify (verify) @ atlas-webapp ---
[INFO] ------------------------------------------------------------------------
[INFO] Reactor Summary:
[INFO] 
[INFO] Apache Atlas Server Build Tools .................... SUCCESS [  0.903 s]
[INFO] apache-atlas ....................................... SUCCESS [  7.881 s]
[INFO] Apache Atlas Integration ........................... SUCCESS [ 59.898 s]
[INFO] Apache Atlas Common ................................ SUCCESS [ 19.446 s]
[INFO] Apache Atlas Typesystem ............................ SUCCESS [01:38 min]
[INFO] Apache Atlas Client ................................ SUCCESS [ 21.945 s]
[INFO] Apache Atlas Server API ............................ SUCCESS [ 12.487 s]
[INFO] Apache Atlas Notification .......................... SUCCESS [ 44.557 s]
[INFO] Apache Atlas Graph Database Projects ............... SUCCESS [  0.693 s]
[INFO] Apache Atlas Graph Database API .................... SUCCESS [  8.075 s]
[INFO] Graph Database Common Code ......................... SUCCESS [  7.791 s]
[INFO] Shaded version of Apache hbase client .............. SUCCESS [ 11.842 s]
[INFO] Apache Atlas Titan 0.5.4 Graph DB Impl ............. SUCCESS [01:59 min]
[INFO] Apache Atlas Graph Database Implementation Dependencies SUCCESS [  0.673 s]
[INFO] Shaded version of Apache hbase server .............. SUCCESS [ 24.296 s]
[INFO] Apache Atlas Repository ............................ SUCCESS [15:12 min]
[INFO] Apache Atlas Authorization ......................... SUCCESS [ 16.049 s]
[INFO] Apache Atlas Business Catalog ...................... SUCCESS [ 34.849 s]
[INFO] Apache Atlas UI .................................... SUCCESS [ 54.003 s]
[INFO] Apache Atlas Web Application ....................... FAILURE [09:50 min]
[INFO] Apache Atlas Documentation ......................... SKIPPED
[INFO] Apache Atlas FileSystem Model ...................... SKIPPED
[INFO] Apache Atlas Plugin Classloader .................... SKIPPED
[INFO] Apache Atlas Hive Bridge Shim ...................... SKIPPED
[INFO] Apache Atlas Hive Bridge ........................... SKIPPED
[INFO] Apache Atlas Falcon Bridge Shim .................... SKIPPED
[INFO] Apache Atlas Falcon Bridge ......................... SKIPPED
[INFO] Apache Atlas Sqoop Bridge Shim ..................... SKIPPED
[INFO] Apache Atlas Sqoop Bridge .......................... SKIPPED
[INFO] Apache Atlas Storm Bridge Shim ..................... SKIPPED
[INFO] Apache Atlas Storm Bridge .......................... SKIPPED
[INFO] Apache Atlas Distribution .......................... SKIPPED
[INFO] ------------------------------------------------------------------------
[INFO] BUILD FAILURE
[INFO] ------------------------------------------------------------------------
[INFO] Total time: 34:08 min
[INFO] Finished at: 2017-03-01T03:49:40+00:00
[INFO] Final Memory: 343M/1161M
[INFO] ------------------------------------------------------------------------
[ERROR] Failed to execute goal org.apache.maven.plugins:maven-failsafe-plugin:2.19.1:verify
(verify) on project atlas-webapp: There are test failures.
[ERROR] 
[ERROR] Please refer to <https://builds.apache.org/job/apache-atlas-nightly/ws/webapp/target/failsafe-reports>
for the individual test results.
[ERROR] -> [Help 1]
[ERROR] 
[ERROR] To see the full stack trace of the errors, re-run Maven with the -e switch.
[ERROR] Re-run Maven using the -X switch to enable full debug logging.
[ERROR] 
[ERROR] For more information about the errors and possible solutions, please read the following
articles:
[ERROR] [Help 1] http://cwiki.apache.org/confluence/display/MAVEN/MojoFailureException
[ERROR] 
[ERROR] After correcting the problems, you can resume the build with the command
[ERROR]   mvn <goals> -rf :atlas-webapp
Build step 'Execute shell' marked build as failure
[CHECKSTYLE] Collecting checkstyle analysis files...
[CHECKSTYLE] Finding all files that match the pattern **/target/checkstyle-result.xml
[CHECKSTYLE] Parsing 31 files in <https://builds.apache.org/job/apache-atlas-nightly/ws/>
[CHECKSTYLE] Successfully parsed file <https://builds.apache.org/job/apache-atlas-nightly/ws/addons/falcon-bridge-shim/target/checkstyle-result.xml>
with 29 unique warnings and 0 duplicates.
[CHECKSTYLE] Successfully parsed file <https://builds.apache.org/job/apache-atlas-nightly/ws/addons/falcon-bridge/target/checkstyle-result.xml>
with 420 unique warnings and 0 duplicates.
[CHECKSTYLE] Successfully parsed file <https://builds.apache.org/job/apache-atlas-nightly/ws/addons/hdfs-model/target/checkstyle-result.xml>
with 420 unique warnings and 0 duplicates.
[CHECKSTYLE] Successfully parsed file <https://builds.apache.org/job/apache-atlas-nightly/ws/addons/hive-bridge-shim/target/checkstyle-result.xml>
with 435 unique warnings and 0 duplicates.
[CHECKSTYLE] Successfully parsed file <https://builds.apache.org/job/apache-atlas-nightly/ws/addons/hive-bridge/target/checkstyle-result.xml>
with 2228 unique warnings and 0 duplicates.
[CHECKSTYLE] Successfully parsed file <https://builds.apache.org/job/apache-atlas-nightly/ws/addons/sqoop-bridge-shim/target/checkstyle-result.xml>
with 2244 unique warnings and 0 duplicates.
[CHECKSTYLE] Successfully parsed file <https://builds.apache.org/job/apache-atlas-nightly/ws/addons/sqoop-bridge/target/checkstyle-result.xml>
with 2369 unique warnings and 0 duplicates.
[CHECKSTYLE] Successfully parsed file <https://builds.apache.org/job/apache-atlas-nightly/ws/addons/storm-bridge-shim/target/checkstyle-result.xml>
with 2390 unique warnings and 0 duplicates.
[CHECKSTYLE] Successfully parsed file <https://builds.apache.org/job/apache-atlas-nightly/ws/addons/storm-bridge/target/checkstyle-result.xml>
with 2659 unique warnings and 0 duplicates.
[CHECKSTYLE] Successfully parsed file <https://builds.apache.org/job/apache-atlas-nightly/ws/authorization/target/checkstyle-result.xml>
with 3112 unique warnings and 0 duplicates.
[CHECKSTYLE] Successfully parsed file <https://builds.apache.org/job/apache-atlas-nightly/ws/catalog/target/checkstyle-result.xml>
with 5245 unique warnings and 0 duplicates.
[CHECKSTYLE] Successfully parsed file <https://builds.apache.org/job/apache-atlas-nightly/ws/client/target/checkstyle-result.xml>
with 6931 unique warnings and 0 duplicates.
[CHECKSTYLE] Successfully parsed file <https://builds.apache.org/job/apache-atlas-nightly/ws/common/target/checkstyle-result.xml>
with 8113 unique warnings and 0 duplicates.
[CHECKSTYLE] Successfully parsed file <https://builds.apache.org/job/apache-atlas-nightly/ws/dashboardv2/target/checkstyle-result.xml>
with 8113 unique warnings and 0 duplicates.
[CHECKSTYLE] Successfully parsed file <https://builds.apache.org/job/apache-atlas-nightly/ws/distro/target/checkstyle-result.xml>
with 8113 unique warnings and 0 duplicates.
[CHECKSTYLE] Successfully parsed file <https://builds.apache.org/job/apache-atlas-nightly/ws/docs/target/checkstyle-result.xml>
with 8113 unique warnings and 0 duplicates.
[CHECKSTYLE] Successfully parsed file <https://builds.apache.org/job/apache-atlas-nightly/ws/graphdb/api/target/checkstyle-result.xml>
with 8352 unique warnings and 0 duplicates.
[CHECKSTYLE] Successfully parsed file <https://builds.apache.org/job/apache-atlas-nightly/ws/graphdb/common/target/checkstyle-result.xml>
with 8494 unique warnings and 0 duplicates.
[CHECKSTYLE] Successfully parsed file <https://builds.apache.org/job/apache-atlas-nightly/ws/graphdb/graphdb-impls/target/checkstyle-result.xml>
with 8494 unique warnings and 0 duplicates.
[CHECKSTYLE] Successfully parsed file <https://builds.apache.org/job/apache-atlas-nightly/ws/graphdb/target/checkstyle-result.xml>
with 8494 unique warnings and 0 duplicates.
[CHECKSTYLE] Successfully parsed file <https://builds.apache.org/job/apache-atlas-nightly/ws/graphdb/titan0/target/checkstyle-result.xml>
with 10717 unique warnings and 0 duplicates.
[CHECKSTYLE] Successfully parsed file <https://builds.apache.org/job/apache-atlas-nightly/ws/intg/target/checkstyle-result.xml>
with 16515 unique warnings and 0 duplicates.
[CHECKSTYLE] Successfully parsed file <https://builds.apache.org/job/apache-atlas-nightly/ws/notification/target/checkstyle-result.xml>
with 17680 unique warnings and 0 duplicates.
[CHECKSTYLE] Successfully parsed file <https://builds.apache.org/job/apache-atlas-nightly/ws/plugin-classloader/target/checkstyle-result.xml>
with 17788 unique warnings and 0 duplicates.
[CHECKSTYLE] Successfully parsed file <https://builds.apache.org/job/apache-atlas-nightly/ws/repository/target/checkstyle-result.xml>
with 32048 unique warnings and 0 duplicates.
[CHECKSTYLE] Successfully parsed file <https://builds.apache.org/job/apache-atlas-nightly/ws/server-api/target/checkstyle-result.xml>
with 32435 unique warnings and 0 duplicates.
[CHECKSTYLE] Successfully parsed file <https://builds.apache.org/job/apache-atlas-nightly/ws/shaded/hbase-client-shaded/target/checkstyle-result.xml>
with 32435 unique warnings and 0 duplicates.
[CHECKSTYLE] Successfully parsed file <https://builds.apache.org/job/apache-atlas-nightly/ws/shaded/hbase-server-shaded/target/checkstyle-result.xml>
with 32435 unique warnings and 0 duplicates.
[CHECKSTYLE] Successfully parsed file <https://builds.apache.org/job/apache-atlas-nightly/ws/target/checkstyle-result.xml>
with 32435 unique warnings and 0 duplicates.
[CHECKSTYLE] Successfully parsed file <https://builds.apache.org/job/apache-atlas-nightly/ws/titan/target/checkstyle-result.xml>
with 32897 unique warnings and 0 duplicates.
[CHECKSTYLE] Successfully parsed file <https://builds.apache.org/job/apache-atlas-nightly/ws/typesystem/target/checkstyle-result.xml>
with 37108 unique warnings and 0 duplicates.
[CHECKSTYLE] Computing warning deltas based on reference build #535
[FINDBUGS] Collecting findbugs analysis files...
[FINDBUGS] Finding all files that match the pattern **/target/findbugs.xml
[FINDBUGS] Parsing 22 files in <https://builds.apache.org/job/apache-atlas-nightly/ws/>
[FINDBUGS] Successfully parsed file <https://builds.apache.org/job/apache-atlas-nightly/ws/addons/falcon-bridge-shim/target/findbugs.xml>
with 0 unique warnings and 0 duplicates.
[FINDBUGS] Successfully parsed file <https://builds.apache.org/job/apache-atlas-nightly/ws/addons/falcon-bridge/target/findbugs.xml>
with 0 unique warnings and 0 duplicates.
[FINDBUGS] Successfully parsed file <https://builds.apache.org/job/apache-atlas-nightly/ws/addons/hive-bridge-shim/target/findbugs.xml>
with 0 unique warnings and 0 duplicates.
[FINDBUGS] Successfully parsed file <https://builds.apache.org/job/apache-atlas-nightly/ws/addons/hive-bridge/target/findbugs.xml>
with 0 unique warnings and 0 duplicates.
[FINDBUGS] Successfully parsed file <https://builds.apache.org/job/apache-atlas-nightly/ws/addons/sqoop-bridge-shim/target/findbugs.xml>
with 0 unique warnings and 0 duplicates.
[FINDBUGS] Successfully parsed file <https://builds.apache.org/job/apache-atlas-nightly/ws/addons/sqoop-bridge/target/findbugs.xml>
with 0 unique warnings and 0 duplicates.
[FINDBUGS] Successfully parsed file <https://builds.apache.org/job/apache-atlas-nightly/ws/addons/storm-bridge-shim/target/findbugs.xml>
with 0 unique warnings and 0 duplicates.
[FINDBUGS] Successfully parsed file <https://builds.apache.org/job/apache-atlas-nightly/ws/addons/storm-bridge/target/findbugs.xml>
with 0 unique warnings and 0 duplicates.
[FINDBUGS] Successfully parsed file <https://builds.apache.org/job/apache-atlas-nightly/ws/authorization/target/findbugs.xml>
with 0 unique warnings and 0 duplicates.
[FINDBUGS] Successfully parsed file <https://builds.apache.org/job/apache-atlas-nightly/ws/catalog/target/findbugs.xml>
with 0 unique warnings and 0 duplicates.
[FINDBUGS] Successfully parsed file <https://builds.apache.org/job/apache-atlas-nightly/ws/client/target/findbugs.xml>
with 0 unique warnings and 0 duplicates.
[FINDBUGS] Successfully parsed file <https://builds.apache.org/job/apache-atlas-nightly/ws/common/target/findbugs.xml>
with 0 unique warnings and 0 duplicates.
[FINDBUGS] Successfully parsed file <https://builds.apache.org/job/apache-atlas-nightly/ws/graphdb/api/target/findbugs.xml>
with 0 unique warnings and 0 duplicates.
[FINDBUGS] Successfully parsed file <https://builds.apache.org/job/apache-atlas-nightly/ws/graphdb/common/target/findbugs.xml>
with 0 unique warnings and 0 duplicates.
[FINDBUGS] Successfully parsed file <https://builds.apache.org/job/apache-atlas-nightly/ws/graphdb/titan0/target/findbugs.xml>
with 0 unique warnings and 0 duplicates.
[FINDBUGS] Successfully parsed file <https://builds.apache.org/job/apache-atlas-nightly/ws/intg/target/findbugs.xml>
with 0 unique warnings and 0 duplicates.
[FINDBUGS] Successfully parsed file <https://builds.apache.org/job/apache-atlas-nightly/ws/notification/target/findbugs.xml>
with 0 unique warnings and 0 duplicates.
[FINDBUGS] Successfully parsed file <https://builds.apache.org/job/apache-atlas-nightly/ws/plugin-classloader/target/findbugs.xml>
with 0 unique warnings and 0 duplicates.
[FINDBUGS] Successfully parsed file <https://builds.apache.org/job/apache-atlas-nightly/ws/repository/target/findbugs.xml>
with 0 unique warnings and 0 duplicates.
[FINDBUGS] Successfully parsed file <https://builds.apache.org/job/apache-atlas-nightly/ws/server-api/target/findbugs.xml>
with 0 unique warnings and 0 duplicates.
[FINDBUGS] Successfully parsed file <https://builds.apache.org/job/apache-atlas-nightly/ws/titan/target/findbugs.xml>
with 0 unique warnings and 0 duplicates.
[FINDBUGS] Successfully parsed file <https://builds.apache.org/job/apache-atlas-nightly/ws/typesystem/target/findbugs.xml>
with 0 unique warnings and 0 duplicates.
[FINDBUGS] Computing warning deltas based on reference build #535
Archiving artifacts
Compressed 571.50 MB of artifacts by 64.2% relative to #535
TestNG Reports Processing: START
Looking for TestNG results report in workspace using pattern: **/target/surefire-reports/testng-results.xml,**/target/failsafe-reports/testng-results.xml
testng-results.xml was last modified before this build started. Ignoring it.
testng-results.xml was last modified before this build started. Ignoring it.
testng-results.xml was last modified before this build started. Ignoring it.
testng-results.xml was last modified before this build started. Ignoring it.
testng-results.xml was last modified before this build started. Ignoring it.
testng-results.xml was last modified before this build started. Ignoring it.
testng-results.xml was last modified before this build started. Ignoring it.
Saving reports...
Processing '/x1/jenkins/jenkins-home/jobs/apache-atlas-nightly/builds/649/testng/testng-results-1.xml'
Processing '/x1/jenkins/jenkins-home/jobs/apache-atlas-nightly/builds/649/testng/testng-results-10.xml'
Processing '/x1/jenkins/jenkins-home/jobs/apache-atlas-nightly/builds/649/testng/testng-results-2.xml'
Processing '/x1/jenkins/jenkins-home/jobs/apache-atlas-nightly/builds/649/testng/testng-results-3.xml'
Processing '/x1/jenkins/jenkins-home/jobs/apache-atlas-nightly/builds/649/testng/testng-results-4.xml'
Processing '/x1/jenkins/jenkins-home/jobs/apache-atlas-nightly/builds/649/testng/testng-results-5.xml'
Processing '/x1/jenkins/jenkins-home/jobs/apache-atlas-nightly/builds/649/testng/testng-results-6.xml'
Processing '/x1/jenkins/jenkins-home/jobs/apache-atlas-nightly/builds/649/testng/testng-results-7.xml'
Processing '/x1/jenkins/jenkins-home/jobs/apache-atlas-nightly/builds/649/testng/testng-results-8.xml'
Processing '/x1/jenkins/jenkins-home/jobs/apache-atlas-nightly/builds/649/testng/testng-results-9.xml'
Processing '/x1/jenkins/jenkins-home/jobs/apache-atlas-nightly/builds/649/testng/testng-results.xml'
TestNG Reports Processing: FINISH

Mime
View raw message