atlas-dev mailing list archives

Site index · List index
Message view « Date » · « Thread »
Top « Date » · « Thread »
From Apache Jenkins Server <jenk...@builds.apache.org>
Subject Build failed in Jenkins: apache-atlas-nightly #670
Date Sun, 05 Mar 2017 08:32:16 GMT
See <https://builds.apache.org/job/apache-atlas-nightly/670/display/redirect?page=changes>

Changes:

[madhan] ATLAS-1608: search UI improvement (queryParam change from type ->

------------------------------------------
[...truncated 525.41 KB...]
127.0.0.1 - - [05/Mar/2017:08:29:37 +0000] "POST /api/atlas/entities HTTP/1.1" 201 - "-" "Java/1.7.0_80"
127.0.0.1 - - [05/Mar/2017:08:29:37 +0000] "POST /api/atlas/entities HTTP/1.1" 201 - "-" "Java/1.7.0_80"
127.0.0.1 - - [05/Mar/2017:08:29:37 +0000] "POST /api/atlas/entities HTTP/1.1" 201 - "-" "Java/1.7.0_80"
127.0.0.1 - - [05/Mar/2017:08:29:37 +0000] "GET /api/atlas/types/tableType HTTP/1.1" 200 -
"-" "Java/1.7.0_80"
127.0.0.1 - - [05/Mar/2017:08:29:37 +0000] "GET /api/atlas/types/serdeType HTTP/1.1" 200 -
"-" "Java/1.7.0_80"
127.0.0.1 - - [05/Mar/2017:08:29:37 +0000] "GET /api/atlas/types/classification HTTP/1.1"
200 - "-" "Java/1.7.0_80"
127.0.0.1 - - [05/Mar/2017:08:29:37 +0000] "GET /api/atlas/types/hive_db_v1 HTTP/1.1" 200
- "-" "Java/1.7.0_80"
127.0.0.1 - - [05/Mar/2017:08:29:37 +0000] "POST /api/atlas/entities HTTP/1.1" 201 - "-" "Java/1.7.0_80"
127.0.0.1 - - [05/Mar/2017:08:29:37 +0000] "POST /api/atlas/entities HTTP/1.1" 201 - "-" "Java/1.7.0_80"
127.0.0.1 - - [05/Mar/2017:08:29:37 +0000] "POST /api/atlas/entities HTTP/1.1" 201 - "-" "Java/1.7.0_80"
127.0.0.1 - - [05/Mar/2017:08:29:38 +0000] "POST /api/atlas/entities HTTP/1.1" 201 - "-" "Java/1.7.0_80"
127.0.0.1 - - [05/Mar/2017:08:29:38 +0000] "POST /api/atlas/entities HTTP/1.1" 201 - "-" "Java/1.7.0_80"
127.0.0.1 - - [05/Mar/2017:08:29:38 +0000] "POST /api/atlas/entities HTTP/1.1" 201 - "-" "Java/1.7.0_80"
127.0.0.1 - - [05/Mar/2017:08:29:38 +0000] "POST /api/atlas/entities HTTP/1.1" 201 - "-" "Java/1.7.0_80"
127.0.0.1 - - [05/Mar/2017:08:29:38 +0000] "POST /api/atlas/entities HTTP/1.1" 201 - "-" "Java/1.7.0_80"
127.0.0.1 - - [05/Mar/2017:08:29:38 +0000] "GET /api/atlas/lineage/hive/table/sales_fact_monthly_mvuivZuUbnQE/inputs/graph
HTTP/1.1" 200 - "-" "Java/1.7.0_80"
127.0.0.1 - - [05/Mar/2017:08:29:40 +0000] "GET /api/atlas/entities?type=hive_table_v1&property=qualifiedName&value=sales_fact_monthly_mvuivZuUbnQE
HTTP/1.1" 200 - "-" "Java/1.7.0_80"
127.0.0.1 - - [05/Mar/2017:08:29:40 +0000] "GET /api/atlas/lineage/dad01945-f899-4895-a3b1-6e3f4fd479af/inputs/graph
HTTP/1.1" 200 - "-" "Java/1.7.0_80"
127.0.0.1 - - [05/Mar/2017:08:29:41 +0000] "GET /api/atlas/lineage/hive/table/sales_factkLs0cqdcY5/outputs/graph
HTTP/1.1" 200 - "-" "Java/1.7.0_80"
127.0.0.1 - - [05/Mar/2017:08:29:44 +0000] "GET /api/atlas/entities?type=hive_table_v1&property=qualifiedName&value=sales_factkLs0cqdcY5
HTTP/1.1" 200 - "-" "Java/1.7.0_80"
127.0.0.1 - - [05/Mar/2017:08:29:44 +0000] "GET /api/atlas/lineage/6e1af78c-2e41-4e43-8d9d-e032c89a3656/outputs/graph
HTTP/1.1" 200 - "-" "Java/1.7.0_80"
127.0.0.1 - - [05/Mar/2017:08:29:45 +0000] "GET /api/atlas/lineage/hive/table/sales_factkLs0cqdcY5/schema
HTTP/1.1" 200 - "-" "Java/1.7.0_80"
127.0.0.1 - - [05/Mar/2017:08:29:45 +0000] "GET /api/atlas/lineage/hive/table/SalesND2LSAnKj7/schema
HTTP/1.1" 404 - "-" "Java/1.7.0_80"
127.0.0.1 - - [05/Mar/2017:08:29:45 +0000] "GET /api/atlas/entities?type=hive_table_v1&property=qualifiedName&value=sales_factkLs0cqdcY5
HTTP/1.1" 200 - "-" "Java/1.7.0_80"
127.0.0.1 - - [05/Mar/2017:08:29:45 +0000] "GET /api/atlas/lineage/6e1af78c-2e41-4e43-8d9d-e032c89a3656/schema
HTTP/1.1" 200 - "-" "Java/1.7.0_80"
127.0.0.1 - - [05/Mar/2017:08:29:46 +0000] "GET /api/atlas/lineage/hive/table/blah/schema
HTTP/1.1" 404 - "-" "Java/1.7.0_80"
127.0.0.1 - - [05/Mar/2017:08:29:46 +0000] "GET /api/atlas/entities?type=hive_table_v1&property=qualifiedName&value=sales_fact_monthly_mvLI8zsTpfC3
HTTP/1.1" 200 - "-" "Java/1.7.0_80"
127.0.0.1 - - [05/Mar/2017:08:29:46 +0000] "GET /api/atlas/v2/lineage/c5947a77-a241-4b56-9990-accdb8d49d40?direction=INPUT&depth=5
HTTP/1.1" 200 - "-" "Java/1.7.0_80"
127.0.0.1 - - [05/Mar/2017:08:29:47 +0000] "GET /api/atlas/entities?type=hive_table_v1&property=qualifiedName&value=sales_fact_monthly_mvLI8zsTpfC3
HTTP/1.1" 200 - "-" "Java/1.7.0_80"
127.0.0.1 - - [05/Mar/2017:08:29:47 +0000] "GET /api/atlas/v2/lineage/c5947a77-a241-4b56-9990-accdb8d49d40?direction=BOTH&depth=5
HTTP/1.1" 200 - "-" "Java/1.7.0_80"
127.0.0.1 - - [05/Mar/2017:08:29:50 +0000] "GET /api/atlas/entities?type=hive_table_v1&property=qualifiedName&value=sales_factxpey0SmsrU
HTTP/1.1" 200 - "-" "Java/1.7.0_80"
127.0.0.1 - - [05/Mar/2017:08:29:50 +0000] "GET /api/atlas/v2/lineage/bd8bfa51-1dc6-4548-8bbb-6d890077c3a9?direction=OUTPUT&depth=5
HTTP/1.1" 200 - "-" "Java/1.7.0_80"
Tests run: 11, Failures: 0, Errors: 0, Skipped: 0, Time elapsed: 17.323 sec - in org.apache.atlas.web.resources.EntityLineageJerseyResourceIT
Running org.apache.atlas.CredentialProviderUtilityIT
Tests run: 4, Failures: 0, Errors: 0, Skipped: 0, Time elapsed: 1.624 sec - in org.apache.atlas.CredentialProviderUtilityIT
Running org.apache.atlas.notification.EntityNotificationIT
127.0.0.1 - - [05/Mar/2017:08:29:56 +0000] "GET /api/atlas/types/tableType HTTP/1.1" 200 -
"-" "Java/1.7.0_80"
127.0.0.1 - - [05/Mar/2017:08:29:57 +0000] "GET /api/atlas/types/serdeType HTTP/1.1" 200 -
"-" "Java/1.7.0_80"
127.0.0.1 - - [05/Mar/2017:08:29:57 +0000] "GET /api/atlas/types/classification HTTP/1.1"
200 - "-" "Java/1.7.0_80"
127.0.0.1 - - [05/Mar/2017:08:29:57 +0000] "GET /api/atlas/types/hive_db_v1 HTTP/1.1" 200
- "-" "Java/1.7.0_80"
127.0.0.1 - - [05/Mar/2017:08:29:57 +0000] "POST /api/atlas/entities HTTP/1.1" 201 - "-" "Java/1.7.0_80"
127.0.0.1 - - [05/Mar/2017:08:29:58 +0000] "POST /api/atlas/entities HTTP/1.1" 201 - "-" "Java/1.7.0_80"
127.0.0.1 - - [05/Mar/2017:08:29:59 +0000] "POST /api/atlas/types HTTP/1.1" 201 - "-" "Java/1.7.0_80"
127.0.0.1 - - [05/Mar/2017:08:30:00 +0000] "POST /api/atlas/types HTTP/1.1" 201 - "-" "Java/1.7.0_80"
127.0.0.1 - - [05/Mar/2017:08:30:00 +0000] "POST /api/atlas/types HTTP/1.1" 201 - "-" "Java/1.7.0_80"
127.0.0.1 - - [05/Mar/2017:08:30:00 +0000] "POST /api/atlas/entities/5817f725-7621-42f2-a040-920cdad1f43b/traits
HTTP/1.1" 201 - "-" "Java/1.7.0_80"
127.0.0.1 - - [05/Mar/2017:08:30:00 +0000] "POST /api/atlas/types HTTP/1.1" 201 - "-" "Java/1.7.0_80"
127.0.0.1 - - [05/Mar/2017:08:30:00 +0000] "POST /api/atlas/entities/5817f725-7621-42f2-a040-920cdad1f43b/traits
HTTP/1.1" 201 - "-" "Java/1.7.0_80"
127.0.0.1 - - [05/Mar/2017:08:30:00 +0000] "DELETE /api/atlas/entities/5817f725-7621-42f2-a040-920cdad1f43b/traits/TraitxWZseFxEbz
HTTP/1.1" 200 - "-" "Java/1.7.0_80"
127.0.0.1 - - [05/Mar/2017:08:30:00 +0000] "POST /api/atlas/entities/5817f725-7621-42f2-a040-920cdad1f43b?property=description
HTTP/1.1" 200 - "-" "Java/1.7.0_80"
127.0.0.1 - - [05/Mar/2017:08:30:00 +0000] "POST /api/atlas/entities HTTP/1.1" 201 - "-" "Java/1.7.0_80"
127.0.0.1 - - [05/Mar/2017:08:30:00 +0000] "POST /api/atlas/entities HTTP/1.1" 201 - "-" "Java/1.7.0_80"
127.0.0.1 - - [05/Mar/2017:08:30:00 +0000] "DELETE /api/atlas/entities?type=hive_table&property=qualifiedName&value=table-MihCe8CDMj
HTTP/1.1" 200 - "-" "Java/1.7.0_80"
Tests run: 5, Failures: 0, Errors: 0, Skipped: 0, Time elapsed: 6.58 sec - in org.apache.atlas.notification.EntityNotificationIT
Running org.apache.atlas.notification.NotificationHookConsumerIT
127.0.0.1 - - [05/Mar/2017:08:30:03 +0000] "GET /api/atlas/types/tableType HTTP/1.1" 200 -
"-" "Java/1.7.0_80"
127.0.0.1 - - [05/Mar/2017:08:30:04 +0000] "GET /api/atlas/types/serdeType HTTP/1.1" 200 -
"-" "Java/1.7.0_80"
127.0.0.1 - - [05/Mar/2017:08:30:04 +0000] "GET /api/atlas/types/classification HTTP/1.1"
200 - "-" "Java/1.7.0_80"
127.0.0.1 - - [05/Mar/2017:08:30:04 +0000] "GET /api/atlas/types/hive_db_v1 HTTP/1.1" 200
- "-" "Java/1.7.0_80"
127.0.0.1 - - [05/Mar/2017:08:30:05 +0000] "GET /api/atlas/discovery/search/dsl?query=hive_db+where+qualifiedName%3D'dbReeWFCW3xA'&limit=10&offset=0
HTTP/1.1" 200 - "-" "Java/1.7.0_80"
127.0.0.1 - - [05/Mar/2017:08:30:05 +0000] "GET /api/atlas/entities?type=hive_db&property=qualifiedName&value=dbReeWFCW3xA
HTTP/1.1" 200 - "-" "Java/1.7.0_80"
127.0.0.1 - - [05/Mar/2017:08:30:06 +0000] "GET /api/atlas/entities/a804d20c-da08-4622-883e-badb0283b209/audit?count=1
HTTP/1.1" 200 - "-" "Java/1.7.0_80"
127.0.0.1 - - [05/Mar/2017:08:30:06 +0000] "POST /api/atlas/entities HTTP/1.1" 201 - "-" "Java/1.7.0_80"
127.0.0.1 - - [05/Mar/2017:08:30:06 +0000] "GET /api/atlas/entities/54b8aff7-b232-4b4d-867d-09fda82d9bea
HTTP/1.1" 200 - "-" "Java/1.7.0_80"
127.0.0.1 - - [05/Mar/2017:08:30:06 +0000] "GET /api/atlas/entities/54b8aff7-b232-4b4d-867d-09fda82d9bea
HTTP/1.1" 200 - "-" "Java/1.7.0_80"
127.0.0.1 - - [05/Mar/2017:08:30:06 +0000] "GET /api/atlas/discovery/search/dsl?query=hive_db+where+name%3D'dbinytel4CmQ'&limit=10&offset=0
HTTP/1.1" 200 - "-" "Java/1.7.0_80"
127.0.0.1 - - [05/Mar/2017:08:30:07 +0000] "GET /api/atlas/discovery/search/dsl?query=hive_db+where+name%3D'dbinytel4CmQ'&limit=10&offset=0
HTTP/1.1" 200 - "-" "Java/1.7.0_80"
127.0.0.1 - - [05/Mar/2017:08:30:07 +0000] "POST /api/atlas/entities HTTP/1.1" 201 - "-" "Java/1.7.0_80"
127.0.0.1 - - [05/Mar/2017:08:30:07 +0000] "GET /api/atlas/discovery/search/dsl?query=hive_db+where+qualifiedName%3D'dbYVLOXbvctd'&limit=10&offset=0
HTTP/1.1" 200 - "-" "Java/1.7.0_80"
127.0.0.1 - - [05/Mar/2017:08:30:08 +0000] "GET /api/atlas/entities?type=hive_db&property=qualifiedName&value=dbYVLOXbvctd
HTTP/1.1" 200 - "-" "Java/1.7.0_80"
127.0.0.1 - - [05/Mar/2017:08:30:08 +0000] "POST /api/atlas/entities HTTP/1.1" 201 - "-" "Java/1.7.0_80"
127.0.0.1 - - [05/Mar/2017:08:30:08 +0000] "GET /api/atlas/entities?type=hive_db&property=qualifiedName&value=dbaPcByc1IEe
HTTP/1.1" 500 - "-" "Java/1.7.0_80"
127.0.0.1 - - [05/Mar/2017:08:30:09 +0000] "POST /api/atlas/entities HTTP/1.1" 201 - "-" "Java/1.7.0_80"
127.0.0.1 - - [05/Mar/2017:08:30:09 +0000] "GET /api/atlas/discovery/search/dsl?query=hive_db+where+qualifiedName%3D'dbUexRtv5IDK'&limit=10&offset=0
HTTP/1.1" 200 - "-" "Java/1.7.0_80"
127.0.0.1 - - [05/Mar/2017:08:30:10 +0000] "GET /api/atlas/discovery/search/dsl?query=hive_db+where+qualifiedName%3D'dbz5wuhB0P9Y'&limit=10&offset=0
HTTP/1.1" 200 - "-" "Java/1.7.0_80"
Tests run: 6, Failures: 1, Errors: 0, Skipped: 0, Time elapsed: 9.51 sec <<< FAILURE!
- in org.apache.atlas.notification.NotificationHookConsumerIT
testUpdateEntityPartial(org.apache.atlas.notification.NotificationHookConsumerIT)  Time elapsed:
0.58 sec  <<< FAILURE!
org.apache.atlas.AtlasServiceException: Metadata service API org.apache.atlas.AtlasBaseClient$APIInfo@2acbdfe3
failed with status 500 (Internal Server Error) Response Body ({"error":"Could not execute
operation due to backend exception"})
	at org.apache.atlas.notification.NotificationHookConsumerIT.testUpdateEntityPartial(NotificationHookConsumerIT.java:130)


Results :

Failed tests: 
  NotificationHookConsumerIT.testUpdateEntityPartial:130->BaseResourceIT.waitFor:641 »
AtlasService

Tests run: 133, Failures: 1, Errors: 0, Skipped: 0

[INFO] 
[INFO] --- jetty-maven-plugin:9.2.12.v20150709:stop (stop-jetty) @ atlas-webapp ---
[INFO] Waiting 10 seconds for jetty to stop
[INFO] Stopped ServerConnector@4adfbb97{HTTP/1.1}{0.0.0.0:31000}
[INFO] Closing Spring root WebApplicationContext
[INFO] Shutting down log4j
log4j:WARN No appenders could be found for logger (org.apache.zookeeper.ClientCnxn).
log4j:WARN Please initialize the log4j system properly.
log4j:WARN See http://logging.apache.org/log4j/1.2/faq.html#noconfig for more info.
[INFO] Stopped o.e.j.m.p.JettyWebAppContext@8dff31d{/,<https://builds.apache.org/job/apache-atlas-nightly/ws/webapp/target/atlas-webapp-0.8-incubating-SNAPSHOT/,UNAVAILABLE}{/home/jenkins/jenkins-slave/workspace/apache-atlas-nightly/webapp/target/atlas-webapp-0.8-incubating-SNAPSHOT.war}>
[INFO] Server reports itself as stopped
[INFO] 
[INFO] --- maven-source-plugin:2.4:jar-no-fork (attach-sources) @ atlas-webapp ---
[INFO] Building jar: <https://builds.apache.org/job/apache-atlas-nightly/ws/webapp/target/atlas-webapp-0.8-incubating-SNAPSHOT-sources.jar>
[INFO] 
[INFO] --- maven-source-plugin:2.4:test-jar-no-fork (attach-sources) @ atlas-webapp ---
[INFO] Building jar: <https://builds.apache.org/job/apache-atlas-nightly/ws/webapp/target/atlas-webapp-0.8-incubating-SNAPSHOT-test-sources.jar>
[INFO] 
[INFO] --- maven-failsafe-plugin:2.19.1:verify (verify) @ atlas-webapp ---
[INFO] ------------------------------------------------------------------------
[INFO] Reactor Summary:
[INFO] 
[INFO] Apache Atlas Server Build Tools .................... SUCCESS [  0.854 s]
[INFO] apache-atlas ....................................... SUCCESS [  7.211 s]
[INFO] Apache Atlas Integration ........................... SUCCESS [ 57.445 s]
[INFO] Apache Atlas Common ................................ SUCCESS [ 19.305 s]
[INFO] Apache Atlas Typesystem ............................ SUCCESS [01:32 min]
[INFO] Apache Atlas Client ................................ SUCCESS [ 20.665 s]
[INFO] Apache Atlas Server API ............................ SUCCESS [ 11.409 s]
[INFO] Apache Atlas Notification .......................... SUCCESS [ 41.639 s]
[INFO] Apache Atlas Graph Database Projects ............... SUCCESS [  0.638 s]
[INFO] Apache Atlas Graph Database API .................... SUCCESS [  7.921 s]
[INFO] Graph Database Common Code ......................... SUCCESS [  7.825 s]
[INFO] Apache Atlas Titan 1.0.0 GraphDB Impl .............. SUCCESS [ 32.864 s]
[INFO] Shaded version of Apache hbase client .............. SUCCESS [  8.656 s]
[INFO] Apache Atlas Titan 0.5.4 Graph DB Impl ............. SUCCESS [01:45 min]
[INFO] Apache Atlas Graph Database Implementation Dependencies SUCCESS [  0.694 s]
[INFO] Shaded version of Apache hbase server .............. SUCCESS [ 23.719 s]
[INFO] Apache Atlas Repository ............................ SUCCESS [15:57 min]
[INFO] Apache Atlas Authorization ......................... SUCCESS [ 16.545 s]
[INFO] Apache Atlas Business Catalog ...................... SUCCESS [ 35.664 s]
[INFO] Apache Atlas UI .................................... SUCCESS [ 53.149 s]
[INFO] Apache Atlas Web Application ....................... FAILURE [08:58 min]
[INFO] Apache Atlas Documentation ......................... SKIPPED
[INFO] Apache Atlas FileSystem Model ...................... SKIPPED
[INFO] Apache Atlas Plugin Classloader .................... SKIPPED
[INFO] Apache Atlas Hive Bridge Shim ...................... SKIPPED
[INFO] Apache Atlas Hive Bridge ........................... SKIPPED
[INFO] Apache Atlas Falcon Bridge Shim .................... SKIPPED
[INFO] Apache Atlas Falcon Bridge ......................... SKIPPED
[INFO] Apache Atlas Sqoop Bridge Shim ..................... SKIPPED
[INFO] Apache Atlas Sqoop Bridge .......................... SKIPPED
[INFO] Apache Atlas Storm Bridge Shim ..................... SKIPPED
[INFO] Apache Atlas Storm Bridge .......................... SKIPPED
[INFO] Apache Atlas Distribution .......................... SKIPPED
[INFO] ------------------------------------------------------------------------
[INFO] BUILD FAILURE
[INFO] ------------------------------------------------------------------------
[INFO] Total time: 34:02 min
[INFO] Finished at: 2017-03-05T08:30:17+00:00
[INFO] Final Memory: 350M/1257M
[INFO] ------------------------------------------------------------------------
[ERROR] Failed to execute goal org.apache.maven.plugins:maven-failsafe-plugin:2.19.1:verify
(verify) on project atlas-webapp: There are test failures.
[ERROR] 
[ERROR] Please refer to <https://builds.apache.org/job/apache-atlas-nightly/ws/webapp/target/failsafe-reports>
for the individual test results.
[ERROR] -> [Help 1]
[ERROR] 
[ERROR] To see the full stack trace of the errors, re-run Maven with the -e switch.
[ERROR] Re-run Maven using the -X switch to enable full debug logging.
[ERROR] 
[ERROR] For more information about the errors and possible solutions, please read the following
articles:
[ERROR] [Help 1] http://cwiki.apache.org/confluence/display/MAVEN/MojoFailureException
[ERROR] 
[ERROR] After correcting the problems, you can resume the build with the command
[ERROR]   mvn <goals> -rf :atlas-webapp
Build step 'Execute shell' marked build as failure
[CHECKSTYLE] Collecting checkstyle analysis files...
[CHECKSTYLE] Finding all files that match the pattern **/target/checkstyle-result.xml
[CHECKSTYLE] Parsing 31 files in <https://builds.apache.org/job/apache-atlas-nightly/ws/>
[CHECKSTYLE] Successfully parsed file <https://builds.apache.org/job/apache-atlas-nightly/ws/addons/falcon-bridge-shim/target/checkstyle-result.xml>
with 29 unique warnings and 0 duplicates.
[CHECKSTYLE] Successfully parsed file <https://builds.apache.org/job/apache-atlas-nightly/ws/addons/falcon-bridge/target/checkstyle-result.xml>
with 420 unique warnings and 0 duplicates.
[CHECKSTYLE] Successfully parsed file <https://builds.apache.org/job/apache-atlas-nightly/ws/addons/hdfs-model/target/checkstyle-result.xml>
with 420 unique warnings and 0 duplicates.
[CHECKSTYLE] Successfully parsed file <https://builds.apache.org/job/apache-atlas-nightly/ws/addons/hive-bridge-shim/target/checkstyle-result.xml>
with 435 unique warnings and 0 duplicates.
[CHECKSTYLE] Successfully parsed file <https://builds.apache.org/job/apache-atlas-nightly/ws/addons/sqoop-bridge-shim/target/checkstyle-result.xml>
with 451 unique warnings and 0 duplicates.
[CHECKSTYLE] Successfully parsed file <https://builds.apache.org/job/apache-atlas-nightly/ws/addons/sqoop-bridge/target/checkstyle-result.xml>
with 576 unique warnings and 0 duplicates.
[CHECKSTYLE] Successfully parsed file <https://builds.apache.org/job/apache-atlas-nightly/ws/addons/storm-bridge-shim/target/checkstyle-result.xml>
with 597 unique warnings and 0 duplicates.
[CHECKSTYLE] Successfully parsed file <https://builds.apache.org/job/apache-atlas-nightly/ws/addons/storm-bridge/target/checkstyle-result.xml>
with 866 unique warnings and 0 duplicates.
[CHECKSTYLE] Successfully parsed file <https://builds.apache.org/job/apache-atlas-nightly/ws/authorization/target/checkstyle-result.xml>
with 1319 unique warnings and 0 duplicates.
[CHECKSTYLE] Successfully parsed file <https://builds.apache.org/job/apache-atlas-nightly/ws/catalog/target/checkstyle-result.xml>
with 3453 unique warnings and 0 duplicates.
[CHECKSTYLE] Successfully parsed file <https://builds.apache.org/job/apache-atlas-nightly/ws/client/target/checkstyle-result.xml>
with 5063 unique warnings and 0 duplicates.
[CHECKSTYLE] Successfully parsed file <https://builds.apache.org/job/apache-atlas-nightly/ws/common/target/checkstyle-result.xml>
with 6245 unique warnings and 0 duplicates.
[CHECKSTYLE] Successfully parsed file <https://builds.apache.org/job/apache-atlas-nightly/ws/dashboardv2/target/checkstyle-result.xml>
with 6245 unique warnings and 0 duplicates.
[CHECKSTYLE] Successfully parsed file <https://builds.apache.org/job/apache-atlas-nightly/ws/distro/target/checkstyle-result.xml>
with 6245 unique warnings and 0 duplicates.
[CHECKSTYLE] Successfully parsed file <https://builds.apache.org/job/apache-atlas-nightly/ws/docs/target/checkstyle-result.xml>
with 6245 unique warnings and 0 duplicates.
[CHECKSTYLE] Successfully parsed file <https://builds.apache.org/job/apache-atlas-nightly/ws/graphdb/api/target/checkstyle-result.xml>
with 6490 unique warnings and 0 duplicates.
[CHECKSTYLE] Successfully parsed file <https://builds.apache.org/job/apache-atlas-nightly/ws/graphdb/common/target/checkstyle-result.xml>
with 6639 unique warnings and 0 duplicates.
[CHECKSTYLE] Successfully parsed file <https://builds.apache.org/job/apache-atlas-nightly/ws/graphdb/graphdb-impls/target/checkstyle-result.xml>
with 6639 unique warnings and 0 duplicates.
[CHECKSTYLE] Successfully parsed file <https://builds.apache.org/job/apache-atlas-nightly/ws/graphdb/target/checkstyle-result.xml>
with 6639 unique warnings and 0 duplicates.
[CHECKSTYLE] Successfully parsed file <https://builds.apache.org/job/apache-atlas-nightly/ws/graphdb/titan0/target/checkstyle-result.xml>
with 8859 unique warnings and 0 duplicates.
[CHECKSTYLE] Successfully parsed file <https://builds.apache.org/job/apache-atlas-nightly/ws/graphdb/titan1/target/checkstyle-result.xml>
with 9764 unique warnings and 0 duplicates.
[CHECKSTYLE] Successfully parsed file <https://builds.apache.org/job/apache-atlas-nightly/ws/intg/target/checkstyle-result.xml>
with 15663 unique warnings and 0 duplicates.
[CHECKSTYLE] Successfully parsed file <https://builds.apache.org/job/apache-atlas-nightly/ws/notification/target/checkstyle-result.xml>
with 16828 unique warnings and 0 duplicates.
[CHECKSTYLE] Successfully parsed file <https://builds.apache.org/job/apache-atlas-nightly/ws/plugin-classloader/target/checkstyle-result.xml>
with 16936 unique warnings and 0 duplicates.
[CHECKSTYLE] Successfully parsed file <https://builds.apache.org/job/apache-atlas-nightly/ws/repository/target/checkstyle-result.xml>
with 31560 unique warnings and 0 duplicates.
[CHECKSTYLE] Successfully parsed file <https://builds.apache.org/job/apache-atlas-nightly/ws/server-api/target/checkstyle-result.xml>
with 31957 unique warnings and 0 duplicates.
[CHECKSTYLE] Successfully parsed file <https://builds.apache.org/job/apache-atlas-nightly/ws/shaded/hbase-client-shaded/target/checkstyle-result.xml>
with 31957 unique warnings and 0 duplicates.
[CHECKSTYLE] Successfully parsed file <https://builds.apache.org/job/apache-atlas-nightly/ws/shaded/hbase-server-shaded/target/checkstyle-result.xml>
with 31957 unique warnings and 0 duplicates.
[CHECKSTYLE] Successfully parsed file <https://builds.apache.org/job/apache-atlas-nightly/ws/target/checkstyle-result.xml>
with 31957 unique warnings and 0 duplicates.
[CHECKSTYLE] Successfully parsed file <https://builds.apache.org/job/apache-atlas-nightly/ws/titan/target/checkstyle-result.xml>
with 32419 unique warnings and 0 duplicates.
[CHECKSTYLE] Successfully parsed file <https://builds.apache.org/job/apache-atlas-nightly/ws/typesystem/target/checkstyle-result.xml>
with 36638 unique warnings and 0 duplicates.
[CHECKSTYLE] Computing warning deltas based on reference build #535
[FINDBUGS] Collecting findbugs analysis files...
[FINDBUGS] Finding all files that match the pattern **/target/findbugs.xml
[FINDBUGS] Parsing 21 files in <https://builds.apache.org/job/apache-atlas-nightly/ws/>
[FINDBUGS] Successfully parsed file <https://builds.apache.org/job/apache-atlas-nightly/ws/addons/falcon-bridge-shim/target/findbugs.xml>
with 0 unique warnings and 0 duplicates.
[FINDBUGS] Successfully parsed file <https://builds.apache.org/job/apache-atlas-nightly/ws/addons/falcon-bridge/target/findbugs.xml>
with 0 unique warnings and 0 duplicates.
[FINDBUGS] Successfully parsed file <https://builds.apache.org/job/apache-atlas-nightly/ws/addons/hive-bridge-shim/target/findbugs.xml>
with 0 unique warnings and 0 duplicates.
[FINDBUGS] Successfully parsed file <https://builds.apache.org/job/apache-atlas-nightly/ws/addons/sqoop-bridge-shim/target/findbugs.xml>
with 0 unique warnings and 0 duplicates.
[FINDBUGS] Successfully parsed file <https://builds.apache.org/job/apache-atlas-nightly/ws/addons/sqoop-bridge/target/findbugs.xml>
with 0 unique warnings and 0 duplicates.
[FINDBUGS] Successfully parsed file <https://builds.apache.org/job/apache-atlas-nightly/ws/addons/storm-bridge-shim/target/findbugs.xml>
with 0 unique warnings and 0 duplicates.
[FINDBUGS] Successfully parsed file <https://builds.apache.org/job/apache-atlas-nightly/ws/addons/storm-bridge/target/findbugs.xml>
with 0 unique warnings and 0 duplicates.
[FINDBUGS] Successfully parsed file <https://builds.apache.org/job/apache-atlas-nightly/ws/authorization/target/findbugs.xml>
with 0 unique warnings and 0 duplicates.
[FINDBUGS] Successfully parsed file <https://builds.apache.org/job/apache-atlas-nightly/ws/catalog/target/findbugs.xml>
with 0 unique warnings and 0 duplicates.
[FINDBUGS] Successfully parsed file <https://builds.apache.org/job/apache-atlas-nightly/ws/client/target/findbugs.xml>
with 0 unique warnings and 0 duplicates.
[FINDBUGS] Successfully parsed file <https://builds.apache.org/job/apache-atlas-nightly/ws/common/target/findbugs.xml>
with 0 unique warnings and 0 duplicates.
[FINDBUGS] Successfully parsed file <https://builds.apache.org/job/apache-atlas-nightly/ws/graphdb/api/target/findbugs.xml>
with 0 unique warnings and 0 duplicates.
[FINDBUGS] Successfully parsed file <https://builds.apache.org/job/apache-atlas-nightly/ws/graphdb/common/target/findbugs.xml>
with 0 unique warnings and 0 duplicates.
[FINDBUGS] Successfully parsed file <https://builds.apache.org/job/apache-atlas-nightly/ws/graphdb/titan0/target/findbugs.xml>
with 0 unique warnings and 0 duplicates.
[FINDBUGS] Successfully parsed file <https://builds.apache.org/job/apache-atlas-nightly/ws/intg/target/findbugs.xml>
with 0 unique warnings and 0 duplicates.
[FINDBUGS] Successfully parsed file <https://builds.apache.org/job/apache-atlas-nightly/ws/notification/target/findbugs.xml>
with 0 unique warnings and 0 duplicates.
[FINDBUGS] Successfully parsed file <https://builds.apache.org/job/apache-atlas-nightly/ws/plugin-classloader/target/findbugs.xml>
with 0 unique warnings and 0 duplicates.
[FINDBUGS] Successfully parsed file <https://builds.apache.org/job/apache-atlas-nightly/ws/repository/target/findbugs.xml>
with 0 unique warnings and 0 duplicates.
[FINDBUGS] Successfully parsed file <https://builds.apache.org/job/apache-atlas-nightly/ws/server-api/target/findbugs.xml>
with 0 unique warnings and 0 duplicates.
[FINDBUGS] Successfully parsed file <https://builds.apache.org/job/apache-atlas-nightly/ws/titan/target/findbugs.xml>
with 0 unique warnings and 0 duplicates.
[FINDBUGS] Successfully parsed file <https://builds.apache.org/job/apache-atlas-nightly/ws/typesystem/target/findbugs.xml>
with 0 unique warnings and 0 duplicates.
[FINDBUGS] Computing warning deltas based on reference build #535
Archiving artifacts
Compressed 573.68 MB of artifacts by 63.3% relative to #535
TestNG Reports Processing: START
Looking for TestNG results report in workspace using pattern: **/target/surefire-reports/testng-results.xml,**/target/failsafe-reports/testng-results.xml
testng-results.xml was last modified before this build started. Ignoring it.
testng-results.xml was last modified before this build started. Ignoring it.
testng-results.xml was last modified before this build started. Ignoring it.
testng-results.xml was last modified before this build started. Ignoring it.
testng-results.xml was last modified before this build started. Ignoring it.
testng-results.xml was last modified before this build started. Ignoring it.
testng-results.xml was last modified before this build started. Ignoring it.
Saving reports...
Processing '/x1/jenkins/jenkins-home/jobs/apache-atlas-nightly/builds/670/testng/testng-results-1.xml'
Processing '/x1/jenkins/jenkins-home/jobs/apache-atlas-nightly/builds/670/testng/testng-results-10.xml'
Processing '/x1/jenkins/jenkins-home/jobs/apache-atlas-nightly/builds/670/testng/testng-results-2.xml'
Processing '/x1/jenkins/jenkins-home/jobs/apache-atlas-nightly/builds/670/testng/testng-results-3.xml'
Processing '/x1/jenkins/jenkins-home/jobs/apache-atlas-nightly/builds/670/testng/testng-results-4.xml'
Processing '/x1/jenkins/jenkins-home/jobs/apache-atlas-nightly/builds/670/testng/testng-results-5.xml'
Processing '/x1/jenkins/jenkins-home/jobs/apache-atlas-nightly/builds/670/testng/testng-results-6.xml'
Processing '/x1/jenkins/jenkins-home/jobs/apache-atlas-nightly/builds/670/testng/testng-results-7.xml'
Processing '/x1/jenkins/jenkins-home/jobs/apache-atlas-nightly/builds/670/testng/testng-results-8.xml'
Processing '/x1/jenkins/jenkins-home/jobs/apache-atlas-nightly/builds/670/testng/testng-results-9.xml'
Processing '/x1/jenkins/jenkins-home/jobs/apache-atlas-nightly/builds/670/testng/testng-results.xml'
1.785714% of tests failed, which exceeded threshold of 0%. Marking build as UNSTABLE
TestNG Reports Processing: FINISH

Mime
View raw message