atlas-dev mailing list archives

Site index · List index
Message view « Date » · « Thread »
Top « Date » · « Thread »
From Apache Jenkins Server <jenk...@builds.apache.org>
Subject Build failed in Jenkins: apache-atlas-nightly #669
Date Sun, 05 Mar 2017 07:43:32 GMT
See <https://builds.apache.org/job/apache-atlas-nightly/669/display/redirect?page=changes>

Changes:

[madhan] ATLAS-1621: fix for IT failure in

------------------------------------------
[...truncated 669.10 KB...]
127.0.0.1 - - [05/Mar/2017:07:40:30 +0000] "GET /api/atlas/entities/4e98cef9-4a26-4b1b-b158-21ae2613a63e
HTTP/1.1" 200 - "-" "Java/1.7.0_80"
127.0.0.1 - - [05/Mar/2017:07:40:30 +0000] "GET /api/atlas/entities/a1447705-53ad-48ea-9d17-233ddf17c447
HTTP/1.1" 200 - "-" "Java/1.7.0_80"
127.0.0.1 - - [05/Mar/2017:07:40:30 +0000] "GET /api/atlas/entities/6c901838-422e-467c-9485-abfafa77b190
HTTP/1.1" 200 - "-" "Java/1.7.0_80"
127.0.0.1 - - [05/Mar/2017:07:40:30 +0000] "GET /api/atlas/entities?type=hdfs_path&property=qualifiedName&value=p<https://builds.apache.org/job/apache-atlas-nightly/ws/addons/hive-bridge/target/somedfspath1-data-ymi4lnntc9>
HTTP/1.1" 200 - "-" "Java/1.7.0_80"
127.0.0.1 - - [05/Mar/2017:07:40:30 +0000] "GET /api/atlas/entities?type=hdfs_path&property=qualifiedName&value=p<https://builds.apache.org/job/apache-atlas-nightly/ws/addons/hive-bridge/target/somedfspath1-data-ymi4lnntc9>
HTTP/1.1" 200 - "-" "Java/1.7.0_80"
127.0.0.1 - - [05/Mar/2017:07:40:30 +0000] "GET /api/atlas/entities/6c901838-422e-467c-9485-abfafa77b190
HTTP/1.1" 200 - "-" "Java/1.7.0_80"
127.0.0.1 - - [05/Mar/2017:07:40:33 +0000] "GET /api/atlas/entities?type=hive_table&property=qualifiedName&value=default.tablelj3g5ijxx2@primary
HTTP/1.1" 200 - "-" "Java/1.7.0_80"
127.0.0.1 - - [05/Mar/2017:07:40:33 +0000] "GET /api/atlas/entities?type=hive_table&property=qualifiedName&value=default.tablelj3g5ijxx2@primary
HTTP/1.1" 200 - "-" "Java/1.7.0_80"
127.0.0.1 - - [05/Mar/2017:07:40:33 +0000] "GET /api/atlas/entities?type=hive_process&property=qualifiedName&value=QUERY:default.tablelj3g5ijxx2@primary:1488699620000-%3E:PATH_WRITE
HTTP/1.1" 200 - "-" "Java/1.7.0_80"
127.0.0.1 - - [05/Mar/2017:07:40:33 +0000] "GET /api/atlas/entities?type=hive_process&property=qualifiedName&value=QUERY:default.tablelj3g5ijxx2@primary:1488699620000-%3E:PATH_WRITE
HTTP/1.1" 200 - "-" "Java/1.7.0_80"
127.0.0.1 - - [05/Mar/2017:07:40:33 +0000] "GET /api/atlas/entities/4e98cef9-4a26-4b1b-b158-21ae2613a63e
HTTP/1.1" 200 - "-" "Java/1.7.0_80"
127.0.0.1 - - [05/Mar/2017:07:40:33 +0000] "GET /api/atlas/entities/a1447705-53ad-48ea-9d17-233ddf17c447
HTTP/1.1" 200 - "-" "Java/1.7.0_80"
127.0.0.1 - - [05/Mar/2017:07:40:33 +0000] "GET /api/atlas/entities/ced840a4-f976-4e5b-b464-6dfa7762f912
HTTP/1.1" 200 - "-" "Java/1.7.0_80"
127.0.0.1 - - [05/Mar/2017:07:40:33 +0000] "GET /api/atlas/entities/6c901838-422e-467c-9485-abfafa77b190
HTTP/1.1" 200 - "-" "Java/1.7.0_80"
127.0.0.1 - - [05/Mar/2017:07:40:33 +0000] "GET /api/atlas/entities?type=hdfs_path&property=qualifiedName&value=p<https://builds.apache.org/job/apache-atlas-nightly/ws/addons/hive-bridge/target/somedfspath2-data-yigsw2xo7z>
HTTP/1.1" 200 - "-" "Java/1.7.0_80"
127.0.0.1 - - [05/Mar/2017:07:40:33 +0000] "GET /api/atlas/entities?type=hdfs_path&property=qualifiedName&value=p<https://builds.apache.org/job/apache-atlas-nightly/ws/addons/hive-bridge/target/somedfspath2-data-yigsw2xo7z>
HTTP/1.1" 200 - "-" "Java/1.7.0_80"
127.0.0.1 - - [05/Mar/2017:07:40:34 +0000] "GET /api/atlas/entities/ced840a4-f976-4e5b-b464-6dfa7762f912
HTTP/1.1" 200 - "-" "Java/1.7.0_80"
Tests run: 43, Failures: 4, Errors: 0, Skipped: 0, Time elapsed: 473.715 sec <<<
FAILURE! - in org.apache.atlas.hive.hook.HiveHookIT
testAlterTablePartitionColumnType(org.apache.atlas.hive.hook.HiveHookIT)  Time elapsed: 80.69
sec  <<< FAILURE!
java.lang.AssertionError: Assertions failed. Failing after waiting for timeout 80000 msecs
	at org.apache.atlas.hive.hook.HiveHookIT.assertColumnIsRegistered(HiveHookIT.java:283)
	at org.apache.atlas.hive.hook.HiveHookIT.testAlterTablePartitionColumnType(HiveHookIT.java:1216)
Caused by: org.apache.atlas.AtlasServiceException: Metadata service API org.apache.atlas.AtlasBaseClient$APIInfo@17a6ba40
failed with status 404 (Not Found) Response Body ({"error":"Instance hive_column with unique
attribute {qualifiedName=default.tabledi1rssclaa.dt@primary} does not exist"})
	at org.apache.atlas.hive.hook.HiveHookIT.assertColumnIsRegistered(HiveHookIT.java:283)
	at org.apache.atlas.hive.hook.HiveHookIT.testAlterTablePartitionColumnType(HiveHookIT.java:1216)

testAlterTableRename(org.apache.atlas.hive.hook.HiveHookIT)  Time elapsed: 5.8 sec  <<<
FAILURE!
org.apache.atlas.AtlasServiceException: Metadata service API org.apache.atlas.AtlasBaseClient$APIInfo@59ce1e3d
failed with status 400 (Bad Request) Response Body ({"error":"PII_Trait\\u2800\\u37D1\\uADAB\\uA644\\uEFBE\\u19F5\\uBEF3\\uCB55\\uF986\\u6F2B:
invalid name for CLASSIFICATION.  Names must consist of a letter followed by a sequence of
letter, number, or _ characters"})
	at org.apache.atlas.hive.hook.HiveHookIT.createTrait(HiveHookIT.java:946)
	at org.apache.atlas.hive.hook.HiveHookIT.testAlterTableRename(HiveHookIT.java:889)

testLineage(org.apache.atlas.hive.hook.HiveHookIT)  Time elapsed: 2.169 sec  <<<
FAILURE!
org.apache.atlas.AtlasServiceException: Metadata service API org.apache.atlas.AtlasBaseClient$APIInfo@3aaf889d
failed with status 500 (Internal Server Error) Response Body ({"error":"Could not execute
operation due to backend exception"})
	at org.apache.atlas.hive.hook.HiveHookIT.testLineage(HiveHookIT.java:1830)

testTraitsPreservedOnColumnRename(org.apache.atlas.hive.hook.HiveHookIT)  Time elapsed: 5.253
sec  <<< FAILURE!
org.apache.atlas.AtlasServiceException: Metadata service API org.apache.atlas.AtlasBaseClient$APIInfo@4d9be3b6
failed with status 400 (Bad Request) Response Body ({"error":"PII_Trait\\u8DDB\\u0927\\u5894\\u3BA8\\u975B\\u31F5\\uEED5\\u9272\\uC8E3\\u9920:
invalid name for CLASSIFICATION.  Names must consist of a letter followed by a sequence of
letter, number, or _ characters"})
	at org.apache.atlas.hive.hook.HiveHookIT.createTrait(HiveHookIT.java:946)
	at org.apache.atlas.hive.hook.HiveHookIT.testTraitsPreservedOnColumnRename(HiveHookIT.java:1255)

Running org.apache.atlas.hive.bridge.HiveMetastoreBridgeIT
127.0.0.1 - - [05/Mar/2017:07:40:45 +0000] "GET /api/atlas/entities?type=hive_db&property=qualifiedName&value=default@primary
HTTP/1.1" 200 - "-" "Java/1.7.0_80"
127.0.0.1 - - [05/Mar/2017:07:40:46 +0000] "GET /api/atlas/entities?type=hive_db&property=qualifiedName&value=default@primary
HTTP/1.1" 200 - "-" "Java/1.7.0_80"
127.0.0.1 - - [05/Mar/2017:07:40:46 +0000] "GET /api/atlas/entities?type=hive_table&property=qualifiedName&value=default.tablehn4qilg2yd@primary
HTTP/1.1" 404 - "-" "Java/1.7.0_80"
127.0.0.1 - - [05/Mar/2017:07:40:51 +0000] "GET /api/atlas/entities?type=hive_table&property=qualifiedName&value=default.tablehn4qilg2yd@primary
HTTP/1.1" 200 - "-" "Java/1.7.0_80"
127.0.0.1 - - [05/Mar/2017:07:40:51 +0000] "GET /api/atlas/entities?type=hive_table&property=qualifiedName&value=default.tablehn4qilg2yd@primary
HTTP/1.1" 200 - "-" "Java/1.7.0_80"
127.0.0.1 - - [05/Mar/2017:07:40:51 +0000] "GET /api/atlas/entities?type=hive_process&property=qualifiedName&value=default.tablehn4qilg2yd@primary:1488699644000
HTTP/1.1" 200 - "-" "Java/1.7.0_80"
127.0.0.1 - - [05/Mar/2017:07:40:51 +0000] "GET /api/atlas/entities?type=hive_process&property=qualifiedName&value=default.tablehn4qilg2yd@primary:1488699644000
HTTP/1.1" 200 - "-" "Java/1.7.0_80"
127.0.0.1 - - [05/Mar/2017:07:40:51 +0000] "GET /api/atlas/entities/de8d29bc-792c-48ea-af09-1beefb8883fe
HTTP/1.1" 200 - "-" "Java/1.7.0_80"
127.0.0.1 - - [05/Mar/2017:07:40:51 +0000] "GET /api/atlas/entities?type=hdfs_path&property=qualifiedName&value=p<https://builds.apache.org/job/apache-atlas-nightly/ws/addons/hive-bridge/target/parentpath-data-juhfjjnc4e>
HTTP/1.1" 200 - "-" "Java/1.7.0_80"
127.0.0.1 - - [05/Mar/2017:07:40:51 +0000] "GET /api/atlas/entities?type=hdfs_path&property=qualifiedName&value=p<https://builds.apache.org/job/apache-atlas-nightly/ws/addons/hive-bridge/target/parentpath-data-juhfjjnc4e>
HTTP/1.1" 200 - "-" "Java/1.7.0_80"
127.0.0.1 - - [05/Mar/2017:07:40:51 +0000] "GET /api/atlas/entities/fde7fb4b-4220-48ac-9e77-7a85a892c777
HTTP/1.1" 200 - "-" "Java/1.7.0_80"
127.0.0.1 - - [05/Mar/2017:07:40:51 +0000] "GET /api/atlas/entities?type=hive_table HTTP/1.1"
200 - "-" "Java/1.7.0_80"
127.0.0.1 - - [05/Mar/2017:07:40:51 +0000] "GET /api/atlas/entities/d262bfc9-424e-4ca9-afdf-5af535d0a85a
HTTP/1.1" 200 - "-" "Java/1.7.0_80"
127.0.0.1 - - [05/Mar/2017:07:40:51 +0000] "GET /api/atlas/entities?type=hive_table&property=qualifiedName&value=default.tablehn4qilg2yd@primary
HTTP/1.1" 200 - "-" "Java/1.7.0_80"
127.0.0.1 - - [05/Mar/2017:07:40:52 +0000] "POST /api/atlas/entities/c4e65ab2-51e7-4b0c-a555-59672f345a6d
HTTP/1.1" 200 - "-" "Java/1.7.0_80"
127.0.0.1 - - [05/Mar/2017:07:40:52 +0000] "GET /api/atlas/entities?type=hive_process&property=qualifiedName&value=default.tablehn4qilg2yd@primary:1488699644000
HTTP/1.1" 200 - "-" "Java/1.7.0_80"
127.0.0.1 - - [05/Mar/2017:07:40:52 +0000] "GET /api/atlas/entities?type=hive_table&property=qualifiedName&value=default.tablehn4qilg2yd@primary
HTTP/1.1" 200 - "-" "Java/1.7.0_80"
127.0.0.1 - - [05/Mar/2017:07:40:52 +0000] "GET /api/atlas/entities?type=hive_table&property=qualifiedName&value=default.tablehn4qilg2yd@primary
HTTP/1.1" 200 - "-" "Java/1.7.0_80"
127.0.0.1 - - [05/Mar/2017:07:40:52 +0000] "GET /api/atlas/entities?type=hive_process&property=qualifiedName&value=default.tablehn4qilg2yd@primary:1488699644000
HTTP/1.1" 200 - "-" "Java/1.7.0_80"
127.0.0.1 - - [05/Mar/2017:07:40:52 +0000] "GET /api/atlas/entities?type=hive_process&property=qualifiedName&value=default.tablehn4qilg2yd@primary:1488699644000
HTTP/1.1" 200 - "-" "Java/1.7.0_80"
127.0.0.1 - - [05/Mar/2017:07:40:52 +0000] "GET /api/atlas/entities?type=hive_table HTTP/1.1"
200 - "-" "Java/1.7.0_80"
127.0.0.1 - - [05/Mar/2017:07:40:53 +0000] "GET /api/atlas/entities?type=hive_db&property=qualifiedName&value=default@primary
HTTP/1.1" 200 - "-" "Java/1.7.0_80"
127.0.0.1 - - [05/Mar/2017:07:40:53 +0000] "GET /api/atlas/entities?type=hive_db&property=qualifiedName&value=default@primary
HTTP/1.1" 200 - "-" "Java/1.7.0_80"
127.0.0.1 - - [05/Mar/2017:07:40:53 +0000] "GET /api/atlas/entities/d262bfc9-424e-4ca9-afdf-5af535d0a85a
HTTP/1.1" 200 - "-" "Java/1.7.0_80"
127.0.0.1 - - [05/Mar/2017:07:40:53 +0000] "GET /api/atlas/entities?type=hive_table&property=qualifiedName&value=default.tableg3xch5zv3l@primary
HTTP/1.1" 404 - "-" "Java/1.7.0_80"
127.0.0.1 - - [05/Mar/2017:07:40:53 +0000] "POST /api/atlas/entities HTTP/1.1" 201 - "-" "Java/1.7.0_80"
127.0.0.1 - - [05/Mar/2017:07:40:53 +0000] "GET /api/atlas/entities?type=hive_process&property=qualifiedName&value=default.tableg3xch5zv3l@primary:1488699653000
HTTP/1.1" 404 - "-" "Java/1.7.0_80"
127.0.0.1 - - [05/Mar/2017:07:40:53 +0000] "POST /api/atlas/entities HTTP/1.1" 400 - "-" "Java/1.7.0_80"
Tests run: 2, Failures: 1, Errors: 0, Skipped: 0, Time elapsed: 18.55 sec <<< FAILURE!
- in org.apache.atlas.hive.bridge.HiveMetastoreBridgeIT
testImportCreatedTable(org.apache.atlas.hive.bridge.HiveMetastoreBridgeIT)  Time elapsed:
0.592 sec  <<< FAILURE!
org.apache.atlas.AtlasServiceException: Metadata service API org.apache.atlas.AtlasBaseClient$APIInfo@5ecdc1f7
failed with status 400 (Bad Request) Response Body ({"error":"Invalid instance creation\\\/updation
parameters passed : hive_table.qualifiedName: mandatory attribute value missing in type Referenceable"})
	at org.apache.atlas.hive.bridge.HiveMetastoreBridgeIT.testImportCreatedTable(HiveMetastoreBridgeIT.java:79)


Results :

Failed tests: 
  HiveMetastoreBridgeIT.testImportCreatedTable:79 » AtlasService Metadata servic...
  HiveHookIT.testAlterTablePartitionColumnType:1216->assertColumnIsRegistered:283->HiveITBase.assertEntityIsRegistered:158->HiveITBase.waitFor:202
Assertions failed. Failing after waiting for timeout 80000 msecs
  HiveHookIT.testAlterTableRename:889->createTrait:946 » AtlasService Metadata s...
  HiveHookIT.testLineage:1830->HiveITBase.assertTableIsRegistered:146->HiveITBase.assertTableIsRegistered:152->HiveITBase.assertEntityIsRegistered:168
» AtlasService
  HiveHookIT.testTraitsPreservedOnColumnRename:1255->createTrait:946 » AtlasService

Tests run: 45, Failures: 5, Errors: 0, Skipped: 0

[INFO] 
[INFO] --- jetty-maven-plugin:9.2.12.v20150709:stop (stop-jetty) @ hive-bridge ---
[INFO] Waiting 10 seconds for jetty to stop
[INFO] Stopped ServerConnector@867b770{HTTP/1.1}{0.0.0.0:31000}
[INFO] Closing Spring root WebApplicationContext
[INFO] Shutting down log4j
[INFO] Stopped o.e.j.m.p.JettyWebAppContext@310bbaab{/,<https://builds.apache.org/job/apache-atlas-nightly/ws/webapp/target/atlas-webapp-0.8-incubating-SNAPSHOT/,UNAVAILABLE}{/home/jenkins/jenkins-slave/workspace/apache-atlas-nightly/webapp/target/atlas-webapp-0.8-incubating-SNAPSHOT.war}>
[INFO] Server reports itself as stopped
[INFO] 
[INFO] --- maven-source-plugin:2.4:jar-no-fork (attach-sources) @ hive-bridge ---
[INFO] Building jar: <https://builds.apache.org/job/apache-atlas-nightly/ws/addons/hive-bridge/target/hive-bridge-0.8-incubating-SNAPSHOT-sources.jar>
[INFO] 
[INFO] --- maven-source-plugin:2.4:test-jar-no-fork (attach-sources) @ hive-bridge ---
[INFO] Building jar: <https://builds.apache.org/job/apache-atlas-nightly/ws/addons/hive-bridge/target/hive-bridge-0.8-incubating-SNAPSHOT-test-sources.jar>
[INFO] 
[INFO] --- maven-failsafe-plugin:2.19.1:verify (verify) @ hive-bridge ---
[INFO] ------------------------------------------------------------------------
[INFO] Reactor Summary:
[INFO] 
[INFO] Apache Atlas Server Build Tools .................... SUCCESS [  0.877 s]
[INFO] apache-atlas ....................................... SUCCESS [  7.162 s]
[INFO] Apache Atlas Integration ........................... SUCCESS [ 57.045 s]
[INFO] Apache Atlas Common ................................ SUCCESS [ 19.838 s]
[INFO] Apache Atlas Typesystem ............................ SUCCESS [01:33 min]
[INFO] Apache Atlas Client ................................ SUCCESS [ 21.081 s]
[INFO] Apache Atlas Server API ............................ SUCCESS [ 11.784 s]
[INFO] Apache Atlas Notification .......................... SUCCESS [ 41.823 s]
[INFO] Apache Atlas Graph Database Projects ............... SUCCESS [  0.673 s]
[INFO] Apache Atlas Graph Database API .................... SUCCESS [  7.759 s]
[INFO] Graph Database Common Code ......................... SUCCESS [  7.573 s]
[INFO] Apache Atlas Titan 1.0.0 GraphDB Impl .............. SUCCESS [ 32.449 s]
[INFO] Shaded version of Apache hbase client .............. SUCCESS [  8.748 s]
[INFO] Apache Atlas Titan 0.5.4 Graph DB Impl ............. SUCCESS [01:45 min]
[INFO] Apache Atlas Graph Database Implementation Dependencies SUCCESS [  0.707 s]
[INFO] Shaded version of Apache hbase server .............. SUCCESS [ 24.869 s]
[INFO] Apache Atlas Repository ............................ SUCCESS [15:55 min]
[INFO] Apache Atlas Authorization ......................... SUCCESS [ 15.684 s]
[INFO] Apache Atlas Business Catalog ...................... SUCCESS [ 34.289 s]
[INFO] Apache Atlas UI .................................... SUCCESS [ 53.135 s]
[INFO] Apache Atlas Web Application ....................... SUCCESS [09:27 min]
[INFO] Apache Atlas Documentation ......................... SUCCESS [ 12.735 s]
[INFO] Apache Atlas FileSystem Model ...................... SUCCESS [  2.184 s]
[INFO] Apache Atlas Plugin Classloader .................... SUCCESS [ 10.486 s]
[INFO] Apache Atlas Hive Bridge Shim ...................... SUCCESS [ 10.059 s]
[INFO] Apache Atlas Hive Bridge ........................... FAILURE [09:42 min]
[INFO] Apache Atlas Falcon Bridge Shim .................... SKIPPED
[INFO] Apache Atlas Falcon Bridge ......................... SKIPPED
[INFO] Apache Atlas Sqoop Bridge Shim ..................... SKIPPED
[INFO] Apache Atlas Sqoop Bridge .......................... SKIPPED
[INFO] Apache Atlas Storm Bridge Shim ..................... SKIPPED
[INFO] Apache Atlas Storm Bridge .......................... SKIPPED
[INFO] Apache Atlas Distribution .......................... SKIPPED
[INFO] ------------------------------------------------------------------------
[INFO] BUILD FAILURE
[INFO] ------------------------------------------------------------------------
[INFO] Total time: 44:47 min
[INFO] Finished at: 2017-03-05T07:41:01+00:00
[INFO] Final Memory: 534M/2117M
[INFO] ------------------------------------------------------------------------
log4j:WARN No appenders could be found for logger (org.apache.zookeeper.ClientCnxn).
log4j:WARN Please initialize the log4j system properly.
log4j:WARN See http://logging.apache.org/log4j/1.2/faq.html#noconfig for more info.
[ERROR] Failed to execute goal org.apache.maven.plugins:maven-failsafe-plugin:2.19.1:verify
(verify) on project hive-bridge: There are test failures.
[ERROR] 
[ERROR] Please refer to <https://builds.apache.org/job/apache-atlas-nightly/ws/addons/hive-bridge/target/failsafe-reports>
for the individual test results.
[ERROR] -> [Help 1]
[ERROR] 
[ERROR] To see the full stack trace of the errors, re-run Maven with the -e switch.
[ERROR] Re-run Maven using the -X switch to enable full debug logging.
[ERROR] 
[ERROR] For more information about the errors and possible solutions, please read the following
articles:
[ERROR] [Help 1] http://cwiki.apache.org/confluence/display/MAVEN/MojoFailureException
[ERROR] 
[ERROR] After correcting the problems, you can resume the build with the command
[ERROR]   mvn <goals> -rf :hive-bridge
Build step 'Execute shell' marked build as failure
[CHECKSTYLE] Collecting checkstyle analysis files...
[CHECKSTYLE] Finding all files that match the pattern **/target/checkstyle-result.xml
[CHECKSTYLE] Parsing 32 files in <https://builds.apache.org/job/apache-atlas-nightly/ws/>
[CHECKSTYLE] Successfully parsed file <https://builds.apache.org/job/apache-atlas-nightly/ws/addons/falcon-bridge-shim/target/checkstyle-result.xml>
with 29 unique warnings and 0 duplicates.
[CHECKSTYLE] Successfully parsed file <https://builds.apache.org/job/apache-atlas-nightly/ws/addons/falcon-bridge/target/checkstyle-result.xml>
with 420 unique warnings and 0 duplicates.
[CHECKSTYLE] Successfully parsed file <https://builds.apache.org/job/apache-atlas-nightly/ws/addons/hdfs-model/target/checkstyle-result.xml>
with 420 unique warnings and 0 duplicates.
[CHECKSTYLE] Successfully parsed file <https://builds.apache.org/job/apache-atlas-nightly/ws/addons/hive-bridge-shim/target/checkstyle-result.xml>
with 435 unique warnings and 0 duplicates.
[CHECKSTYLE] Successfully parsed file <https://builds.apache.org/job/apache-atlas-nightly/ws/addons/sqoop-bridge-shim/target/checkstyle-result.xml>
with 451 unique warnings and 0 duplicates.
[CHECKSTYLE] Successfully parsed file <https://builds.apache.org/job/apache-atlas-nightly/ws/addons/sqoop-bridge/target/checkstyle-result.xml>
with 576 unique warnings and 0 duplicates.
[CHECKSTYLE] Successfully parsed file <https://builds.apache.org/job/apache-atlas-nightly/ws/addons/storm-bridge-shim/target/checkstyle-result.xml>
with 597 unique warnings and 0 duplicates.
[CHECKSTYLE] Successfully parsed file <https://builds.apache.org/job/apache-atlas-nightly/ws/addons/storm-bridge/target/checkstyle-result.xml>
with 866 unique warnings and 0 duplicates.
[CHECKSTYLE] Successfully parsed file <https://builds.apache.org/job/apache-atlas-nightly/ws/authorization/target/checkstyle-result.xml>
with 1319 unique warnings and 0 duplicates.
[CHECKSTYLE] Successfully parsed file <https://builds.apache.org/job/apache-atlas-nightly/ws/catalog/target/checkstyle-result.xml>
with 3453 unique warnings and 0 duplicates.
[CHECKSTYLE] Successfully parsed file <https://builds.apache.org/job/apache-atlas-nightly/ws/client/target/checkstyle-result.xml>
with 5063 unique warnings and 0 duplicates.
[CHECKSTYLE] Successfully parsed file <https://builds.apache.org/job/apache-atlas-nightly/ws/common/target/checkstyle-result.xml>
with 6245 unique warnings and 0 duplicates.
[CHECKSTYLE] Successfully parsed file <https://builds.apache.org/job/apache-atlas-nightly/ws/dashboardv2/target/checkstyle-result.xml>
with 6245 unique warnings and 0 duplicates.
[CHECKSTYLE] Successfully parsed file <https://builds.apache.org/job/apache-atlas-nightly/ws/distro/target/checkstyle-result.xml>
with 6245 unique warnings and 0 duplicates.
[CHECKSTYLE] Successfully parsed file <https://builds.apache.org/job/apache-atlas-nightly/ws/docs/target/checkstyle-result.xml>
with 6245 unique warnings and 0 duplicates.
[CHECKSTYLE] Successfully parsed file <https://builds.apache.org/job/apache-atlas-nightly/ws/graphdb/api/target/checkstyle-result.xml>
with 6490 unique warnings and 0 duplicates.
[CHECKSTYLE] Successfully parsed file <https://builds.apache.org/job/apache-atlas-nightly/ws/graphdb/common/target/checkstyle-result.xml>
with 6639 unique warnings and 0 duplicates.
[CHECKSTYLE] Successfully parsed file <https://builds.apache.org/job/apache-atlas-nightly/ws/graphdb/graphdb-impls/target/checkstyle-result.xml>
with 6639 unique warnings and 0 duplicates.
[CHECKSTYLE] Successfully parsed file <https://builds.apache.org/job/apache-atlas-nightly/ws/graphdb/target/checkstyle-result.xml>
with 6639 unique warnings and 0 duplicates.
[CHECKSTYLE] Successfully parsed file <https://builds.apache.org/job/apache-atlas-nightly/ws/graphdb/titan0/target/checkstyle-result.xml>
with 8859 unique warnings and 0 duplicates.
[CHECKSTYLE] Successfully parsed file <https://builds.apache.org/job/apache-atlas-nightly/ws/graphdb/titan1/target/checkstyle-result.xml>
with 9764 unique warnings and 0 duplicates.
[CHECKSTYLE] Successfully parsed file <https://builds.apache.org/job/apache-atlas-nightly/ws/intg/target/checkstyle-result.xml>
with 15663 unique warnings and 0 duplicates.
[CHECKSTYLE] Successfully parsed file <https://builds.apache.org/job/apache-atlas-nightly/ws/notification/target/checkstyle-result.xml>
with 16828 unique warnings and 0 duplicates.
[CHECKSTYLE] Successfully parsed file <https://builds.apache.org/job/apache-atlas-nightly/ws/plugin-classloader/target/checkstyle-result.xml>
with 16936 unique warnings and 0 duplicates.
[CHECKSTYLE] Successfully parsed file <https://builds.apache.org/job/apache-atlas-nightly/ws/repository/target/checkstyle-result.xml>
with 31560 unique warnings and 0 duplicates.
[CHECKSTYLE] Successfully parsed file <https://builds.apache.org/job/apache-atlas-nightly/ws/server-api/target/checkstyle-result.xml>
with 31957 unique warnings and 0 duplicates.
[CHECKSTYLE] Successfully parsed file <https://builds.apache.org/job/apache-atlas-nightly/ws/shaded/hbase-client-shaded/target/checkstyle-result.xml>
with 31957 unique warnings and 0 duplicates.
[CHECKSTYLE] Successfully parsed file <https://builds.apache.org/job/apache-atlas-nightly/ws/shaded/hbase-server-shaded/target/checkstyle-result.xml>
with 31957 unique warnings and 0 duplicates.
[CHECKSTYLE] Successfully parsed file <https://builds.apache.org/job/apache-atlas-nightly/ws/target/checkstyle-result.xml>
with 31957 unique warnings and 0 duplicates.
[CHECKSTYLE] Successfully parsed file <https://builds.apache.org/job/apache-atlas-nightly/ws/titan/target/checkstyle-result.xml>
with 32419 unique warnings and 0 duplicates.
[CHECKSTYLE] Successfully parsed file <https://builds.apache.org/job/apache-atlas-nightly/ws/typesystem/target/checkstyle-result.xml>
with 36638 unique warnings and 0 duplicates.
[CHECKSTYLE] Successfully parsed file <https://builds.apache.org/job/apache-atlas-nightly/ws/webapp/target/checkstyle-result.xml>
with 44808 unique warnings and 0 duplicates.
[CHECKSTYLE] Computing warning deltas based on reference build #535
[FINDBUGS] Collecting findbugs analysis files...
[FINDBUGS] Finding all files that match the pattern **/target/findbugs.xml
[FINDBUGS] Parsing 22 files in <https://builds.apache.org/job/apache-atlas-nightly/ws/>
[FINDBUGS] Successfully parsed file <https://builds.apache.org/job/apache-atlas-nightly/ws/addons/falcon-bridge-shim/target/findbugs.xml>
with 0 unique warnings and 0 duplicates.
[FINDBUGS] Successfully parsed file <https://builds.apache.org/job/apache-atlas-nightly/ws/addons/falcon-bridge/target/findbugs.xml>
with 0 unique warnings and 0 duplicates.
[FINDBUGS] Successfully parsed file <https://builds.apache.org/job/apache-atlas-nightly/ws/addons/hive-bridge-shim/target/findbugs.xml>
with 0 unique warnings and 0 duplicates.
[FINDBUGS] Successfully parsed file <https://builds.apache.org/job/apache-atlas-nightly/ws/addons/sqoop-bridge-shim/target/findbugs.xml>
with 0 unique warnings and 0 duplicates.
[FINDBUGS] Successfully parsed file <https://builds.apache.org/job/apache-atlas-nightly/ws/addons/sqoop-bridge/target/findbugs.xml>
with 0 unique warnings and 0 duplicates.
[FINDBUGS] Successfully parsed file <https://builds.apache.org/job/apache-atlas-nightly/ws/addons/storm-bridge-shim/target/findbugs.xml>
with 0 unique warnings and 0 duplicates.
[FINDBUGS] Successfully parsed file <https://builds.apache.org/job/apache-atlas-nightly/ws/addons/storm-bridge/target/findbugs.xml>
with 0 unique warnings and 0 duplicates.
[FINDBUGS] Successfully parsed file <https://builds.apache.org/job/apache-atlas-nightly/ws/authorization/target/findbugs.xml>
with 0 unique warnings and 0 duplicates.
[FINDBUGS] Successfully parsed file <https://builds.apache.org/job/apache-atlas-nightly/ws/catalog/target/findbugs.xml>
with 0 unique warnings and 0 duplicates.
[FINDBUGS] Successfully parsed file <https://builds.apache.org/job/apache-atlas-nightly/ws/client/target/findbugs.xml>
with 0 unique warnings and 0 duplicates.
[FINDBUGS] Successfully parsed file <https://builds.apache.org/job/apache-atlas-nightly/ws/common/target/findbugs.xml>
with 0 unique warnings and 0 duplicates.
[FINDBUGS] Successfully parsed file <https://builds.apache.org/job/apache-atlas-nightly/ws/graphdb/api/target/findbugs.xml>
with 0 unique warnings and 0 duplicates.
[FINDBUGS] Successfully parsed file <https://builds.apache.org/job/apache-atlas-nightly/ws/graphdb/common/target/findbugs.xml>
with 0 unique warnings and 0 duplicates.
[FINDBUGS] Successfully parsed file <https://builds.apache.org/job/apache-atlas-nightly/ws/graphdb/titan0/target/findbugs.xml>
with 0 unique warnings and 0 duplicates.
[FINDBUGS] Successfully parsed file <https://builds.apache.org/job/apache-atlas-nightly/ws/intg/target/findbugs.xml>
with 0 unique warnings and 0 duplicates.
[FINDBUGS] Successfully parsed file <https://builds.apache.org/job/apache-atlas-nightly/ws/notification/target/findbugs.xml>
with 0 unique warnings and 0 duplicates.
[FINDBUGS] Successfully parsed file <https://builds.apache.org/job/apache-atlas-nightly/ws/plugin-classloader/target/findbugs.xml>
with 0 unique warnings and 0 duplicates.
[FINDBUGS] Successfully parsed file <https://builds.apache.org/job/apache-atlas-nightly/ws/repository/target/findbugs.xml>
with 0 unique warnings and 0 duplicates.
[FINDBUGS] Successfully parsed file <https://builds.apache.org/job/apache-atlas-nightly/ws/server-api/target/findbugs.xml>
with 0 unique warnings and 0 duplicates.
[FINDBUGS] Successfully parsed file <https://builds.apache.org/job/apache-atlas-nightly/ws/titan/target/findbugs.xml>
with 0 unique warnings and 0 duplicates.
[FINDBUGS] Successfully parsed file <https://builds.apache.org/job/apache-atlas-nightly/ws/typesystem/target/findbugs.xml>
with 0 unique warnings and 0 duplicates.
[FINDBUGS] Successfully parsed file <https://builds.apache.org/job/apache-atlas-nightly/ws/webapp/target/findbugs.xml>
with 0 unique warnings and 0 duplicates.
[FINDBUGS] Computing warning deltas based on reference build #535
Archiving artifacts
Compressed 574.98 MB of artifacts by 63.1% relative to #535
TestNG Reports Processing: START
Looking for TestNG results report in workspace using pattern: **/target/surefire-reports/testng-results.xml,**/target/failsafe-reports/testng-results.xml
testng-results.xml was last modified before this build started. Ignoring it.
testng-results.xml was last modified before this build started. Ignoring it.
testng-results.xml was last modified before this build started. Ignoring it.
testng-results.xml was last modified before this build started. Ignoring it.
Saving reports...
Processing '/x1/jenkins/jenkins-home/jobs/apache-atlas-nightly/builds/669/testng/testng-results-1.xml'
Processing '/x1/jenkins/jenkins-home/jobs/apache-atlas-nightly/builds/669/testng/testng-results-10.xml'
Processing '/x1/jenkins/jenkins-home/jobs/apache-atlas-nightly/builds/669/testng/testng-results-11.xml'
Processing '/x1/jenkins/jenkins-home/jobs/apache-atlas-nightly/builds/669/testng/testng-results-12.xml'
Processing '/x1/jenkins/jenkins-home/jobs/apache-atlas-nightly/builds/669/testng/testng-results-13.xml'
Processing '/x1/jenkins/jenkins-home/jobs/apache-atlas-nightly/builds/669/testng/testng-results-2.xml'
Processing '/x1/jenkins/jenkins-home/jobs/apache-atlas-nightly/builds/669/testng/testng-results-3.xml'
Processing '/x1/jenkins/jenkins-home/jobs/apache-atlas-nightly/builds/669/testng/testng-results-4.xml'
Processing '/x1/jenkins/jenkins-home/jobs/apache-atlas-nightly/builds/669/testng/testng-results-5.xml'
Processing '/x1/jenkins/jenkins-home/jobs/apache-atlas-nightly/builds/669/testng/testng-results-6.xml'
Processing '/x1/jenkins/jenkins-home/jobs/apache-atlas-nightly/builds/669/testng/testng-results-7.xml'
Processing '/x1/jenkins/jenkins-home/jobs/apache-atlas-nightly/builds/669/testng/testng-results-8.xml'
Processing '/x1/jenkins/jenkins-home/jobs/apache-atlas-nightly/builds/669/testng/testng-results-9.xml'
Processing '/x1/jenkins/jenkins-home/jobs/apache-atlas-nightly/builds/669/testng/testng-results.xml'
1.694915% of tests failed, which exceeded threshold of 0%. Marking build as UNSTABLE
TestNG Reports Processing: FINISH

Mime
View raw message