atlas-dev mailing list archives

Site index · List index
Message view « Date » · « Thread »
Top « Date » · « Thread »
From Apache Jenkins Server <jenk...@builds.apache.org>
Subject Build failed in Jenkins: apache-atlas-nightly #674
Date Mon, 06 Mar 2017 09:37:50 GMT
See <https://builds.apache.org/job/apache-atlas-nightly/674/display/redirect?page=changes>

Changes:

[madhan] ATLAS-1635: fixed v1 lineage API return to return correct value in

------------------------------------------
[...truncated 589.27 KB...]
[INFO] Compiling 9 source files to <https://builds.apache.org/job/apache-atlas-nightly/ws/addons/hive-bridge/target/classes>
[WARNING] <https://builds.apache.org/job/apache-atlas-nightly/ws/addons/hive-bridge/src/main/java/org/apache/atlas/hive/bridge/ColumnLineageUtils.java>:
Some input files use or override a deprecated API.
[WARNING] <https://builds.apache.org/job/apache-atlas-nightly/ws/addons/hive-bridge/src/main/java/org/apache/atlas/hive/bridge/ColumnLineageUtils.java>:
Recompile with -Xlint:deprecation for details.
[WARNING] <https://builds.apache.org/job/apache-atlas-nightly/ws/addons/hive-bridge/src/main/java/org/apache/atlas/hive/bridge/ColumnLineageUtils.java>:
Some input files use unchecked or unsafe operations.
[WARNING] <https://builds.apache.org/job/apache-atlas-nightly/ws/addons/hive-bridge/src/main/java/org/apache/atlas/hive/bridge/ColumnLineageUtils.java>:
Recompile with -Xlint:unchecked for details.
[INFO] 
[INFO] --- maven-resources-plugin:2.7:testResources (default-testResources) @ hive-bridge
---
[INFO] Using 'UTF-8' encoding to copy filtered resources.
[INFO] Copying 1 resource
[INFO] skip non existing resourceDirectory <https://builds.apache.org/job/apache-atlas-nightly/ws/addons/hive-bridge/typesystem/src/test/resources>
[INFO] Copying 3 resources
[INFO] 
[INFO] --- maven-compiler-plugin:3.1:testCompile (default-testCompile) @ hive-bridge ---
[INFO] Changes detected - recompiling the module!
[INFO] Compiling 5 source files to <https://builds.apache.org/job/apache-atlas-nightly/ws/addons/hive-bridge/target/test-classes>
[WARNING] <https://builds.apache.org/job/apache-atlas-nightly/ws/addons/hive-bridge/src/test/java/org/apache/atlas/hive/HiveITBase.java>:
Some input files use or override a deprecated API.
[WARNING] <https://builds.apache.org/job/apache-atlas-nightly/ws/addons/hive-bridge/src/test/java/org/apache/atlas/hive/HiveITBase.java>:
Recompile with -Xlint:deprecation for details.
[WARNING] <https://builds.apache.org/job/apache-atlas-nightly/ws/addons/hive-bridge/src/test/java/org/apache/atlas/hive/HiveITBase.java>:
Some input files use unchecked or unsafe operations.
[WARNING] <https://builds.apache.org/job/apache-atlas-nightly/ws/addons/hive-bridge/src/test/java/org/apache/atlas/hive/HiveITBase.java>:
Recompile with -Xlint:unchecked for details.
[INFO] 
[INFO] --- maven-surefire-plugin:2.18.1:test (default-test) @ hive-bridge ---
[WARNING] The parameter forkMode is deprecated since version 2.14. Use forkCount and reuseForks
instead.
[INFO] Surefire report directory: <https://builds.apache.org/job/apache-atlas-nightly/ws/addons/hive-bridge/target/surefire-reports>
[INFO] Using configured provider org.apache.maven.surefire.testng.TestNGProvider
[WARNING] file.encoding cannot be set as system property, use <argLine>-Dfile.encoding=...<argLine>
instead

-------------------------------------------------------
 T E S T S
-------------------------------------------------------
Running org.apache.atlas.hive.bridge.HiveMetaStoreBridgeTest
Tests run: 5, Failures: 0, Errors: 0, Skipped: 0, Time elapsed: 12.159 sec - in org.apache.atlas.hive.bridge.HiveMetaStoreBridgeTest
Running org.apache.atlas.hive.bridge.HiveLiteralRewriterTest
Tests run: 0, Failures: 0, Errors: 0, Skipped: 0, Time elapsed: 0.339 sec - in org.apache.atlas.hive.bridge.HiveLiteralRewriterTest

Results :

Tests run: 5, Failures: 0, Errors: 0, Skipped: 0

[INFO] 
[INFO] --- maven-site-plugin:3.4:site (default) @ hive-bridge ---
[INFO] maven.site.skip = true: Skipping site generation
[INFO] 
[INFO] --- maven-jar-plugin:2.5:jar (default-jar) @ hive-bridge ---
[INFO] Building jar: <https://builds.apache.org/job/apache-atlas-nightly/ws/addons/hive-bridge/target/hive-bridge-0.8-incubating-SNAPSHOT.jar>
[INFO] 
[INFO] --- maven-site-plugin:3.4:attach-descriptor (attach-descriptor) @ hive-bridge ---
[INFO] 
[INFO] --- maven-dependency-plugin:2.10:copy (copy-hook) @ hive-bridge ---
[INFO] Configured Artifact: org.apache.atlas:hive-bridge:0.8-incubating-SNAPSHOT:jar
[INFO] Configured Artifact: org.json4s:json4s-native_2.11:3.2.11:jar
[INFO] Configured Artifact: org.json4s:json4s-core_2.11:3.2.11:jar
[INFO] Configured Artifact: org.json4s:json4s-ast_2.11:3.2.11:jar
[INFO] Configured Artifact: org.apache.atlas:atlas-client:0.8-incubating-SNAPSHOT:jar
[INFO] Configured Artifact: org.apache.atlas:atlas-typesystem:0.8-incubating-SNAPSHOT:jar
[INFO] Configured Artifact: org.apache.atlas:atlas-notification:0.8-incubating-SNAPSHOT:jar
[INFO] Configured Artifact: org.apache.atlas:hdfs-model:0.8-incubating-SNAPSHOT:jar
[INFO] Configured Artifact: org.apache.atlas:atlas-common:0.8-incubating-SNAPSHOT:jar
[INFO] Configured Artifact: org.scala-lang:scala-compiler:2.11.8:jar
[INFO] Configured Artifact: org.scala-lang:scala-reflect:2.11.8:jar
[INFO] Configured Artifact: org.scala-lang:scala-library:2.11.8:jar
[INFO] Configured Artifact: org.scala-lang:scalap:2.11.8:jar
[INFO] Configured Artifact: com.google.inject.extensions:guice-multibindings:?:jar
[INFO] Configured Artifact: org.apache.kafka:kafka_2.11:0.10.0.0:jar
[INFO] Configured Artifact: org.apache.kafka:kafka-clients:0.10.0.0:jar
[INFO] Configured Artifact: com.google.code.gson:gson:2.5:jar
[INFO] Copying hive-bridge-0.8-incubating-SNAPSHOT.jar to <https://builds.apache.org/job/apache-atlas-nightly/ws/addons/hive-bridge/target/dependency/hook/hive/atlas-hive-plugin-impl/hive-bridge-0.8-incubating-SNAPSHOT.jar>
[INFO] Copying json4s-native_2.11-3.2.11.jar to <https://builds.apache.org/job/apache-atlas-nightly/ws/addons/hive-bridge/target/dependency/hook/hive/atlas-hive-plugin-impl/json4s-native_2.11-3.2.11.jar>
[INFO] Copying json4s-core_2.11-3.2.11.jar to <https://builds.apache.org/job/apache-atlas-nightly/ws/addons/hive-bridge/target/dependency/hook/hive/atlas-hive-plugin-impl/json4s-core_2.11-3.2.11.jar>
[INFO] Copying json4s-ast_2.11-3.2.11.jar to <https://builds.apache.org/job/apache-atlas-nightly/ws/addons/hive-bridge/target/dependency/hook/hive/atlas-hive-plugin-impl/json4s-ast_2.11-3.2.11.jar>
[INFO] Copying atlas-client-0.8-incubating-SNAPSHOT.jar to <https://builds.apache.org/job/apache-atlas-nightly/ws/addons/hive-bridge/target/dependency/hook/hive/atlas-hive-plugin-impl/atlas-client-0.8-incubating-SNAPSHOT.jar>
[INFO] Copying atlas-typesystem-0.8-incubating-SNAPSHOT.jar to <https://builds.apache.org/job/apache-atlas-nightly/ws/addons/hive-bridge/target/dependency/hook/hive/atlas-hive-plugin-impl/atlas-typesystem-0.8-incubating-SNAPSHOT.jar>
[INFO] Copying atlas-notification-0.8-incubating-SNAPSHOT.jar to <https://builds.apache.org/job/apache-atlas-nightly/ws/addons/hive-bridge/target/dependency/hook/hive/atlas-hive-plugin-impl/atlas-notification-0.8-incubating-SNAPSHOT.jar>
[INFO] Copying hdfs-model-0.8-incubating-SNAPSHOT.jar to <https://builds.apache.org/job/apache-atlas-nightly/ws/addons/hive-bridge/target/dependency/hook/hive/atlas-hive-plugin-impl/hdfs-model-0.8-incubating-SNAPSHOT.jar>
[INFO] Copying atlas-common-0.8-incubating-SNAPSHOT.jar to <https://builds.apache.org/job/apache-atlas-nightly/ws/addons/hive-bridge/target/dependency/hook/hive/atlas-hive-plugin-impl/atlas-common-0.8-incubating-SNAPSHOT.jar>
[INFO] Copying scala-compiler-2.11.8.jar to <https://builds.apache.org/job/apache-atlas-nightly/ws/addons/hive-bridge/target/dependency/hook/hive/atlas-hive-plugin-impl/scala-compiler-2.11.8.jar>
[INFO] Copying scala-reflect-2.11.8.jar to <https://builds.apache.org/job/apache-atlas-nightly/ws/addons/hive-bridge/target/dependency/hook/hive/atlas-hive-plugin-impl/scala-reflect-2.11.8.jar>
[INFO] Copying scala-library-2.11.8.jar to <https://builds.apache.org/job/apache-atlas-nightly/ws/addons/hive-bridge/target/dependency/hook/hive/atlas-hive-plugin-impl/scala-library-2.11.8.jar>
[INFO] Copying scalap-2.11.8.jar to <https://builds.apache.org/job/apache-atlas-nightly/ws/addons/hive-bridge/target/dependency/hook/hive/atlas-hive-plugin-impl/scalap-2.11.8.jar>
[INFO] Copying guice-multibindings-4.1.0.jar to <https://builds.apache.org/job/apache-atlas-nightly/ws/addons/hive-bridge/target/dependency/hook/hive/atlas-hive-plugin-impl/guice-multibindings-4.1.0.jar>
[INFO] Copying kafka_2.11-0.10.0.0.jar to <https://builds.apache.org/job/apache-atlas-nightly/ws/addons/hive-bridge/target/dependency/hook/hive/atlas-hive-plugin-impl/kafka_2.11-0.10.0.0.jar>
[INFO] Copying kafka-clients-0.10.0.0.jar to <https://builds.apache.org/job/apache-atlas-nightly/ws/addons/hive-bridge/target/dependency/hook/hive/atlas-hive-plugin-impl/kafka-clients-0.10.0.0.jar>
[INFO] Copying gson-2.5.jar to <https://builds.apache.org/job/apache-atlas-nightly/ws/addons/hive-bridge/target/dependency/hook/hive/atlas-hive-plugin-impl/gson-2.5.jar>
[INFO] 
[INFO] --- maven-dependency-plugin:2.10:copy (copy-hook-shim) @ hive-bridge ---
[INFO] Configured Artifact: org.apache.atlas:hive-bridge-shim:0.8-incubating-SNAPSHOT:jar
[INFO] Configured Artifact: org.apache.atlas:atlas-plugin-classloader:0.8-incubating-SNAPSHOT:jar
[INFO] Copying hive-bridge-shim-0.8-incubating-SNAPSHOT.jar to <https://builds.apache.org/job/apache-atlas-nightly/ws/addons/hive-bridge/target/dependency/hook/hive/hive-bridge-shim-0.8-incubating-SNAPSHOT.jar>
[INFO] Copying atlas-plugin-classloader-0.8-incubating-SNAPSHOT.jar to <https://builds.apache.org/job/apache-atlas-nightly/ws/addons/hive-bridge/target/dependency/hook/hive/atlas-plugin-classloader-0.8-incubating-SNAPSHOT.jar>
[INFO] 
[INFO] >>> jetty-maven-plugin:9.2.12.v20150709:deploy-war (start-jetty) > validate
@ hive-bridge >>>
[INFO] 
[INFO] --- buildnumber-maven-plugin:1.4:create (default) @ hive-bridge ---
[INFO] Executing: /bin/sh -c cd '<https://builds.apache.org/job/apache-atlas-nightly/ws/addons/hive-bridge'>
&& 'git' 'rev-parse' '--verify' 'HEAD'
[INFO] Working directory: <https://builds.apache.org/job/apache-atlas-nightly/ws/addons/hive-bridge>
[INFO] Storing buildNumber: fe86177a1d55b18b9b1a205fcd1cae83c6b85606 at timestamp: 1488792815046
[WARNING] Cannot get the branch information from the git repository: 
Detecting the current branch failed: fatal: ref HEAD is not a symbolic ref

[INFO] Executing: /bin/sh -c cd '<https://builds.apache.org/job/apache-atlas-nightly/ws/addons/hive-bridge'>
&& 'git' 'rev-parse' '--verify' 'HEAD'
[INFO] Working directory: <https://builds.apache.org/job/apache-atlas-nightly/ws/addons/hive-bridge>
[INFO] Storing buildScmBranch: UNKNOWN
[INFO] 
[INFO] --- maven-resources-plugin:2.7:copy-resources (copy-resources) @ hive-bridge ---
[INFO] Using 'UTF-8' encoding to copy filtered resources.
[INFO] Copying 10 resources
[INFO] 
[INFO] <<< jetty-maven-plugin:9.2.12.v20150709:deploy-war (start-jetty) < validate
@ hive-bridge <<<
[INFO] 
[INFO] --- jetty-maven-plugin:9.2.12.v20150709:deploy-war (start-jetty) @ hive-bridge ---
[INFO] Configuring Jetty for project: Apache Atlas Hive Bridge
[INFO] ------------------------------------------------------------------------
[INFO] Reactor Summary:
[INFO] 
[INFO] Apache Atlas Server Build Tools .................... SUCCESS [  0.828 s]
[INFO] apache-atlas ....................................... SUCCESS [  7.144 s]
[INFO] Apache Atlas Integration ........................... SUCCESS [ 57.689 s]
[INFO] Apache Atlas Common ................................ SUCCESS [ 19.140 s]
[INFO] Apache Atlas Typesystem ............................ SUCCESS [01:34 min]
[INFO] Apache Atlas Client ................................ SUCCESS [ 21.738 s]
[INFO] Apache Atlas Server API ............................ SUCCESS [ 12.937 s]
[INFO] Apache Atlas Notification .......................... SUCCESS [ 44.053 s]
[INFO] Apache Atlas Graph Database Projects ............... SUCCESS [  0.720 s]
[INFO] Apache Atlas Graph Database API .................... SUCCESS [  8.383 s]
[INFO] Graph Database Common Code ......................... SUCCESS [  8.455 s]
[INFO] Apache Atlas Titan 1.0.0 GraphDB Impl .............. SUCCESS [ 33.756 s]
[INFO] Shaded version of Apache hbase client .............. SUCCESS [  8.743 s]
[INFO] Apache Atlas Titan 0.5.4 Graph DB Impl ............. SUCCESS [01:51 min]
[INFO] Apache Atlas Graph Database Implementation Dependencies SUCCESS [  0.738 s]
[INFO] Shaded version of Apache hbase server .............. SUCCESS [ 25.142 s]
[INFO] Apache Atlas Repository ............................ SUCCESS [17:00 min]
[INFO] Apache Atlas Authorization ......................... SUCCESS [ 16.196 s]
[INFO] Apache Atlas Business Catalog ...................... SUCCESS [ 35.346 s]
[INFO] Apache Atlas UI .................................... SUCCESS [ 59.496 s]
[INFO] Apache Atlas Web Application ....................... SUCCESS [10:03 min]
[INFO] Apache Atlas Documentation ......................... SUCCESS [  6.531 s]
[INFO] Apache Atlas FileSystem Model ...................... SUCCESS [  2.222 s]
[INFO] Apache Atlas Plugin Classloader .................... SUCCESS [ 11.711 s]
[INFO] Apache Atlas Hive Bridge Shim ...................... SUCCESS [  9.186 s]
[INFO] Apache Atlas Hive Bridge ........................... FAILURE [ 17.038 s]
[INFO] Apache Atlas Falcon Bridge Shim .................... SKIPPED
[INFO] Apache Atlas Falcon Bridge ......................... SKIPPED
[INFO] Apache Atlas Sqoop Bridge Shim ..................... SKIPPED
[INFO] Apache Atlas Sqoop Bridge .......................... SKIPPED
[INFO] Apache Atlas Storm Bridge Shim ..................... SKIPPED
[INFO] Apache Atlas Storm Bridge .......................... SKIPPED
[INFO] Apache Atlas Distribution .......................... SKIPPED
[INFO] ------------------------------------------------------------------------
[INFO] BUILD FAILURE
[INFO] ------------------------------------------------------------------------
[INFO] Total time: 37:19 min
[INFO] Finished at: 2017-03-06T09:33:35+00:00
[INFO] Final Memory: 415M/1967M
[INFO] ------------------------------------------------------------------------
[ERROR] Failed to execute goal org.eclipse.jetty:jetty-maven-plugin:9.2.12.v20150709:deploy-war
(start-jetty) on project hive-bridge: Failure: ShutdownMonitorThread already started ->
[Help 1]
[ERROR] 
[ERROR] To see the full stack trace of the errors, re-run Maven with the -e switch.
[ERROR] Re-run Maven using the -X switch to enable full debug logging.
[ERROR] 
[ERROR] For more information about the errors and possible solutions, please read the following
articles:
[ERROR] [Help 1] http://cwiki.apache.org/confluence/display/MAVEN/MojoExecutionException
[ERROR] 
[ERROR] After correcting the problems, you can resume the build with the command
[ERROR]   mvn <goals> -rf :hive-bridge
Build step 'Execute shell' marked build as failure
[CHECKSTYLE] Collecting checkstyle analysis files...
[CHECKSTYLE] Finding all files that match the pattern **/target/checkstyle-result.xml
[CHECKSTYLE] Parsing 32 files in <https://builds.apache.org/job/apache-atlas-nightly/ws/>
[CHECKSTYLE] Successfully parsed file <https://builds.apache.org/job/apache-atlas-nightly/ws/addons/falcon-bridge-shim/target/checkstyle-result.xml>
with 29 unique warnings and 0 duplicates.
[CHECKSTYLE] Successfully parsed file <https://builds.apache.org/job/apache-atlas-nightly/ws/addons/falcon-bridge/target/checkstyle-result.xml>
with 420 unique warnings and 0 duplicates.
[CHECKSTYLE] Successfully parsed file <https://builds.apache.org/job/apache-atlas-nightly/ws/addons/hdfs-model/target/checkstyle-result.xml>
with 420 unique warnings and 0 duplicates.
[CHECKSTYLE] Successfully parsed file <https://builds.apache.org/job/apache-atlas-nightly/ws/addons/hive-bridge-shim/target/checkstyle-result.xml>
with 435 unique warnings and 0 duplicates.
[CHECKSTYLE] Successfully parsed file <https://builds.apache.org/job/apache-atlas-nightly/ws/addons/sqoop-bridge-shim/target/checkstyle-result.xml>
with 451 unique warnings and 0 duplicates.
[CHECKSTYLE] Successfully parsed file <https://builds.apache.org/job/apache-atlas-nightly/ws/addons/sqoop-bridge/target/checkstyle-result.xml>
with 576 unique warnings and 0 duplicates.
[CHECKSTYLE] Successfully parsed file <https://builds.apache.org/job/apache-atlas-nightly/ws/addons/storm-bridge-shim/target/checkstyle-result.xml>
with 597 unique warnings and 0 duplicates.
[CHECKSTYLE] Successfully parsed file <https://builds.apache.org/job/apache-atlas-nightly/ws/addons/storm-bridge/target/checkstyle-result.xml>
with 866 unique warnings and 0 duplicates.
[CHECKSTYLE] Successfully parsed file <https://builds.apache.org/job/apache-atlas-nightly/ws/authorization/target/checkstyle-result.xml>
with 1319 unique warnings and 0 duplicates.
[CHECKSTYLE] Successfully parsed file <https://builds.apache.org/job/apache-atlas-nightly/ws/catalog/target/checkstyle-result.xml>
with 3453 unique warnings and 0 duplicates.
[CHECKSTYLE] Successfully parsed file <https://builds.apache.org/job/apache-atlas-nightly/ws/client/target/checkstyle-result.xml>
with 5063 unique warnings and 0 duplicates.
[CHECKSTYLE] Successfully parsed file <https://builds.apache.org/job/apache-atlas-nightly/ws/common/target/checkstyle-result.xml>
with 6245 unique warnings and 0 duplicates.
[CHECKSTYLE] Successfully parsed file <https://builds.apache.org/job/apache-atlas-nightly/ws/dashboardv2/target/checkstyle-result.xml>
with 6245 unique warnings and 0 duplicates.
[CHECKSTYLE] Successfully parsed file <https://builds.apache.org/job/apache-atlas-nightly/ws/distro/target/checkstyle-result.xml>
with 6245 unique warnings and 0 duplicates.
[CHECKSTYLE] Successfully parsed file <https://builds.apache.org/job/apache-atlas-nightly/ws/docs/target/checkstyle-result.xml>
with 6245 unique warnings and 0 duplicates.
[CHECKSTYLE] Successfully parsed file <https://builds.apache.org/job/apache-atlas-nightly/ws/graphdb/api/target/checkstyle-result.xml>
with 6490 unique warnings and 0 duplicates.
[CHECKSTYLE] Successfully parsed file <https://builds.apache.org/job/apache-atlas-nightly/ws/graphdb/common/target/checkstyle-result.xml>
with 6639 unique warnings and 0 duplicates.
[CHECKSTYLE] Successfully parsed file <https://builds.apache.org/job/apache-atlas-nightly/ws/graphdb/graphdb-impls/target/checkstyle-result.xml>
with 6639 unique warnings and 0 duplicates.
[CHECKSTYLE] Successfully parsed file <https://builds.apache.org/job/apache-atlas-nightly/ws/graphdb/target/checkstyle-result.xml>
with 6639 unique warnings and 0 duplicates.
[CHECKSTYLE] Successfully parsed file <https://builds.apache.org/job/apache-atlas-nightly/ws/graphdb/titan0/target/checkstyle-result.xml>
with 8859 unique warnings and 0 duplicates.
[CHECKSTYLE] Successfully parsed file <https://builds.apache.org/job/apache-atlas-nightly/ws/graphdb/titan1/target/checkstyle-result.xml>
with 9764 unique warnings and 0 duplicates.
[CHECKSTYLE] Successfully parsed file <https://builds.apache.org/job/apache-atlas-nightly/ws/intg/target/checkstyle-result.xml>
with 15663 unique warnings and 0 duplicates.
[CHECKSTYLE] Successfully parsed file <https://builds.apache.org/job/apache-atlas-nightly/ws/notification/target/checkstyle-result.xml>
with 16828 unique warnings and 0 duplicates.
[CHECKSTYLE] Successfully parsed file <https://builds.apache.org/job/apache-atlas-nightly/ws/plugin-classloader/target/checkstyle-result.xml>
with 16936 unique warnings and 0 duplicates.
[CHECKSTYLE] Successfully parsed file <https://builds.apache.org/job/apache-atlas-nightly/ws/repository/target/checkstyle-result.xml>
with 31571 unique warnings and 0 duplicates.
[CHECKSTYLE] Successfully parsed file <https://builds.apache.org/job/apache-atlas-nightly/ws/server-api/target/checkstyle-result.xml>
with 31968 unique warnings and 0 duplicates.
[CHECKSTYLE] Successfully parsed file <https://builds.apache.org/job/apache-atlas-nightly/ws/shaded/hbase-client-shaded/target/checkstyle-result.xml>
with 31968 unique warnings and 0 duplicates.
[CHECKSTYLE] Successfully parsed file <https://builds.apache.org/job/apache-atlas-nightly/ws/shaded/hbase-server-shaded/target/checkstyle-result.xml>
with 31968 unique warnings and 0 duplicates.
[CHECKSTYLE] Successfully parsed file <https://builds.apache.org/job/apache-atlas-nightly/ws/target/checkstyle-result.xml>
with 31968 unique warnings and 0 duplicates.
[CHECKSTYLE] Successfully parsed file <https://builds.apache.org/job/apache-atlas-nightly/ws/titan/target/checkstyle-result.xml>
with 32430 unique warnings and 0 duplicates.
[CHECKSTYLE] Successfully parsed file <https://builds.apache.org/job/apache-atlas-nightly/ws/typesystem/target/checkstyle-result.xml>
with 36649 unique warnings and 0 duplicates.
[CHECKSTYLE] Successfully parsed file <https://builds.apache.org/job/apache-atlas-nightly/ws/webapp/target/checkstyle-result.xml>
with 44819 unique warnings and 0 duplicates.
[CHECKSTYLE] Computing warning deltas based on reference build #535
[FINDBUGS] Collecting findbugs analysis files...
[FINDBUGS] Finding all files that match the pattern **/target/findbugs.xml
[FINDBUGS] Parsing 22 files in <https://builds.apache.org/job/apache-atlas-nightly/ws/>
[FINDBUGS] Successfully parsed file <https://builds.apache.org/job/apache-atlas-nightly/ws/addons/falcon-bridge-shim/target/findbugs.xml>
with 0 unique warnings and 0 duplicates.
[FINDBUGS] Successfully parsed file <https://builds.apache.org/job/apache-atlas-nightly/ws/addons/falcon-bridge/target/findbugs.xml>
with 0 unique warnings and 0 duplicates.
[FINDBUGS] Successfully parsed file <https://builds.apache.org/job/apache-atlas-nightly/ws/addons/hive-bridge-shim/target/findbugs.xml>
with 0 unique warnings and 0 duplicates.
[FINDBUGS] Successfully parsed file <https://builds.apache.org/job/apache-atlas-nightly/ws/addons/sqoop-bridge-shim/target/findbugs.xml>
with 0 unique warnings and 0 duplicates.
[FINDBUGS] Successfully parsed file <https://builds.apache.org/job/apache-atlas-nightly/ws/addons/sqoop-bridge/target/findbugs.xml>
with 0 unique warnings and 0 duplicates.
[FINDBUGS] Successfully parsed file <https://builds.apache.org/job/apache-atlas-nightly/ws/addons/storm-bridge-shim/target/findbugs.xml>
with 0 unique warnings and 0 duplicates.
[FINDBUGS] Successfully parsed file <https://builds.apache.org/job/apache-atlas-nightly/ws/addons/storm-bridge/target/findbugs.xml>
with 0 unique warnings and 0 duplicates.
[FINDBUGS] Successfully parsed file <https://builds.apache.org/job/apache-atlas-nightly/ws/authorization/target/findbugs.xml>
with 0 unique warnings and 0 duplicates.
[FINDBUGS] Successfully parsed file <https://builds.apache.org/job/apache-atlas-nightly/ws/catalog/target/findbugs.xml>
with 0 unique warnings and 0 duplicates.
[FINDBUGS] Successfully parsed file <https://builds.apache.org/job/apache-atlas-nightly/ws/client/target/findbugs.xml>
with 0 unique warnings and 0 duplicates.
[FINDBUGS] Successfully parsed file <https://builds.apache.org/job/apache-atlas-nightly/ws/common/target/findbugs.xml>
with 0 unique warnings and 0 duplicates.
[FINDBUGS] Successfully parsed file <https://builds.apache.org/job/apache-atlas-nightly/ws/graphdb/api/target/findbugs.xml>
with 0 unique warnings and 0 duplicates.
[FINDBUGS] Successfully parsed file <https://builds.apache.org/job/apache-atlas-nightly/ws/graphdb/common/target/findbugs.xml>
with 0 unique warnings and 0 duplicates.
[FINDBUGS] Successfully parsed file <https://builds.apache.org/job/apache-atlas-nightly/ws/graphdb/titan0/target/findbugs.xml>
with 0 unique warnings and 0 duplicates.
[FINDBUGS] Successfully parsed file <https://builds.apache.org/job/apache-atlas-nightly/ws/intg/target/findbugs.xml>
with 0 unique warnings and 0 duplicates.
[FINDBUGS] Successfully parsed file <https://builds.apache.org/job/apache-atlas-nightly/ws/notification/target/findbugs.xml>
with 0 unique warnings and 0 duplicates.
[FINDBUGS] Successfully parsed file <https://builds.apache.org/job/apache-atlas-nightly/ws/plugin-classloader/target/findbugs.xml>
with 0 unique warnings and 0 duplicates.
[FINDBUGS] Successfully parsed file <https://builds.apache.org/job/apache-atlas-nightly/ws/repository/target/findbugs.xml>
with 0 unique warnings and 0 duplicates.
[FINDBUGS] Successfully parsed file <https://builds.apache.org/job/apache-atlas-nightly/ws/server-api/target/findbugs.xml>
with 0 unique warnings and 0 duplicates.
[FINDBUGS] Successfully parsed file <https://builds.apache.org/job/apache-atlas-nightly/ws/titan/target/findbugs.xml>
with 0 unique warnings and 0 duplicates.
[FINDBUGS] Successfully parsed file <https://builds.apache.org/job/apache-atlas-nightly/ws/typesystem/target/findbugs.xml>
with 0 unique warnings and 0 duplicates.
[FINDBUGS] Successfully parsed file <https://builds.apache.org/job/apache-atlas-nightly/ws/webapp/target/findbugs.xml>
with 0 unique warnings and 0 duplicates.
[FINDBUGS] Computing warning deltas based on reference build #535
Archiving artifacts
Compressed 569.93 MB of artifacts by 63.7% relative to #535
TestNG Reports Processing: START
Looking for TestNG results report in workspace using pattern: **/target/surefire-reports/testng-results.xml,**/target/failsafe-reports/testng-results.xml
testng-results.xml was last modified before this build started. Ignoring it.
testng-results.xml was last modified before this build started. Ignoring it.
testng-results.xml was last modified before this build started. Ignoring it.
testng-results.xml was last modified before this build started. Ignoring it.
Saving reports...
Processing '/x1/jenkins/jenkins-home/jobs/apache-atlas-nightly/builds/674/testng/testng-results-1.xml'
Processing '/x1/jenkins/jenkins-home/jobs/apache-atlas-nightly/builds/674/testng/testng-results-10.xml'
Processing '/x1/jenkins/jenkins-home/jobs/apache-atlas-nightly/builds/674/testng/testng-results-11.xml'
Processing '/x1/jenkins/jenkins-home/jobs/apache-atlas-nightly/builds/674/testng/testng-results-12.xml'
Processing '/x1/jenkins/jenkins-home/jobs/apache-atlas-nightly/builds/674/testng/testng-results-2.xml'
Processing '/x1/jenkins/jenkins-home/jobs/apache-atlas-nightly/builds/674/testng/testng-results-3.xml'
Processing '/x1/jenkins/jenkins-home/jobs/apache-atlas-nightly/builds/674/testng/testng-results-4.xml'
Processing '/x1/jenkins/jenkins-home/jobs/apache-atlas-nightly/builds/674/testng/testng-results-5.xml'
Processing '/x1/jenkins/jenkins-home/jobs/apache-atlas-nightly/builds/674/testng/testng-results-6.xml'
Processing '/x1/jenkins/jenkins-home/jobs/apache-atlas-nightly/builds/674/testng/testng-results-7.xml'
Processing '/x1/jenkins/jenkins-home/jobs/apache-atlas-nightly/builds/674/testng/testng-results-8.xml'
Processing '/x1/jenkins/jenkins-home/jobs/apache-atlas-nightly/builds/674/testng/testng-results-9.xml'
Processing '/x1/jenkins/jenkins-home/jobs/apache-atlas-nightly/builds/674/testng/testng-results.xml'
TestNG Reports Processing: FINISH

Mime
View raw message