atlas-dev mailing list archives

Site index · List index
Message view « Date » · « Thread »
Top « Date » · « Thread »
From Apache Jenkins Server <jenk...@builds.apache.org>
Subject Build failed in Jenkins: apache-atlas-nightly #834
Date Sun, 13 Aug 2017 09:24:43 GMT
See <https://builds.apache.org/job/apache-atlas-nightly/834/display/redirect?page=changes>

Changes:

[madhan] ATLAS-2025: Validation of classification/type in basic search query

------------------------------------------
[...truncated 686.66 KB...]
127.0.0.1 - - [13/Aug/2017:09:19:37 +0000] "GET /api/atlas/v2/types/typedef/name/hive_db_v1
HTTP/1.1" 200 - "-" "Java/1.7.0_80"
127.0.0.1 - - [13/Aug/2017:09:19:37 +0000] "GET /api/atlas/v2/types/typedef/name/hive_column_v1
HTTP/1.1" 200 - "-" "Java/1.7.0_80"
127.0.0.1 - - [13/Aug/2017:09:19:37 +0000] "GET /api/atlas/v2/types/typedef/name/hive_table_v1
HTTP/1.1" 200 - "-" "Java/1.7.0_80"
127.0.0.1 - - [13/Aug/2017:09:19:37 +0000] "GET /api/atlas/v2/types/typedef/name/hive_process_v1
HTTP/1.1" 200 - "-" "Java/1.7.0_80"
127.0.0.1 - - [13/Aug/2017:09:19:37 +0000] "POST /api/atlas/types HTTP/1.1" 201 - "-" "Java/1.7.0_80"
127.0.0.1 - - [13/Aug/2017:09:19:37 +0000] "GET /api/atlas/v2/types/typedef/name/Fact HTTP/1.1"
200 - "-" "Java/1.7.0_80"
127.0.0.1 - - [13/Aug/2017:09:19:37 +0000] "GET /api/atlas/v2/types/typedef/name/ETL HTTP/1.1"
200 - "-" "Java/1.7.0_80"
127.0.0.1 - - [13/Aug/2017:09:19:37 +0000] "GET /api/atlas/v2/types/typedef/name/Dimension
HTTP/1.1" 200 - "-" "Java/1.7.0_80"
127.0.0.1 - - [13/Aug/2017:09:19:37 +0000] "GET /api/atlas/v2/types/typedef/name/Metric HTTP/1.1"
200 - "-" "Java/1.7.0_80"
127.0.0.1 - - [13/Aug/2017:09:19:37 +0000] "POST /api/atlas/types HTTP/1.1" 201 - "-" "Java/1.7.0_80"
127.0.0.1 - - [13/Aug/2017:09:19:38 +0000] "POST /api/atlas/entities HTTP/1.1" 201 - "-" "Java/1.7.0_80"
127.0.0.1 - - [13/Aug/2017:09:19:38 +0000] "POST /api/atlas/entities HTTP/1.1" 201 - "-" "Java/1.7.0_80"
127.0.0.1 - - [13/Aug/2017:09:19:38 +0000] "POST /api/atlas/entities HTTP/1.1" 201 - "-" "Java/1.7.0_80"
127.0.0.1 - - [13/Aug/2017:09:19:38 +0000] "POST /api/atlas/entities HTTP/1.1" 201 - "-" "Java/1.7.0_80"
127.0.0.1 - - [13/Aug/2017:09:19:38 +0000] "POST /api/atlas/entities HTTP/1.1" 201 - "-" "Java/1.7.0_80"
127.0.0.1 - - [13/Aug/2017:09:19:38 +0000] "POST /api/atlas/entities HTTP/1.1" 201 - "-" "Java/1.7.0_80"
127.0.0.1 - - [13/Aug/2017:09:19:38 +0000] "POST /api/atlas/entities HTTP/1.1" 201 - "-" "Java/1.7.0_80"
127.0.0.1 - - [13/Aug/2017:09:19:38 +0000] "POST /api/atlas/entities HTTP/1.1" 201 - "-" "Java/1.7.0_80"
127.0.0.1 - - [13/Aug/2017:09:19:38 +0000] "GET /api/atlas/v2/types/typedef/name/tableType
HTTP/1.1" 200 - "-" "Java/1.7.0_80"
127.0.0.1 - - [13/Aug/2017:09:19:38 +0000] "GET /api/atlas/v2/types/typedef/name/serdeType
HTTP/1.1" 200 - "-" "Java/1.7.0_80"
127.0.0.1 - - [13/Aug/2017:09:19:38 +0000] "GET /api/atlas/v2/types/typedef/name/classification
HTTP/1.1" 200 - "-" "Java/1.7.0_80"
127.0.0.1 - - [13/Aug/2017:09:19:38 +0000] "GET /api/atlas/v2/types/typedef/name/pii HTTP/1.1"
200 - "-" "Java/1.7.0_80"
127.0.0.1 - - [13/Aug/2017:09:19:38 +0000] "GET /api/atlas/v2/types/typedef/name/phi HTTP/1.1"
200 - "-" "Java/1.7.0_80"
127.0.0.1 - - [13/Aug/2017:09:19:38 +0000] "GET /api/atlas/v2/types/typedef/name/pci HTTP/1.1"
200 - "-" "Java/1.7.0_80"
127.0.0.1 - - [13/Aug/2017:09:19:38 +0000] "GET /api/atlas/v2/types/typedef/name/sox HTTP/1.1"
200 - "-" "Java/1.7.0_80"
127.0.0.1 - - [13/Aug/2017:09:19:38 +0000] "GET /api/atlas/v2/types/typedef/name/sec HTTP/1.1"
200 - "-" "Java/1.7.0_80"
127.0.0.1 - - [13/Aug/2017:09:19:38 +0000] "GET /api/atlas/v2/types/typedef/name/finance HTTP/1.1"
200 - "-" "Java/1.7.0_80"
127.0.0.1 - - [13/Aug/2017:09:19:38 +0000] "GET /api/atlas/v2/types/typedef/name/Fact HTTP/1.1"
200 - "-" "Java/1.7.0_80"
127.0.0.1 - - [13/Aug/2017:09:19:38 +0000] "GET /api/atlas/v2/types/typedef/name/ETL HTTP/1.1"
200 - "-" "Java/1.7.0_80"
127.0.0.1 - - [13/Aug/2017:09:19:38 +0000] "GET /api/atlas/v2/types/typedef/name/Dimension
HTTP/1.1" 200 - "-" "Java/1.7.0_80"
127.0.0.1 - - [13/Aug/2017:09:19:38 +0000] "GET /api/atlas/v2/types/typedef/name/Metric HTTP/1.1"
200 - "-" "Java/1.7.0_80"
127.0.0.1 - - [13/Aug/2017:09:19:38 +0000] "GET /api/atlas/v2/types/typedef/name/hive_db_v1
HTTP/1.1" 200 - "-" "Java/1.7.0_80"
127.0.0.1 - - [13/Aug/2017:09:19:38 +0000] "GET /api/atlas/v2/types/typedef/name/hive_column_v1
HTTP/1.1" 200 - "-" "Java/1.7.0_80"
127.0.0.1 - - [13/Aug/2017:09:19:38 +0000] "GET /api/atlas/v2/types/typedef/name/hive_table_v1
HTTP/1.1" 200 - "-" "Java/1.7.0_80"
127.0.0.1 - - [13/Aug/2017:09:19:38 +0000] "GET /api/atlas/v2/types/typedef/name/hive_process_v1
HTTP/1.1" 200 - "-" "Java/1.7.0_80"
127.0.0.1 - - [13/Aug/2017:09:19:38 +0000] "POST /api/atlas/types HTTP/1.1" 201 - "-" "Java/1.7.0_80"
127.0.0.1 - - [13/Aug/2017:09:19:38 +0000] "POST /api/atlas/entities HTTP/1.1" 201 - "-" "Java/1.7.0_80"
127.0.0.1 - - [13/Aug/2017:09:19:38 +0000] "POST /api/atlas/entities HTTP/1.1" 201 - "-" "Java/1.7.0_80"
127.0.0.1 - - [13/Aug/2017:09:19:38 +0000] "POST /api/atlas/entities HTTP/1.1" 201 - "-" "Java/1.7.0_80"
127.0.0.1 - - [13/Aug/2017:09:19:39 +0000] "POST /api/atlas/entities HTTP/1.1" 201 - "-" "Java/1.7.0_80"
127.0.0.1 - - [13/Aug/2017:09:19:39 +0000] "POST /api/atlas/entities HTTP/1.1" 201 - "-" "Java/1.7.0_80"
127.0.0.1 - - [13/Aug/2017:09:19:39 +0000] "POST /api/atlas/entities HTTP/1.1" 201 - "-" "Java/1.7.0_80"
127.0.0.1 - - [13/Aug/2017:09:19:39 +0000] "POST /api/atlas/entities HTTP/1.1" 201 - "-" "Java/1.7.0_80"
127.0.0.1 - - [13/Aug/2017:09:19:39 +0000] "POST /api/atlas/entities HTTP/1.1" 201 - "-" "Java/1.7.0_80"
127.0.0.1 - - [13/Aug/2017:09:19:39 +0000] "GET /api/atlas/entities?type=hive_table_v1&property=qualifiedName&value=sales_factKINWCci8l4
HTTP/1.1" 200 - "-" "Java/1.7.0_80"
127.0.0.1 - - [13/Aug/2017:09:19:39 +0000] "GET /api/atlas/lineage/cfa9cfae-e546-4f95-8e84-4592efa20231/schema
HTTP/1.1" 200 - "-" "Java/1.7.0_80"
127.0.0.1 - - [13/Aug/2017:09:19:40 +0000] "GET /api/atlas/entities?type=hive_table_v1&property=qualifiedName&value=sales_fact_monthly_mvWGIxJsqv7j
HTTP/1.1" 200 - "-" "Java/1.7.0_80"
127.0.0.1 - - [13/Aug/2017:09:19:40 +0000] "GET /api/atlas/v2/lineage/85c531ae-2773-4f34-a7cf-caf1d0d8310f?direction=BOTH&depth=5
HTTP/1.1" 200 - "-" "Java/1.7.0_80"
127.0.0.1 - - [13/Aug/2017:09:19:42 +0000] "GET /api/atlas/lineage/hive/table/sales_fact_monthly_mvuGVYpI5GYr/inputs/graph
HTTP/1.1" 200 - "-" "Java/1.7.0_80"
127.0.0.1 - - [13/Aug/2017:09:19:45 +0000] "GET /api/atlas/entities?type=hive_table_v1&property=qualifiedName&value=sales_factKINWCci8l4
HTTP/1.1" 200 - "-" "Java/1.7.0_80"
127.0.0.1 - - [13/Aug/2017:09:19:45 +0000] "GET /api/atlas/lineage/cfa9cfae-e546-4f95-8e84-4592efa20231/outputs/graph
HTTP/1.1" 200 - "-" "Java/1.7.0_80"
127.0.0.1 - - [13/Aug/2017:09:19:46 +0000] "GET /api/atlas/entities?type=hive_table_v1&property=qualifiedName&value=sales_factYBZViM0eFm
HTTP/1.1" 200 - "-" "Java/1.7.0_80"
127.0.0.1 - - [13/Aug/2017:09:19:46 +0000] "GET /api/atlas/v2/lineage/03ad4fb1-e898-4f93-b553-d4ffd84cf49e?direction=OUTPUT&depth=5
HTTP/1.1" 200 - "-" "Java/1.7.0_80"
127.0.0.1 - - [13/Aug/2017:09:19:47 +0000] "GET /api/atlas/lineage/hive/table/blah/schema
HTTP/1.1" 404 - "-" "Java/1.7.0_80"
127.0.0.1 - - [13/Aug/2017:09:19:47 +0000] "GET /api/atlas/lineage/hive/table/sales_factKINWCci8l4/schema
HTTP/1.1" 200 - "-" "Java/1.7.0_80"
127.0.0.1 - - [13/Aug/2017:09:19:48 +0000] "GET /api/atlas/entities?type=hive_table_v1&property=qualifiedName&value=sales_fact_monthly_mvuGVYpI5GYr
HTTP/1.1" 200 - "-" "Java/1.7.0_80"
127.0.0.1 - - [13/Aug/2017:09:19:48 +0000] "GET /api/atlas/lineage/51fab3a6-2833-4432-8ab9-44b2e3f69534/inputs/graph
HTTP/1.1" 200 - "-" "Java/1.7.0_80"
127.0.0.1 - - [13/Aug/2017:09:19:49 +0000] "GET /api/atlas/lineage/hive/table/sales_factKINWCci8l4/outputs/graph
HTTP/1.1" 200 - "-" "Java/1.7.0_80"
127.0.0.1 - - [13/Aug/2017:09:19:51 +0000] "GET /api/atlas/lineage/hive/table/SalesgaN6PFbHkp/schema
HTTP/1.1" 404 - "-" "Java/1.7.0_80"
127.0.0.1 - - [13/Aug/2017:09:19:51 +0000] "GET /api/atlas/entities?type=hive_table_v1&property=qualifiedName&value=sales_fact_monthly_mvWGIxJsqv7j
HTTP/1.1" 200 - "-" "Java/1.7.0_80"
127.0.0.1 - - [13/Aug/2017:09:19:51 +0000] "GET /api/atlas/v2/lineage/85c531ae-2773-4f34-a7cf-caf1d0d8310f?direction=INPUT&depth=5
HTTP/1.1" 200 - "-" "Java/1.7.0_80"
127.0.0.1 - - [13/Aug/2017:09:19:52 +0000] "GET /api/atlas/v2/types/enumdef/name/blah HTTP/1.1"
404 - "-" "Java/1.7.0_80"
127.0.0.1 - - [13/Aug/2017:09:19:52 +0000] "GET /api/atlas/v2/types/enumdef/guid/blah HTTP/1.1"
404 - "-" "Java/1.7.0_80"
127.0.0.1 - - [13/Aug/2017:09:19:52 +0000] "GET /api/atlas/v2/types/structdef/name/blah HTTP/1.1"
404 - "-" "Java/1.7.0_80"
127.0.0.1 - - [13/Aug/2017:09:19:53 +0000] "GET /api/atlas/v2/types/structdef/guid/blah HTTP/1.1"
404 - "-" "Java/1.7.0_80"
127.0.0.1 - - [13/Aug/2017:09:19:53 +0000] "GET /api/atlas/v2/types/classificationdef/name/blah
HTTP/1.1" 404 - "-" "Java/1.7.0_80"
127.0.0.1 - - [13/Aug/2017:09:19:53 +0000] "GET /api/atlas/v2/types/classificationdef/guid/blah
HTTP/1.1" 404 - "-" "Java/1.7.0_80"
127.0.0.1 - - [13/Aug/2017:09:19:53 +0000] "GET /api/atlas/v2/types/entitydef/name/blah HTTP/1.1"
404 - "-" "Java/1.7.0_80"
127.0.0.1 - - [13/Aug/2017:09:19:53 +0000] "GET /api/atlas/v2/types/entitydef/guid/blah HTTP/1.1"
404 - "-" "Java/1.7.0_80"
127.0.0.1 - - [13/Aug/2017:09:19:53 +0000] "POST /api/atlas/v2/types/typedefs/ HTTP/1.1" 200
- "-" "Java/1.7.0_80"
127.0.0.1 - - [13/Aug/2017:09:19:53 +0000] "PUT /api/atlas/v2/types/typedefs/ HTTP/1.1" 200
- "-" "Java/1.7.0_80"
127.0.0.1 - - [13/Aug/2017:09:19:53 +0000] "GET /api/atlas/v2/types/typedefs/?type=ENTITY
HTTP/1.1" 200 - "-" "Java/1.7.0_80"
127.0.0.1 - - [13/Aug/2017:09:19:53 +0000] "POST /api/atlas/v2/types/typedefs/ HTTP/1.1" 200
- "-" "Java/1.7.0_80"
127.0.0.1 - - [13/Aug/2017:09:19:53 +0000] "POST /api/atlas/v2/types/typedefs/ HTTP/1.1" 409
- "-" "Java/1.7.0_80"
127.0.0.1 - - [13/Aug/2017:09:19:53 +0000] "POST /api/atlas/v2/types/typedefs/ HTTP/1.1" 200
- "-" "Java/1.7.0_80"
127.0.0.1 - - [13/Aug/2017:09:19:53 +0000] "GET /api/atlas/v2/types/typedefs/?supertype=AX2Pux4xERt&type=CLASS
HTTP/1.1" 200 - "-" "Java/1.7.0_80"
127.0.0.1 - - [13/Aug/2017:09:19:53 +0000] "GET /api/atlas/v2/types/typedefs/?notsupertype=BRa9iCptheD&supertype=AX2Pux4xERt&type=CLASS
HTTP/1.1" 200 - "-" "Java/1.7.0_80"
Tests run: 133, Failures: 5, Errors: 0, Skipped: 5, Time elapsed: 240.969 sec <<<
FAILURE! - in TestSuite
runQuickStart(org.apache.atlas.examples.QuickStartV2IT)  Time elapsed: 0.551 sec  <<<
FAILURE!
org.apache.atlas.AtlasServiceException: Metadata service API org.apache.atlas.AtlasBaseClient$APIInfo@6dfd4118
failed with status 409 (Conflict) Response Body ({"errorCode":"ATLAS-409-00-001","errorMessage":"Given
type Dimension already exists"})
	at org.apache.atlas.examples.QuickStartV2IT.runQuickStart(QuickStartV2IT.java:49)

testDeleteByQualifiedName(org.apache.atlas.notification.NotificationHookConsumerIT)  Time
elapsed: 60.127 sec  <<< FAILURE!
java.lang.Exception: Waiting timed out after 60000 msec
	at org.apache.atlas.notification.NotificationHookConsumerIT.testDeleteByQualifiedName(NotificationHookConsumerIT.java:184)

testUpdateEntityPartial(org.apache.atlas.notification.NotificationHookConsumerIT)  Time elapsed:
60.062 sec  <<< FAILURE!
java.lang.Exception: Waiting timed out after 60000 msec
	at org.apache.atlas.notification.NotificationHookConsumerIT.testUpdateEntityPartial(NotificationHookConsumerIT.java:127)

testAddReferenceProperty(org.apache.atlas.web.integration.EntityJerseyResourceIT)  Time elapsed:
0.178 sec  <<< FAILURE!
java.lang.AssertionError: expected:<1> but was:<2>
	at org.apache.atlas.web.integration.EntityJerseyResourceIT.addProperty(EntityJerseyResourceIT.java:476)
	at org.apache.atlas.web.integration.EntityJerseyResourceIT.testAddReferenceProperty(EntityJerseyResourceIT.java:451)

testPartialUpdate(org.apache.atlas.web.integration.EntityJerseyResourceIT)  Time elapsed:
0.146 sec  <<< FAILURE!
java.lang.AssertionError: expected:<1> but was:<3>
	at org.apache.atlas.web.integration.EntityJerseyResourceIT.testPartialUpdate(EntityJerseyResourceIT.java:878)


Results :

Failed tests: 
  QuickStartV2IT.runQuickStart:49 » AtlasService Metadata service API org.apache...
  NotificationHookConsumerIT.testDeleteByQualifiedName:184->BaseResourceIT.waitFor:626
» 
  NotificationHookConsumerIT.testUpdateEntityPartial:127->BaseResourceIT.waitFor:626 »

  EntityJerseyResourceIT.testAddReferenceProperty:451->addProperty:476 expected:<1>
but was:<2>
  EntityJerseyResourceIT.testPartialUpdate:878 expected:<1> but was:<3>

Tests run: 133, Failures: 5, Errors: 0, Skipped: 5

[INFO] 
[INFO] --- jetty-maven-plugin:9.2.12.v20150709:stop (stop-jetty) @ atlas-webapp ---
[INFO] Waiting 10 seconds for jetty to stop
[INFO] Stopped ServerConnector@9b46349{HTTP/1.1}{0.0.0.0:31000}
[INFO] Closing Spring root WebApplicationContext
[INFO] Shutting down log4j
[INFO] Stopped o.e.j.m.p.JettyWebAppContext@2a409341{/,<https://builds.apache.org/job/apache-atlas-nightly/ws/webapp/target/atlas-webapp-0.9-SNAPSHOT/,UNAVAILABLE}{/home/jenkins/jenkins-slave/workspace/apache-atlas-nightly/webapp/target/atlas-webapp-0.9-SNAPSHOT.war}>
[INFO] Server reports itself as stopped
[INFO] 
[INFO] --- maven-source-plugin:2.4:jar-no-fork (attach-sources) @ atlas-webapp ---
[INFO] Building jar: <https://builds.apache.org/job/apache-atlas-nightly/ws/webapp/target/atlas-webapp-0.9-SNAPSHOT-sources.jar>
[INFO] 
[INFO] --- maven-source-plugin:2.4:test-jar-no-fork (attach-sources) @ atlas-webapp ---
[INFO] Building jar: <https://builds.apache.org/job/apache-atlas-nightly/ws/webapp/target/atlas-webapp-0.9-SNAPSHOT-test-sources.jar>
[INFO] 
[INFO] --- maven-failsafe-plugin:2.19.1:verify (verify) @ atlas-webapp ---
[INFO] ------------------------------------------------------------------------
[INFO] Reactor Summary:
[INFO] 
[INFO] Apache Atlas Server Build Tools .................... SUCCESS [  0.856 s]
[INFO] apache-atlas ....................................... SUCCESS [  7.531 s]
[INFO] Apache Atlas Integration ........................... SUCCESS [ 37.672 s]
[INFO] Apache Atlas Common ................................ SUCCESS [ 17.910 s]
[INFO] Apache Atlas Typesystem ............................ SUCCESS [01:11 min]
[INFO] Apache Atlas Client ................................ SUCCESS [ 20.231 s]
[INFO] Apache Atlas Server API ............................ SUCCESS [ 10.800 s]
[INFO] Apache Atlas Notification .......................... SUCCESS [ 24.127 s]
[INFO] Apache Atlas Graph Database Projects ............... SUCCESS [  0.705 s]
[INFO] Apache Atlas Graph Database API .................... SUCCESS [  8.797 s]
[INFO] Graph Database Common Code ......................... SUCCESS [  8.739 s]
[INFO] Apache Atlas Titan 1.0.0 GraphDB Impl .............. SUCCESS [ 33.772 s]
[INFO] Shaded version of Apache hbase client .............. SUCCESS [  9.595 s]
[INFO] Apache Atlas Titan 0.5.4 Graph DB Impl ............. SUCCESS [01:21 min]
[INFO] Apache Atlas Graph Database Implementation Dependencies SUCCESS [  0.697 s]
[INFO] Shaded version of Apache hbase server .............. SUCCESS [ 23.245 s]
[INFO] Apache Atlas Repository ............................ SUCCESS [07:04 min]
[INFO] Apache Atlas Authorization ......................... SUCCESS [ 13.231 s]
[INFO] Apache Atlas Business Catalog ...................... SUCCESS [ 20.743 s]
[INFO] Apache Atlas UI .................................... SUCCESS [01:02 min]
[INFO] Apache Atlas Web Application ....................... FAILURE [09:07 min]
[INFO] Apache Atlas Documentation ......................... SKIPPED
[INFO] Apache Atlas FileSystem Model ...................... SKIPPED
[INFO] Apache Atlas Plugin Classloader .................... SKIPPED
[INFO] Apache Atlas Hive Bridge Shim ...................... SKIPPED
[INFO] Apache Atlas Hive Bridge ........................... SKIPPED
[INFO] Apache Atlas Falcon Bridge Shim .................... SKIPPED
[INFO] Apache Atlas Falcon Bridge ......................... SKIPPED
[INFO] Apache Atlas Sqoop Bridge Shim ..................... SKIPPED
[INFO] Apache Atlas Sqoop Bridge .......................... SKIPPED
[INFO] Apache Atlas Storm Bridge Shim ..................... SKIPPED
[INFO] Apache Atlas Storm Bridge .......................... SKIPPED
[INFO] Apache Atlas Distribution .......................... SKIPPED
[INFO] ------------------------------------------------------------------------
[INFO] BUILD FAILURE
[INFO] ------------------------------------------------------------------------
[INFO] Total time: 23:47 min
[INFO] Finished at: 2017-08-13T09:20:01Z
[INFO] Final Memory: 351M/1958M
[INFO] ------------------------------------------------------------------------
log4j:WARN No appenders could be found for logger (org.apache.zookeeper.ClientCnxn).
log4j:WARN Please initialize the log4j system properly.
log4j:WARN See http://logging.apache.org/log4j/1.2/faq.html#noconfig for more info.
[ERROR] Failed to execute goal org.apache.maven.plugins:maven-failsafe-plugin:2.19.1:verify
(verify) on project atlas-webapp: There are test failures.
[ERROR] 
[ERROR] Please refer to <https://builds.apache.org/job/apache-atlas-nightly/ws/webapp/target/failsafe-reports>
for the individual test results.
[ERROR] -> [Help 1]
[ERROR] 
[ERROR] To see the full stack trace of the errors, re-run Maven with the -e switch.
[ERROR] Re-run Maven using the -X switch to enable full debug logging.
[ERROR] 
[ERROR] For more information about the errors and possible solutions, please read the following
articles:
[ERROR] [Help 1] http://cwiki.apache.org/confluence/display/MAVEN/MojoFailureException
[ERROR] 
[ERROR] After correcting the problems, you can resume the build with the command
[ERROR]   mvn <goals> -rf :atlas-webapp
Build step 'Execute shell' marked build as failure
[CHECKSTYLE] Collecting checkstyle analysis files...
[CHECKSTYLE] Searching for all files in <https://builds.apache.org/job/apache-atlas-nightly/ws/>
that match the pattern **/target/checkstyle-result.xml
[CHECKSTYLE] Parsing 19 files in <https://builds.apache.org/job/apache-atlas-nightly/ws/>
[CHECKSTYLE] Successfully parsed file <https://builds.apache.org/job/apache-atlas-nightly/ws/authorization/target/checkstyle-result.xml>
with 467 unique warnings and 0 duplicates.
[CHECKSTYLE] Successfully parsed file <https://builds.apache.org/job/apache-atlas-nightly/ws/catalog/target/checkstyle-result.xml>
with 2612 unique warnings and 0 duplicates.
[CHECKSTYLE] Successfully parsed file <https://builds.apache.org/job/apache-atlas-nightly/ws/client/target/checkstyle-result.xml>
with 4247 unique warnings and 0 duplicates.
[CHECKSTYLE] Successfully parsed file <https://builds.apache.org/job/apache-atlas-nightly/ws/common/target/checkstyle-result.xml>
with 5459 unique warnings and 0 duplicates.
[CHECKSTYLE] Successfully parsed file <https://builds.apache.org/job/apache-atlas-nightly/ws/dashboardv2/target/checkstyle-result.xml>
with 5459 unique warnings and 0 duplicates.
[CHECKSTYLE] Successfully parsed file <https://builds.apache.org/job/apache-atlas-nightly/ws/graphdb/api/target/checkstyle-result.xml>
with 5728 unique warnings and 0 duplicates.
[CHECKSTYLE] Successfully parsed file <https://builds.apache.org/job/apache-atlas-nightly/ws/graphdb/common/target/checkstyle-result.xml>
with 5915 unique warnings and 0 duplicates.
[CHECKSTYLE] Successfully parsed file <https://builds.apache.org/job/apache-atlas-nightly/ws/graphdb/graphdb-impls/target/checkstyle-result.xml>
with 5915 unique warnings and 0 duplicates.
[CHECKSTYLE] Successfully parsed file <https://builds.apache.org/job/apache-atlas-nightly/ws/graphdb/target/checkstyle-result.xml>
with 5915 unique warnings and 0 duplicates.
[CHECKSTYLE] Successfully parsed file <https://builds.apache.org/job/apache-atlas-nightly/ws/graphdb/titan0/target/checkstyle-result.xml>
with 8189 unique warnings and 0 duplicates.
[CHECKSTYLE] Successfully parsed file <https://builds.apache.org/job/apache-atlas-nightly/ws/graphdb/titan1/target/checkstyle-result.xml>
with 9137 unique warnings and 0 duplicates.
[CHECKSTYLE] Successfully parsed file <https://builds.apache.org/job/apache-atlas-nightly/ws/intg/target/checkstyle-result.xml>
with 16637 unique warnings and 0 duplicates.
[CHECKSTYLE] Successfully parsed file <https://builds.apache.org/job/apache-atlas-nightly/ws/notification/target/checkstyle-result.xml>
with 17847 unique warnings and 0 duplicates.
[CHECKSTYLE] Successfully parsed file <https://builds.apache.org/job/apache-atlas-nightly/ws/repository/target/checkstyle-result.xml>
with 36510 unique warnings and 0 duplicates.
[CHECKSTYLE] Successfully parsed file <https://builds.apache.org/job/apache-atlas-nightly/ws/server-api/target/checkstyle-result.xml>
with 36889 unique warnings and 0 duplicates.
[CHECKSTYLE] Successfully parsed file <https://builds.apache.org/job/apache-atlas-nightly/ws/shaded/hbase-client-shaded/target/checkstyle-result.xml>
with 36889 unique warnings and 0 duplicates.
[CHECKSTYLE] Successfully parsed file <https://builds.apache.org/job/apache-atlas-nightly/ws/shaded/hbase-server-shaded/target/checkstyle-result.xml>
with 36889 unique warnings and 0 duplicates.
[CHECKSTYLE] Successfully parsed file <https://builds.apache.org/job/apache-atlas-nightly/ws/target/checkstyle-result.xml>
with 36889 unique warnings and 0 duplicates.
[CHECKSTYLE] Successfully parsed file <https://builds.apache.org/job/apache-atlas-nightly/ws/typesystem/target/checkstyle-result.xml>
with 41107 unique warnings and 0 duplicates.
<Git Blamer> Using GitBlamer to create author and commit information for all warnings.
<Git Blamer> GIT_COMMIT=b714fe00656f529cec8e4b467322a41729f0ddc5, workspace=<https://builds.apache.org/job/apache-atlas-nightly/ws/>
 > git rev-parse b714fe00656f529cec8e4b467322a41729f0ddc5^{commit} # timeout=10
[CHECKSTYLE] Computing warning deltas based on reference build #711
[FINDBUGS] Collecting findbugs analysis files...
[FINDBUGS] Searching for all files in <https://builds.apache.org/job/apache-atlas-nightly/ws/>
that match the pattern **/target/findbugs.xml
[FINDBUGS] Parsing 12 files in <https://builds.apache.org/job/apache-atlas-nightly/ws/>
[FINDBUGS] Successfully parsed file <https://builds.apache.org/job/apache-atlas-nightly/ws/authorization/target/findbugs.xml>
with 0 unique warnings and 0 duplicates.
[FINDBUGS] Successfully parsed file <https://builds.apache.org/job/apache-atlas-nightly/ws/catalog/target/findbugs.xml>
with 0 unique warnings and 0 duplicates.
[FINDBUGS] Successfully parsed file <https://builds.apache.org/job/apache-atlas-nightly/ws/client/target/findbugs.xml>
with 0 unique warnings and 0 duplicates.
[FINDBUGS] Successfully parsed file <https://builds.apache.org/job/apache-atlas-nightly/ws/common/target/findbugs.xml>
with 0 unique warnings and 0 duplicates.
[FINDBUGS] Successfully parsed file <https://builds.apache.org/job/apache-atlas-nightly/ws/graphdb/api/target/findbugs.xml>
with 0 unique warnings and 0 duplicates.
[FINDBUGS] Successfully parsed file <https://builds.apache.org/job/apache-atlas-nightly/ws/graphdb/common/target/findbugs.xml>
with 0 unique warnings and 0 duplicates.
[FINDBUGS] Successfully parsed file <https://builds.apache.org/job/apache-atlas-nightly/ws/graphdb/titan0/target/findbugs.xml>
with 0 unique warnings and 0 duplicates.
[FINDBUGS] Successfully parsed file <https://builds.apache.org/job/apache-atlas-nightly/ws/intg/target/findbugs.xml>
with 0 unique warnings and 0 duplicates.
[FINDBUGS] Successfully parsed file <https://builds.apache.org/job/apache-atlas-nightly/ws/notification/target/findbugs.xml>
with 0 unique warnings and 0 duplicates.
[FINDBUGS] Successfully parsed file <https://builds.apache.org/job/apache-atlas-nightly/ws/repository/target/findbugs.xml>
with 0 unique warnings and 0 duplicates.
[FINDBUGS] Successfully parsed file <https://builds.apache.org/job/apache-atlas-nightly/ws/server-api/target/findbugs.xml>
with 0 unique warnings and 0 duplicates.
[FINDBUGS] Successfully parsed file <https://builds.apache.org/job/apache-atlas-nightly/ws/typesystem/target/findbugs.xml>
with 0 unique warnings and 0 duplicates.
<Git Blamer> Using GitBlamer to create author and commit information for all warnings.
<Git Blamer> GIT_COMMIT=b714fe00656f529cec8e4b467322a41729f0ddc5, workspace=<https://builds.apache.org/job/apache-atlas-nightly/ws/>
[FINDBUGS] Computing warning deltas based on reference build #711
Archiving artifacts
[Fast Archiver] No artifacts from apache-atlas-nightly #711 to compare, so performing full
copy of artifacts
TestNG Reports Processing: START
Looking for TestNG results report in workspace using pattern: **/target/surefire-reports/testng-results.xml,**/target/failsafe-reports/testng-results.xml
Saving reports...
Processing '/x1/jenkins/jenkins-home/jobs/apache-atlas-nightly/builds/834/testng/testng-results-1.xml'
Processing '/x1/jenkins/jenkins-home/jobs/apache-atlas-nightly/builds/834/testng/testng-results-10.xml'
Processing '/x1/jenkins/jenkins-home/jobs/apache-atlas-nightly/builds/834/testng/testng-results-2.xml'
Processing '/x1/jenkins/jenkins-home/jobs/apache-atlas-nightly/builds/834/testng/testng-results-3.xml'
Processing '/x1/jenkins/jenkins-home/jobs/apache-atlas-nightly/builds/834/testng/testng-results-4.xml'
Processing '/x1/jenkins/jenkins-home/jobs/apache-atlas-nightly/builds/834/testng/testng-results-5.xml'
Processing '/x1/jenkins/jenkins-home/jobs/apache-atlas-nightly/builds/834/testng/testng-results-6.xml'
Processing '/x1/jenkins/jenkins-home/jobs/apache-atlas-nightly/builds/834/testng/testng-results-7.xml'
Processing '/x1/jenkins/jenkins-home/jobs/apache-atlas-nightly/builds/834/testng/testng-results-8.xml'
Processing '/x1/jenkins/jenkins-home/jobs/apache-atlas-nightly/builds/834/testng/testng-results-9.xml'
Processing '/x1/jenkins/jenkins-home/jobs/apache-atlas-nightly/builds/834/testng/testng-results.xml'
0.756144% of tests failed, which exceeded threshold of 0%. Marking build as UNSTABLE
TestNG Reports Processing: FINISH

Mime
View raw message