atlas-dev mailing list archives

Site index · List index
Message view « Date » · « Thread »
Top « Date » · « Thread »
From Apache Jenkins Server <jenk...@builds.apache.org>
Subject Build failed in Jenkins: apache-atlas-nightly #835
Date Tue, 15 Aug 2017 13:33:55 GMT
See <https://builds.apache.org/job/apache-atlas-nightly/835/display/redirect?page=changes>

Changes:

[david_radley] Add Javadoc format to class summaries

------------------------------------------
[...truncated 607.13 KB...]
Caused by: java.net.ConnectException: Connection refused
	at org.apache.atlas.web.integration.TypedefsJerseyResourceIT.testUpdate(TypedefsJerseyResourceIT.java:133)

testDuplicateSubmit(org.apache.atlas.web.integration.TypesJerseyResourceIT)  Time elapsed:
0.003 sec  <<< FAILURE!
com.sun.jersey.api.client.ClientHandlerException: java.net.ConnectException: Connection refused
	at org.apache.atlas.web.integration.TypesJerseyResourceIT.testDuplicateSubmit(TypesJerseyResourceIT.java:102)
Caused by: java.net.ConnectException: Connection refused
	at org.apache.atlas.web.integration.TypesJerseyResourceIT.testDuplicateSubmit(TypesJerseyResourceIT.java:102)

testGetDefinitionForNonexistentType(org.apache.atlas.web.integration.TypesJerseyResourceIT)
 Time elapsed: 0.001 sec  <<< FAILURE!
org.testng.TestException: 

Expected exception org.apache.atlas.AtlasServiceException but got com.sun.jersey.api.client.ClientHandlerException:
java.net.ConnectException: Connection refused
	at org.apache.atlas.web.integration.TypesJerseyResourceIT.testGetDefinitionForNonexistentType(TypesJerseyResourceIT.java:167)
Caused by: java.net.ConnectException: Connection refused
	at org.apache.atlas.web.integration.TypesJerseyResourceIT.testGetDefinitionForNonexistentType(TypesJerseyResourceIT.java:167)

testGetTraitNames(org.apache.atlas.web.integration.TypesJerseyResourceIT)  Time elapsed: 0.003
sec  <<< FAILURE!
com.sun.jersey.api.client.ClientHandlerException: java.net.ConnectException: Connection refused
	at org.apache.atlas.web.integration.TypesJerseyResourceIT.addTraits(TypesJerseyResourceIT.java:226)
	at org.apache.atlas.web.integration.TypesJerseyResourceIT.testGetTraitNames(TypesJerseyResourceIT.java:188)
Caused by: java.net.ConnectException: Connection refused
	at org.apache.atlas.web.integration.TypesJerseyResourceIT.addTraits(TypesJerseyResourceIT.java:226)
	at org.apache.atlas.web.integration.TypesJerseyResourceIT.testGetTraitNames(TypesJerseyResourceIT.java:188)

testListTypesByFilter(org.apache.atlas.web.integration.TypesJerseyResourceIT)  Time elapsed:
0.005 sec  <<< FAILURE!
com.sun.jersey.api.client.ClientHandlerException: java.net.ConnectException: Connection refused
	at org.apache.atlas.web.integration.TypesJerseyResourceIT.testListTypesByFilter(TypesJerseyResourceIT.java:206)
Caused by: java.net.ConnectException: Connection refused
	at org.apache.atlas.web.integration.TypesJerseyResourceIT.testListTypesByFilter(TypesJerseyResourceIT.java:206)

testUpdate(org.apache.atlas.web.integration.TypesJerseyResourceIT)  Time elapsed: 0.002 sec
 <<< FAILURE!
com.sun.jersey.api.client.ClientHandlerException: java.net.ConnectException: Connection refused
	at org.apache.atlas.web.integration.TypesJerseyResourceIT.testUpdate(TypesJerseyResourceIT.java:117)
Caused by: java.net.ConnectException: Connection refused
	at org.apache.atlas.web.integration.TypesJerseyResourceIT.testUpdate(TypesJerseyResourceIT.java:117)

testSimpleLoginForValidUser(org.apache.atlas.web.filters.AtlasAuthenticationSimpleFilterIT)
 Time elapsed: 0.001 sec  <<< FAILURE!
java.net.ConnectException: Connection refused
	at org.apache.atlas.web.filters.AtlasAuthenticationSimpleFilterIT.testSimpleLoginForValidUser(AtlasAuthenticationSimpleFilterIT.java:45)

testSimpleLoginAndAuthorizationWithValidCrendentialsAndInvalidAccessToResource(org.apache.atlas.web.filters.AtlasAuthenticationSimpleFilterIT)
 Time elapsed: 0.001 sec  <<< FAILURE!
java.lang.AssertionError: Failed with exception Connection refused
	at org.apache.atlas.web.filters.AtlasAuthenticationSimpleFilterIT.testSimpleLoginAndAuthorizationWithValidCrendentialsAndInvalidAccessToResource(AtlasAuthenticationSimpleFilterIT.java:78)

testAccessforUnauthenticatedResource(org.apache.atlas.web.filters.AtlasAuthenticationSimpleFilterIT)
 Time elapsed: 0 sec  <<< FAILURE!
java.net.ConnectException: Connection refused
	at org.apache.atlas.web.filters.AtlasAuthenticationSimpleFilterIT.testAccessforUnauthenticatedResource(AtlasAuthenticationSimpleFilterIT.java:57)

testSimpleLoginWithInvalidCrendentials(org.apache.atlas.web.filters.AtlasAuthenticationSimpleFilterIT)
 Time elapsed: 0 sec  <<< FAILURE!
java.net.ConnectException: Connection refused
	at org.apache.atlas.web.filters.AtlasAuthenticationSimpleFilterIT.testSimpleLoginWithInvalidCrendentials(AtlasAuthenticationSimpleFilterIT.java:93)


Results :

Failed tests: 
  QuickStartV2IT.runQuickStart:49 » AtlasService Metadata service API org.apache...
  NotificationHookConsumerIT.testDeleteByQualifiedName:184->BaseResourceIT.waitFor:626
» 
  NotificationHookConsumerIT.testUpdateEntityPartial:127->BaseResourceIT.waitFor:621 »
ClientHandler
  NotificationHookConsumerIT.testUpdatePartialUpdatingQualifiedName:149 » ClientHandler
  AtlasAuthenticationSimpleFilterIT.testAccessforUnauthenticatedResource:57 » Connect
  AtlasAuthenticationSimpleFilterIT.testSimpleLoginAndAuthorizationWithValidCrendentialsAndInvalidAccessToResource:78
Failed with exception Connection refused
  AtlasAuthenticationSimpleFilterIT.testSimpleLoginForValidUser:45 » Connect Con...
  AtlasAuthenticationSimpleFilterIT.testSimpleLoginWithInvalidCrendentials:93 » Connect
  AdminJerseyResourceIT.testGetVersion:40 » ClientHandler java.net.ConnectExcept...
  DataSetLineageJerseyResourceIT.setUp:56->BaseResourceIT.createTypeDefinitionsV1:357->BaseResourceIT.createType:172
» ClientHandler
  EntityDiscoveryJerseyResourceIT.testSearchByDSL:66 » ClientHandler java.net.Co...
  EntityDiscoveryJerseyResourceIT.testSearchByDSLForUnknownType » Test 
Expected...
  EntityDiscoveryJerseyResourceIT.testSearchFullTextOnDSLFailure:150 » ClientHandler
  EntityDiscoveryJerseyResourceIT.testSearchUsingDSL:128 » ClientHandler java.ne...
  EntityJerseyResourceIT.setUp:89->BaseResourceIT.createTypeDefinitionsV1:357->BaseResourceIT.createType:172
» ClientHandler
  EntityLineageJerseyResourceIT.setUp:61->DataSetLineageJerseyResourceIT.setUp:56->BaseResourceIT.createTypeDefinitionsV1:357->BaseResourceIT.createType:172
» ClientHandler
  EntityLineageJerseyResourceIT>DataSetLineageJerseyResourceIT.testInputsGraph:62 »
IllegalArgument
  EntityLineageJerseyResourceIT>DataSetLineageJerseyResourceIT.testInputsGraphForEntity:81
» IllegalArgument
  EntityLineageJerseyResourceIT>DataSetLineageJerseyResourceIT.testOutputsGraph:98 »
IllegalArgument
  EntityLineageJerseyResourceIT>DataSetLineageJerseyResourceIT.testOutputsGraphForEntity:117
» IllegalArgument
  EntityLineageJerseyResourceIT>DataSetLineageJerseyResourceIT.testSchema:134 » IllegalArgument
  EntityLineageJerseyResourceIT.testSchemaForDB » Test 
Expected exception org.a...
  EntityLineageJerseyResourceIT>DataSetLineageJerseyResourceIT.testSchemaForEntity:158
» IllegalArgument
  EntityLineageJerseyResourceIT.testSchemaForInvalidTable » Test 
Expected excep...
  EntityV2JerseyResourceIT.testAddNullPropertyValue:322->addProperty:399->getEntityByGuid:663
» ClientHandler
  EntityV2JerseyResourceIT.testAddTraitWithNoRegistration » Test 
Expected excep...
  EntityV2JerseyResourceIT.testCreateNestedEntities:133 » ClientHandler java.net...
  EntityV2JerseyResourceIT.testDeleteEntities:714->BaseResourceIT.createEntity:267->BaseResourceIT.modifyEntity:247
» ClientHandler
  EntityV2JerseyResourceIT.testDeleteEntityByUniqAttribute:737->createHiveDB:415->BaseResourceIT.createEntity:267->BaseResourceIT.modifyEntity:247
» ClientHandler
  EntityV2JerseyResourceIT.testDeleteTraitNonExistent:545 » ClientHandler java.n...
  EntityV2JerseyResourceIT.testEntityDeduping:159->BaseResourceIT.searchByDSL:675 »
ClientHandler
  EntityV2JerseyResourceIT.testEntityDefinitionAcrossTypeUpdate:201 » ClientHandler
  EntityV2JerseyResourceIT.testEntityInvalidValue:242->BaseResourceIT.createEntity:267->BaseResourceIT.modifyEntity:247
» ClientHandler
  EntityV2JerseyResourceIT.testGetEntityByAttribute:269 » ClientHandler java.net...
  EntityV2JerseyResourceIT.testGetInvalidEntityDefinition » Test 
Expected excep...
  EntityV2JerseyResourceIT.testRequestUser:151->createHiveDB:415->BaseResourceIT.createEntity:267->BaseResourceIT.modifyEntity:247
» ClientHandler
  EntityV2JerseyResourceIT.testSubmitEntityWithBadDateFormat:277->BaseResourceIT.createEntity:267->BaseResourceIT.modifyEntity:247
» ClientHandler
  EntityV2JerseyResourceIT.testUTF8:591->BaseResourceIT.createType:162->BaseResourceIT.batchCreateTypes:142
» ClientHandler
  MetadataDiscoveryJerseyResourceIT.testSearchByDSL:72 » ClientHandler java.net....
  MetadataDiscoveryJerseyResourceIT.testSearchByDSLForUnknownType » Test 
Expect...
  MetadataDiscoveryJerseyResourceIT.testSearchFullTextOnDSLFailure:182 » ClientHandler
  MetadataDiscoveryJerseyResourceIT.testSearchUsingDSL:168 » ClientHandler java....
  MetadataDiscoveryJerseyResourceIT.testSearchUsingGremlin:153 » ClientHandler j...
  TypedefsJerseyResourceIT.testDuplicateCreate:112 » ClientHandler java.net.Conn...
  TypedefsJerseyResourceIT.testInvalidGets:197 » ClientHandler java.net.ConnectE...
  TypedefsJerseyResourceIT.testListTypesByFilter:277 » ClientHandler java.net.Co...
  TypedefsJerseyResourceIT.testUpdate:133 » ClientHandler java.net.ConnectExcept...
  TypesJerseyResourceIT.testDuplicateSubmit:102 » ClientHandler java.net.Connect...
  TypesJerseyResourceIT.testGetDefinitionForNonexistentType » Test 
Expected exc...
  TypesJerseyResourceIT.testGetTraitNames:188->addTraits:226->BaseResourceIT.createType:208->BaseResourceIT.createType:186
» ClientHandler
  TypesJerseyResourceIT.testListTypesByFilter:206->BaseResourceIT.createType:208->BaseResourceIT.createType:193
» ClientHandler
  TypesJerseyResourceIT.testUpdate:117 » ClientHandler java.net.ConnectException...

Tests run: 135, Failures: 52, Errors: 0, Skipped: 48

[INFO] 
[INFO] --- jetty-maven-plugin:9.2.12.v20150709:stop (stop-jetty) @ atlas-webapp ---
[INFO] Jetty not running!
[INFO] 
[INFO] --- maven-source-plugin:2.4:jar-no-fork (attach-sources) @ atlas-webapp ---
[INFO] Building jar: <https://builds.apache.org/job/apache-atlas-nightly/ws/webapp/target/atlas-webapp-0.9-SNAPSHOT-sources.jar>
[INFO] 
[INFO] --- maven-source-plugin:2.4:test-jar-no-fork (attach-sources) @ atlas-webapp ---
[INFO] Building jar: <https://builds.apache.org/job/apache-atlas-nightly/ws/webapp/target/atlas-webapp-0.9-SNAPSHOT-test-sources.jar>
[INFO] 
[INFO] --- maven-failsafe-plugin:2.19.1:verify (verify) @ atlas-webapp ---
[INFO] ------------------------------------------------------------------------
[INFO] Reactor Summary:
[INFO] 
[INFO] Apache Atlas Server Build Tools .................... SUCCESS [  1.095 s]
[INFO] apache-atlas ....................................... SUCCESS [  9.446 s]
[INFO] Apache Atlas Integration ........................... SUCCESS [ 41.744 s]
[INFO] Apache Atlas Common ................................ SUCCESS [ 19.019 s]
[INFO] Apache Atlas Typesystem ............................ SUCCESS [01:20 min]
[INFO] Apache Atlas Client ................................ SUCCESS [ 22.691 s]
[INFO] Apache Atlas Server API ............................ SUCCESS [ 11.997 s]
[INFO] Apache Atlas Notification .......................... SUCCESS [ 28.354 s]
[INFO] Apache Atlas Graph Database Projects ............... SUCCESS [  0.709 s]
[INFO] Apache Atlas Graph Database API .................... SUCCESS [  8.662 s]
[INFO] Graph Database Common Code ......................... SUCCESS [  8.826 s]
[INFO] Apache Atlas Titan 1.0.0 GraphDB Impl .............. SUCCESS [ 34.767 s]
[INFO] Shaded version of Apache hbase client .............. SUCCESS [  9.847 s]
[INFO] Apache Atlas Titan 0.5.4 Graph DB Impl ............. SUCCESS [01:26 min]
[INFO] Apache Atlas Graph Database Implementation Dependencies SUCCESS [  0.729 s]
[INFO] Shaded version of Apache hbase server .............. SUCCESS [ 25.368 s]
[INFO] Apache Atlas Repository ............................ SUCCESS [07:26 min]
[INFO] Apache Atlas Authorization ......................... SUCCESS [ 15.715 s]
[INFO] Apache Atlas Business Catalog ...................... SUCCESS [ 23.202 s]
[INFO] Apache Atlas UI .................................... SUCCESS [01:06 min]
[INFO] Apache Atlas Web Application ....................... FAILURE [08:55 min]
[INFO] Apache Atlas Documentation ......................... SKIPPED
[INFO] Apache Atlas FileSystem Model ...................... SKIPPED
[INFO] Apache Atlas Plugin Classloader .................... SKIPPED
[INFO] Apache Atlas Hive Bridge Shim ...................... SKIPPED
[INFO] Apache Atlas Hive Bridge ........................... SKIPPED
[INFO] Apache Atlas Falcon Bridge Shim .................... SKIPPED
[INFO] Apache Atlas Falcon Bridge ......................... SKIPPED
[INFO] Apache Atlas Sqoop Bridge Shim ..................... SKIPPED
[INFO] Apache Atlas Sqoop Bridge .......................... SKIPPED
[INFO] Apache Atlas Storm Bridge Shim ..................... SKIPPED
[INFO] Apache Atlas Storm Bridge .......................... SKIPPED
[INFO] Apache Atlas Distribution .......................... SKIPPED
[INFO] ------------------------------------------------------------------------
[INFO] BUILD FAILURE
[INFO] ------------------------------------------------------------------------
[INFO] Total time: 24:39 min
[INFO] Finished at: 2017-08-15T13:22:02Z
[INFO] Final Memory: 357M/1380M
[INFO] ------------------------------------------------------------------------
[ERROR] Failed to execute goal org.apache.maven.plugins:maven-failsafe-plugin:2.19.1:verify
(verify) on project atlas-webapp: There are test failures.
[ERROR] 
[ERROR] Please refer to <https://builds.apache.org/job/apache-atlas-nightly/ws/webapp/target/failsafe-reports>
for the individual test results.
[ERROR] -> [Help 1]
[ERROR] 
[ERROR] To see the full stack trace of the errors, re-run Maven with the -e switch.
[ERROR] Re-run Maven using the -X switch to enable full debug logging.
[ERROR] 
[ERROR] For more information about the errors and possible solutions, please read the following
articles:
[ERROR] [Help 1] http://cwiki.apache.org/confluence/display/MAVEN/MojoFailureException
[ERROR] 
[ERROR] After correcting the problems, you can resume the build with the command
[ERROR]   mvn <goals> -rf :atlas-webapp
Build step 'Execute shell' marked build as failure
[CHECKSTYLE] Collecting checkstyle analysis files...
[CHECKSTYLE] Searching for all files in <https://builds.apache.org/job/apache-atlas-nightly/ws/>
that match the pattern **/target/checkstyle-result.xml
[CHECKSTYLE] Parsing 19 files in <https://builds.apache.org/job/apache-atlas-nightly/ws/>
[CHECKSTYLE] Successfully parsed file <https://builds.apache.org/job/apache-atlas-nightly/ws/authorization/target/checkstyle-result.xml>
with 467 unique warnings and 0 duplicates.
[CHECKSTYLE] Successfully parsed file <https://builds.apache.org/job/apache-atlas-nightly/ws/catalog/target/checkstyle-result.xml>
with 2612 unique warnings and 0 duplicates.
[CHECKSTYLE] Successfully parsed file <https://builds.apache.org/job/apache-atlas-nightly/ws/client/target/checkstyle-result.xml>
with 4247 unique warnings and 0 duplicates.
[CHECKSTYLE] Successfully parsed file <https://builds.apache.org/job/apache-atlas-nightly/ws/common/target/checkstyle-result.xml>
with 5459 unique warnings and 0 duplicates.
[CHECKSTYLE] Successfully parsed file <https://builds.apache.org/job/apache-atlas-nightly/ws/dashboardv2/target/checkstyle-result.xml>
with 5459 unique warnings and 0 duplicates.
[CHECKSTYLE] Successfully parsed file <https://builds.apache.org/job/apache-atlas-nightly/ws/graphdb/api/target/checkstyle-result.xml>
with 5728 unique warnings and 0 duplicates.
[CHECKSTYLE] Successfully parsed file <https://builds.apache.org/job/apache-atlas-nightly/ws/graphdb/common/target/checkstyle-result.xml>
with 5915 unique warnings and 0 duplicates.
[CHECKSTYLE] Successfully parsed file <https://builds.apache.org/job/apache-atlas-nightly/ws/graphdb/graphdb-impls/target/checkstyle-result.xml>
with 5915 unique warnings and 0 duplicates.
[CHECKSTYLE] Successfully parsed file <https://builds.apache.org/job/apache-atlas-nightly/ws/graphdb/target/checkstyle-result.xml>
with 5915 unique warnings and 0 duplicates.
[CHECKSTYLE] Successfully parsed file <https://builds.apache.org/job/apache-atlas-nightly/ws/graphdb/titan0/target/checkstyle-result.xml>
with 8189 unique warnings and 0 duplicates.
[CHECKSTYLE] Successfully parsed file <https://builds.apache.org/job/apache-atlas-nightly/ws/graphdb/titan1/target/checkstyle-result.xml>
with 9137 unique warnings and 0 duplicates.
[CHECKSTYLE] Successfully parsed file <https://builds.apache.org/job/apache-atlas-nightly/ws/intg/target/checkstyle-result.xml>
with 16637 unique warnings and 0 duplicates.
[CHECKSTYLE] Successfully parsed file <https://builds.apache.org/job/apache-atlas-nightly/ws/notification/target/checkstyle-result.xml>
with 17847 unique warnings and 0 duplicates.
[CHECKSTYLE] Successfully parsed file <https://builds.apache.org/job/apache-atlas-nightly/ws/repository/target/checkstyle-result.xml>
with 36507 unique warnings and 0 duplicates.
[CHECKSTYLE] Successfully parsed file <https://builds.apache.org/job/apache-atlas-nightly/ws/server-api/target/checkstyle-result.xml>
with 36886 unique warnings and 0 duplicates.
[CHECKSTYLE] Successfully parsed file <https://builds.apache.org/job/apache-atlas-nightly/ws/shaded/hbase-client-shaded/target/checkstyle-result.xml>
with 36886 unique warnings and 0 duplicates.
[CHECKSTYLE] Successfully parsed file <https://builds.apache.org/job/apache-atlas-nightly/ws/shaded/hbase-server-shaded/target/checkstyle-result.xml>
with 36886 unique warnings and 0 duplicates.
[CHECKSTYLE] Successfully parsed file <https://builds.apache.org/job/apache-atlas-nightly/ws/target/checkstyle-result.xml>
with 36886 unique warnings and 0 duplicates.
[CHECKSTYLE] Successfully parsed file <https://builds.apache.org/job/apache-atlas-nightly/ws/typesystem/target/checkstyle-result.xml>
with 41104 unique warnings and 0 duplicates.
<Git Blamer> Using GitBlamer to create author and commit information for all warnings.
<Git Blamer> GIT_COMMIT=5e638c2412a74197f67673417a03bb4311e447d0, workspace=<https://builds.apache.org/job/apache-atlas-nightly/ws/>
 > git rev-parse 5e638c2412a74197f67673417a03bb4311e447d0^{commit} # timeout=10
[CHECKSTYLE] Computing warning deltas based on reference build #711
[FINDBUGS] Collecting findbugs analysis files...
[FINDBUGS] Searching for all files in <https://builds.apache.org/job/apache-atlas-nightly/ws/>
that match the pattern **/target/findbugs.xml
[FINDBUGS] Parsing 12 files in <https://builds.apache.org/job/apache-atlas-nightly/ws/>
[FINDBUGS] Successfully parsed file <https://builds.apache.org/job/apache-atlas-nightly/ws/authorization/target/findbugs.xml>
with 0 unique warnings and 0 duplicates.
[FINDBUGS] Successfully parsed file <https://builds.apache.org/job/apache-atlas-nightly/ws/catalog/target/findbugs.xml>
with 0 unique warnings and 0 duplicates.
[FINDBUGS] Successfully parsed file <https://builds.apache.org/job/apache-atlas-nightly/ws/client/target/findbugs.xml>
with 0 unique warnings and 0 duplicates.
[FINDBUGS] Successfully parsed file <https://builds.apache.org/job/apache-atlas-nightly/ws/common/target/findbugs.xml>
with 0 unique warnings and 0 duplicates.
[FINDBUGS] Successfully parsed file <https://builds.apache.org/job/apache-atlas-nightly/ws/graphdb/api/target/findbugs.xml>
with 0 unique warnings and 0 duplicates.
[FINDBUGS] Successfully parsed file <https://builds.apache.org/job/apache-atlas-nightly/ws/graphdb/common/target/findbugs.xml>
with 0 unique warnings and 0 duplicates.
[FINDBUGS] Successfully parsed file <https://builds.apache.org/job/apache-atlas-nightly/ws/graphdb/titan0/target/findbugs.xml>
with 0 unique warnings and 0 duplicates.
[FINDBUGS] Successfully parsed file <https://builds.apache.org/job/apache-atlas-nightly/ws/intg/target/findbugs.xml>
with 0 unique warnings and 0 duplicates.
[FINDBUGS] Successfully parsed file <https://builds.apache.org/job/apache-atlas-nightly/ws/notification/target/findbugs.xml>
with 0 unique warnings and 0 duplicates.
[FINDBUGS] Successfully parsed file <https://builds.apache.org/job/apache-atlas-nightly/ws/repository/target/findbugs.xml>
with 0 unique warnings and 0 duplicates.
[FINDBUGS] Successfully parsed file <https://builds.apache.org/job/apache-atlas-nightly/ws/server-api/target/findbugs.xml>
with 0 unique warnings and 0 duplicates.
[FINDBUGS] Successfully parsed file <https://builds.apache.org/job/apache-atlas-nightly/ws/typesystem/target/findbugs.xml>
with 0 unique warnings and 0 duplicates.
<Git Blamer> Using GitBlamer to create author and commit information for all warnings.
<Git Blamer> GIT_COMMIT=5e638c2412a74197f67673417a03bb4311e447d0, workspace=<https://builds.apache.org/job/apache-atlas-nightly/ws/>
[FINDBUGS] Computing warning deltas based on reference build #711
Archiving artifacts
[Fast Archiver] No artifacts from apache-atlas-nightly #711 to compare, so performing full
copy of artifacts
TestNG Reports Processing: START
Looking for TestNG results report in workspace using pattern: **/target/surefire-reports/testng-results.xml,**/target/failsafe-reports/testng-results.xml
Saving reports...
Processing '/x1/jenkins/jenkins-home/jobs/apache-atlas-nightly/builds/835/testng/testng-results-1.xml'
Processing '/x1/jenkins/jenkins-home/jobs/apache-atlas-nightly/builds/835/testng/testng-results-10.xml'
Processing '/x1/jenkins/jenkins-home/jobs/apache-atlas-nightly/builds/835/testng/testng-results-2.xml'
Processing '/x1/jenkins/jenkins-home/jobs/apache-atlas-nightly/builds/835/testng/testng-results-3.xml'
Processing '/x1/jenkins/jenkins-home/jobs/apache-atlas-nightly/builds/835/testng/testng-results-4.xml'
Processing '/x1/jenkins/jenkins-home/jobs/apache-atlas-nightly/builds/835/testng/testng-results-5.xml'
Processing '/x1/jenkins/jenkins-home/jobs/apache-atlas-nightly/builds/835/testng/testng-results-6.xml'
Processing '/x1/jenkins/jenkins-home/jobs/apache-atlas-nightly/builds/835/testng/testng-results-7.xml'
Processing '/x1/jenkins/jenkins-home/jobs/apache-atlas-nightly/builds/835/testng/testng-results-8.xml'
Processing '/x1/jenkins/jenkins-home/jobs/apache-atlas-nightly/builds/835/testng/testng-results-9.xml'
Processing '/x1/jenkins/jenkins-home/jobs/apache-atlas-nightly/builds/835/testng/testng-results.xml'
9.022556% of tests failed, which exceeded threshold of 0%. Marking build as UNSTABLE
TestNG Reports Processing: FINISH

Mime
View raw message