atlas-dev mailing list archives

Site index · List index
Message view « Date » · « Thread »
Top « Date » · « Thread »
From Apache Jenkins Server <jenk...@builds.apache.org>
Subject Build failed in Jenkins: Atlas-master-IntegrationTests #14
Date Thu, 17 Aug 2017 02:53:10 GMT
See <https://builds.apache.org/job/Atlas-master-IntegrationTests/14/display/redirect?page=changes>

Changes:

[madhan] ATLAS-2052: updated packaing to exclude junit jar

------------------------------------------
[...truncated 643.37 KB...]
127.0.0.1 - - [17/Aug/2017:02:48:27 +0000] "POST /api/atlas/entities HTTP/1.1" 201 - "-" "Java/1.7.0_80"
127.0.0.1 - - [17/Aug/2017:02:48:27 +0000] "POST /api/atlas/entities HTTP/1.1" 201 - "-" "Java/1.7.0_80"
127.0.0.1 - - [17/Aug/2017:02:48:27 +0000] "POST /api/atlas/entities HTTP/1.1" 201 - "-" "Java/1.7.0_80"
127.0.0.1 - - [17/Aug/2017:02:48:27 +0000] "POST /api/atlas/entities HTTP/1.1" 400 - "-" "Java/1.7.0_80"
127.0.0.1 - - [17/Aug/2017:02:48:27 +0000] "POST /api/atlas/entities HTTP/1.1" 201 - "-" "Java/1.7.0_80"
127.0.0.1 - - [17/Aug/2017:02:48:27 +0000] "GET /api/atlas/v2/types/typedef/name/yeEs9zeKKV
HTTP/1.1" 404 - "-" "Java/1.7.0_80"
127.0.0.1 - - [17/Aug/2017:02:48:27 +0000] "POST /api/atlas/types HTTP/1.1" 201 - "-" "Java/1.7.0_80"
127.0.0.1 - - [17/Aug/2017:02:48:27 +0000] "POST /api/atlas/entities HTTP/1.1" 201 - "-" "Java/1.7.0_80"
127.0.0.1 - - [17/Aug/2017:02:48:27 +0000] "GET /api/atlas/entities/a95050bb-c34b-4832-9ebc-a5c217feea15
HTTP/1.1" 200 - "-" "Java/1.7.0_80"
127.0.0.1 - - [17/Aug/2017:02:48:27 +0000] "GET /api/atlas/v2/entity/guid/af3c175f-f67c-4405-b825-441acc965511
HTTP/1.1" 200 - "-" "Java/1.7.0_80"
127.0.0.1 - - [17/Aug/2017:02:48:27 +0000] "POST /api/atlas/v2/entity/ HTTP/1.1" 200 - "-"
"Java/1.7.0_80"
127.0.0.1 - - [17/Aug/2017:02:48:27 +0000] "POST /api/atlas/v2/entity/guid/random/classifications
HTTP/1.1" 404 - "-" "Java/1.7.0_80"
127.0.0.1 - - [17/Aug/2017:02:48:27 +0000] "POST /api/atlas/v2/entity/bulk/ HTTP/1.1" 200
- "-" "Java/1.7.0_80"
127.0.0.1 - - [17/Aug/2017:02:48:28 +0000] "POST /api/atlas/v2/entity/ HTTP/1.1" 200 - "-"
"Java/1.7.0_80"
127.0.0.1 - - [17/Aug/2017:02:48:28 +0000] "POST /api/atlas/v2/entity/ HTTP/1.1" 200 - "-"
"Java/1.7.0_80"
127.0.0.1 - - [17/Aug/2017:02:48:28 +0000] "DELETE /api/atlas/v2/entity/bulk/?guid=88769477-088a-4fd1-b63b-b5332a6f9be6&guid=117fbc30-4d64-4ec6-9ecd-19048058c780
HTTP/1.1" 200 - "-" "Java/1.7.0_80"
127.0.0.1 - - [17/Aug/2017:02:48:28 +0000] "POST /api/atlas/v2/entity/ HTTP/1.1" 200 - "-"
"Java/1.7.0_80"
127.0.0.1 - - [17/Aug/2017:02:48:28 +0000] "DELETE /api/atlas/v2/entity/uniqueAttribute/type/hive_db_v2?attr:name=dbWPizk3SkmZ%E6%AF%95%E5%83%99%E1%88%9C%E9%8A%8E%E8%AD%B6%E8%BA%BD%E8%BF%AC%E7%A3%98%EA%83%9F%E3%81%A1
HTTP/1.1" 200 - "-" "Java/1.7.0_80"
127.0.0.1 - - [17/Aug/2017:02:48:28 +0000] "DELETE /api/atlas/v2/entity/guid/random/classification/blah_trait
HTTP/1.1" 400 - "-" "Java/1.7.0_80"
127.0.0.1 - - [17/Aug/2017:02:48:28 +0000] "GET /api/atlas/discovery/search/dsl?query=hive_db_v2+where+name%3D'dbWPizk3SkmZ'&limit=10&offset=0
HTTP/1.1" 200 - "-" "Java/1.7.0_80"
127.0.0.1 - - [17/Aug/2017:02:48:29 +0000] "GET /api/atlas/discovery/search/dsl?query=hive_db_v2+where+name%3D'dbWPizk3SkmZ'&limit=10&offset=0
HTTP/1.1" 200 - "-" "Java/1.7.0_80"
127.0.0.1 - - [17/Aug/2017:02:48:29 +0000] "POST /api/atlas/v2/entity/ HTTP/1.1" 200 - "-"
"Java/1.7.0_80"
127.0.0.1 - - [17/Aug/2017:02:48:29 +0000] "GET /api/atlas/discovery/search/dsl?query=hive_db_v2+where+name%3D'dbWPizk3SkmZ'&limit=10&offset=0
HTTP/1.1" 200 - "-" "Java/1.7.0_80"
127.0.0.1 - - [17/Aug/2017:02:48:30 +0000] "POST /api/atlas/v2/types/typedefs/ HTTP/1.1" 200
- "-" "Java/1.7.0_80"
127.0.0.1 - - [17/Aug/2017:02:48:31 +0000] "POST /api/atlas/v2/entity/ HTTP/1.1" 200 - "-"
"Java/1.7.0_80"
127.0.0.1 - - [17/Aug/2017:02:48:31 +0000] "PUT /api/atlas/v2/types/typedefs/ HTTP/1.1" 200
- "-" "Java/1.7.0_80"
127.0.0.1 - - [17/Aug/2017:02:48:31 +0000] "GET /api/atlas/v2/entity/guid/7559e2da-d345-4f24-9208-f41e1a791772
HTTP/1.1" 200 - "-" "Java/1.7.0_80"
127.0.0.1 - - [17/Aug/2017:02:48:31 +0000] "POST /api/atlas/v2/entity/ HTTP/1.1" 404 - "-"
"Java/1.7.0_80"
127.0.0.1 - - [17/Aug/2017:02:48:31 +0000] "POST /api/atlas/v2/entity/ HTTP/1.1" 200 - "-"
"Java/1.7.0_80"
127.0.0.1 - - [17/Aug/2017:02:48:31 +0000] "POST /api/atlas/v2/entity/ HTTP/1.1" 200 - "-"
"Java/1.7.0_80"
127.0.0.1 - - [17/Aug/2017:02:48:31 +0000] "GET /api/atlas/v2/entity/uniqueAttribute/type/hive_db_v2?attr:name=dbWPizk3SkmZ
HTTP/1.1" 200 - "-" "Java/1.7.0_80"
127.0.0.1 - - [17/Aug/2017:02:48:31 +0000] "GET /api/atlas/v2/entity/guid/blah HTTP/1.1" 404
- "-" "Java/1.7.0_80"
127.0.0.1 - - [17/Aug/2017:02:48:31 +0000] "POST /api/atlas/v2/entity/ HTTP/1.1" 200 - "-"
"Java/1.7.0_80"
127.0.0.1 - - [17/Aug/2017:02:48:31 +0000] "GET /api/atlas/entities/3b1dcf04-6ab3-4506-a9d8-3c9323b761b9/audit?count=10
HTTP/1.1" 200 - "-" "Java/1.7.0_80"
127.0.0.1 - - [17/Aug/2017:02:48:31 +0000] "POST /api/atlas/v2/entity/ HTTP/1.1" 200 - "-"
"Java/1.7.0_80"
127.0.0.1 - - [17/Aug/2017:02:48:31 +0000] "POST /api/atlas/v2/entity/ HTTP/1.1" 200 - "-"
"Java/1.7.0_80"
127.0.0.1 - - [17/Aug/2017:02:48:31 +0000] "GET /api/atlas/v2/types/typedef/name/SbQzearl1R
HTTP/1.1" 404 - "-" "Java/1.7.0_80"
127.0.0.1 - - [17/Aug/2017:02:48:31 +0000] "POST /api/atlas/v2/types/typedefs/ HTTP/1.1" 200
- "-" "Java/1.7.0_80"
127.0.0.1 - - [17/Aug/2017:02:48:31 +0000] "POST /api/atlas/v2/entity/ HTTP/1.1" 200 - "-"
"Java/1.7.0_80"
127.0.0.1 - - [17/Aug/2017:02:48:31 +0000] "GET /api/atlas/v2/entity/guid/cf65023f-5a46-470b-ad31-15b90463cc59
HTTP/1.1" 200 - "-" "Java/1.7.0_80"
127.0.0.1 - - [17/Aug/2017:02:48:31 +0000] "GET /api/atlas/discovery/search/dsl?query=from+hive_db_v1+name%3D%22dbMhZRnsfj5W%22
HTTP/1.1" 200 - "-" "Java/1.7.0_80"
127.0.0.1 - - [17/Aug/2017:02:48:32 +0000] "GET /api/atlas/discovery/search/dsl?query=from+blah
HTTP/1.1" 400 - "-" "Java/1.7.0_80"
127.0.0.1 - - [17/Aug/2017:02:48:32 +0000] "GET /api/atlas/discovery/search?query=* HTTP/1.1"
200 - "-" "Java/1.7.0_80"
127.0.0.1 - - [17/Aug/2017:02:48:32 +0000] "GET /api/atlas/discovery/search?query=from+hive_db_v1+name%3D%22dbMhZRnsfj5W%22
HTTP/1.1" 200 - "-" "Java/1.7.0_80"
127.0.0.1 - - [17/Aug/2017:02:48:33 +0000] "GET /api/atlas/discovery/search/gremlin?query=g.V.has('type',+'hive_table_v1').toList()
HTTP/1.1" 200 - "-" "Java/1.7.0_80"
127.0.0.1 - - [17/Aug/2017:02:48:35 +0000] "POST /api/atlas/v2/types/typedefs/ HTTP/1.1" 200
- "-" "Java/1.7.0_80"
127.0.0.1 - - [17/Aug/2017:02:48:35 +0000] "POST /api/atlas/v2/types/typedefs/ HTTP/1.1" 409
- "-" "Java/1.7.0_80"
127.0.0.1 - - [17/Aug/2017:02:48:35 +0000] "GET /api/atlas/v2/types/enumdef/name/blah HTTP/1.1"
404 - "-" "Java/1.7.0_80"
127.0.0.1 - - [17/Aug/2017:02:48:35 +0000] "GET /api/atlas/v2/types/enumdef/guid/blah HTTP/1.1"
404 - "-" "Java/1.7.0_80"
127.0.0.1 - - [17/Aug/2017:02:48:35 +0000] "GET /api/atlas/v2/types/structdef/name/blah HTTP/1.1"
404 - "-" "Java/1.7.0_80"
127.0.0.1 - - [17/Aug/2017:02:48:35 +0000] "GET /api/atlas/v2/types/structdef/guid/blah HTTP/1.1"
404 - "-" "Java/1.7.0_80"
127.0.0.1 - - [17/Aug/2017:02:48:35 +0000] "GET /api/atlas/v2/types/classificationdef/name/blah
HTTP/1.1" 404 - "-" "Java/1.7.0_80"
127.0.0.1 - - [17/Aug/2017:02:48:35 +0000] "GET /api/atlas/v2/types/classificationdef/guid/blah
HTTP/1.1" 404 - "-" "Java/1.7.0_80"
127.0.0.1 - - [17/Aug/2017:02:48:35 +0000] "GET /api/atlas/v2/types/entitydef/name/blah HTTP/1.1"
404 - "-" "Java/1.7.0_80"
127.0.0.1 - - [17/Aug/2017:02:48:35 +0000] "GET /api/atlas/v2/types/entitydef/guid/blah HTTP/1.1"
404 - "-" "Java/1.7.0_80"
127.0.0.1 - - [17/Aug/2017:02:48:35 +0000] "POST /api/atlas/v2/types/typedefs/ HTTP/1.1" 200
- "-" "Java/1.7.0_80"
127.0.0.1 - - [17/Aug/2017:02:48:35 +0000] "GET /api/atlas/v2/types/typedefs/?supertype=AOKvEbRXq0n&type=CLASS
HTTP/1.1" 200 - "-" "Java/1.7.0_80"
127.0.0.1 - - [17/Aug/2017:02:48:35 +0000] "GET /api/atlas/v2/types/typedefs/?notsupertype=BswE8FkQnAZ&supertype=AOKvEbRXq0n&type=CLASS
HTTP/1.1" 200 - "-" "Java/1.7.0_80"
127.0.0.1 - - [17/Aug/2017:02:48:35 +0000] "POST /api/atlas/v2/types/typedefs/ HTTP/1.1" 200
- "-" "Java/1.7.0_80"
127.0.0.1 - - [17/Aug/2017:02:48:35 +0000] "PUT /api/atlas/v2/types/typedefs/ HTTP/1.1" 200
- "-" "Java/1.7.0_80"
127.0.0.1 - - [17/Aug/2017:02:48:35 +0000] "GET /api/atlas/v2/types/typedefs/?type=ENTITY
HTTP/1.1" 200 - "-" "Java/1.7.0_80"
127.0.0.1 - - [17/Aug/2017:02:48:35 +0000] "POST /api/atlas/types HTTP/1.1" 201 - "-" "Java/1.7.0_80"
127.0.0.1 - - [17/Aug/2017:02:48:36 +0000] "POST /api/atlas/types HTTP/1.1" 409 - "-" "Java/1.7.0_80"
127.0.0.1 - - [17/Aug/2017:02:48:36 +0000] "GET /api/atlas/types/blah HTTP/1.1" 404 - "-"
"Java/1.7.0_80"
127.0.0.1 - - [17/Aug/2017:02:48:36 +0000] "GET /api/atlas/v2/types/typedef/name/class_trait
HTTP/1.1" 404 - "-" "Java/1.7.0_80"
127.0.0.1 - - [17/Aug/2017:02:48:36 +0000] "POST /api/atlas/types HTTP/1.1" 201 - "-" "Java/1.7.0_80"
127.0.0.1 - - [17/Aug/2017:02:48:36 +0000] "GET /api/atlas/v2/types/typedef/name/secure_trait
HTTP/1.1" 404 - "-" "Java/1.7.0_80"
127.0.0.1 - - [17/Aug/2017:02:48:36 +0000] "POST /api/atlas/types HTTP/1.1" 201 - "-" "Java/1.7.0_80"
127.0.0.1 - - [17/Aug/2017:02:48:36 +0000] "GET /api/atlas/v2/types/typedef/name/pii_trait
HTTP/1.1" 404 - "-" "Java/1.7.0_80"
127.0.0.1 - - [17/Aug/2017:02:48:36 +0000] "POST /api/atlas/types HTTP/1.1" 201 - "-" "Java/1.7.0_80"
127.0.0.1 - - [17/Aug/2017:02:48:36 +0000] "GET /api/atlas/v2/types/typedef/name/ssn_trait
HTTP/1.1" 404 - "-" "Java/1.7.0_80"
127.0.0.1 - - [17/Aug/2017:02:48:36 +0000] "POST /api/atlas/types HTTP/1.1" 201 - "-" "Java/1.7.0_80"
127.0.0.1 - - [17/Aug/2017:02:48:36 +0000] "GET /api/atlas/v2/types/typedef/name/salary_trait
HTTP/1.1" 404 - "-" "Java/1.7.0_80"
127.0.0.1 - - [17/Aug/2017:02:48:36 +0000] "POST /api/atlas/types HTTP/1.1" 201 - "-" "Java/1.7.0_80"
127.0.0.1 - - [17/Aug/2017:02:48:36 +0000] "GET /api/atlas/v2/types/typedef/name/sox_trait
HTTP/1.1" 404 - "-" "Java/1.7.0_80"
127.0.0.1 - - [17/Aug/2017:02:48:36 +0000] "POST /api/atlas/types HTTP/1.1" 201 - "-" "Java/1.7.0_80"
127.0.0.1 - - [17/Aug/2017:02:48:36 +0000] "GET /api/atlas/types?type=TRAIT HTTP/1.1" 200
- "-" "Java/1.7.0_80"
127.0.0.1 - - [17/Aug/2017:02:48:36 +0000] "GET /api/atlas/v2/types/typedef/name/AR12GV4TgCh
HTTP/1.1" 404 - "-" "Java/1.7.0_80"
127.0.0.1 - - [17/Aug/2017:02:48:36 +0000] "POST /api/atlas/types HTTP/1.1" 201 - "-" "Java/1.7.0_80"
127.0.0.1 - - [17/Aug/2017:02:48:36 +0000] "GET /api/atlas/v2/types/typedef/name/A1sLIpAR0kP6
HTTP/1.1" 404 - "-" "Java/1.7.0_80"
127.0.0.1 - - [17/Aug/2017:02:48:36 +0000] "POST /api/atlas/types HTTP/1.1" 201 - "-" "Java/1.7.0_80"
127.0.0.1 - - [17/Aug/2017:02:48:37 +0000] "GET /api/atlas/v2/types/typedef/name/BUyTQ8hydPm
HTTP/1.1" 404 - "-" "Java/1.7.0_80"
127.0.0.1 - - [17/Aug/2017:02:48:37 +0000] "POST /api/atlas/types HTTP/1.1" 201 - "-" "Java/1.7.0_80"
127.0.0.1 - - [17/Aug/2017:02:48:37 +0000] "GET /api/atlas/v2/types/typedef/name/Cg35rFPF2zR
HTTP/1.1" 404 - "-" "Java/1.7.0_80"
127.0.0.1 - - [17/Aug/2017:02:48:37 +0000] "POST /api/atlas/types HTTP/1.1" 201 - "-" "Java/1.7.0_80"
127.0.0.1 - - [17/Aug/2017:02:48:37 +0000] "GET /api/atlas/types?type=CLASS&supertype=AR12GV4TgCh&notsupertype=BUyTQ8hydPm
HTTP/1.1" 200 - "-" "Java/1.7.0_80"
127.0.0.1 - - [17/Aug/2017:02:48:37 +0000] "POST /api/atlas/types HTTP/1.1" 201 - "-" "Java/1.7.0_80"
127.0.0.1 - - [17/Aug/2017:02:48:37 +0000] "PUT /api/atlas/types HTTP/1.1" 200 - "-" "Java/1.7.0_80"
127.0.0.1 - - [17/Aug/2017:02:48:37 +0000] "GET /api/atlas/types/ZNVN6jXwzr HTTP/1.1" 200
- "-" "Java/1.7.0_80"
Tests run: 133, Failures: 5, Errors: 0, Skipped: 5, Time elapsed: 256.468 sec <<<
FAILURE! - in TestSuite
runQuickStart(org.apache.atlas.examples.QuickStartV2IT)  Time elapsed: 0.588 sec  <<<
FAILURE!
org.apache.atlas.AtlasServiceException: Metadata service API org.apache.atlas.AtlasBaseClient$APIInfo@bfe3e31
failed with status 409 (Conflict) Response Body ({"errorCode":"ATLAS-409-00-001","errorMessage":"Given
type Dimension already exists"})
	at org.apache.atlas.examples.QuickStartV2IT.runQuickStart(QuickStartV2IT.java:49)

testDeleteByQualifiedName(org.apache.atlas.notification.NotificationHookConsumerIT)  Time
elapsed: 60.104 sec  <<< FAILURE!
java.lang.Exception: Waiting timed out after 60000 msec
	at org.apache.atlas.notification.NotificationHookConsumerIT.testDeleteByQualifiedName(NotificationHookConsumerIT.java:184)

testUpdateEntityPartial(org.apache.atlas.notification.NotificationHookConsumerIT)  Time elapsed:
60.114 sec  <<< FAILURE!
java.lang.Exception: Waiting timed out after 60000 msec
	at org.apache.atlas.notification.NotificationHookConsumerIT.testUpdateEntityPartial(NotificationHookConsumerIT.java:127)

testAddReferenceProperty(org.apache.atlas.web.integration.EntityJerseyResourceIT)  Time elapsed:
0.171 sec  <<< FAILURE!
java.lang.AssertionError: expected:<1> but was:<2>
	at org.apache.atlas.web.integration.EntityJerseyResourceIT.addProperty(EntityJerseyResourceIT.java:476)
	at org.apache.atlas.web.integration.EntityJerseyResourceIT.testAddReferenceProperty(EntityJerseyResourceIT.java:451)

testPartialUpdate(org.apache.atlas.web.integration.EntityJerseyResourceIT)  Time elapsed:
0.15 sec  <<< FAILURE!
java.lang.AssertionError: expected:<1> but was:<3>
	at org.apache.atlas.web.integration.EntityJerseyResourceIT.testPartialUpdate(EntityJerseyResourceIT.java:878)


Results :

Failed tests: 
  QuickStartV2IT.runQuickStart:49 » AtlasService Metadata service API org.apache...
  NotificationHookConsumerIT.testDeleteByQualifiedName:184->BaseResourceIT.waitFor:626
» 
  NotificationHookConsumerIT.testUpdateEntityPartial:127->BaseResourceIT.waitFor:626 »

  EntityJerseyResourceIT.testAddReferenceProperty:451->addProperty:476 expected:<1>
but was:<2>
  EntityJerseyResourceIT.testPartialUpdate:878 expected:<1> but was:<3>

Tests run: 133, Failures: 5, Errors: 0, Skipped: 5

[INFO] 
[INFO] --- jetty-maven-plugin:9.2.12.v20150709:stop (stop-jetty) @ atlas-webapp ---
[INFO] Waiting 10 seconds for jetty to stop
[INFO] Stopped ServerConnector@56523655{HTTP/1.1}{0.0.0.0:31000}
[INFO] Closing Spring root WebApplicationContext
[INFO] Shutting down log4j
[INFO] Stopped o.e.j.m.p.JettyWebAppContext@5fd00123{/,<https://builds.apache.org/job/Atlas-master-IntegrationTests/ws/webapp/target/atlas-webapp-0.9-SNAPSHOT/,UNAVAILABLE}{/home/jenkins/jenkins-slave/workspace/Atlas-master-IntegrationTests/webapp/target/atlas-webapp-0.9-SNAPSHOT.war}>
[INFO] Server reports itself as stopped
[INFO] 
[INFO] --- maven-source-plugin:2.4:jar-no-fork (attach-sources) @ atlas-webapp ---
[INFO] Building jar: <https://builds.apache.org/job/Atlas-master-IntegrationTests/ws/webapp/target/atlas-webapp-0.9-SNAPSHOT-sources.jar>
log4j:WARN No appenders could be found for logger (org.apache.zookeeper.ClientCnxn).
log4j:WARN Please initialize the log4j system properly.
log4j:WARN See http://logging.apache.org/log4j/1.2/faq.html#noconfig for more info.
[INFO] 
[INFO] --- maven-source-plugin:2.4:test-jar-no-fork (attach-sources) @ atlas-webapp ---
[INFO] Building jar: <https://builds.apache.org/job/Atlas-master-IntegrationTests/ws/webapp/target/atlas-webapp-0.9-SNAPSHOT-test-sources.jar>
[INFO] 
[INFO] --- maven-failsafe-plugin:2.19.1:verify (verify) @ atlas-webapp ---
[INFO] ------------------------------------------------------------------------
[INFO] Reactor Summary:
[INFO] 
[INFO] Apache Atlas Server Build Tools .................... SUCCESS [  0.807 s]
[INFO] apache-atlas ....................................... SUCCESS [  6.719 s]
[INFO] Apache Atlas Integration ........................... SUCCESS [ 29.661 s]
[INFO] Apache Atlas Common ................................ SUCCESS [ 16.104 s]
[INFO] Apache Atlas Typesystem ............................ SUCCESS [01:05 min]
[INFO] Apache Atlas Client ................................ SUCCESS [ 17.047 s]
[INFO] Apache Atlas Server API ............................ SUCCESS [ 10.511 s]
[INFO] Apache Atlas Notification .......................... SUCCESS [ 15.851 s]
[INFO] Apache Atlas Graph Database Projects ............... SUCCESS [  0.586 s]
[INFO] Apache Atlas Graph Database API .................... SUCCESS [  7.533 s]
[INFO] Graph Database Common Code ......................... SUCCESS [  7.804 s]
[INFO] Apache Atlas Titan 1.0.0 GraphDB Impl .............. SUCCESS [ 30.841 s]
[INFO] Shaded version of Apache hbase client .............. SUCCESS [  8.465 s]
[INFO] Apache Atlas Titan 0.5.4 Graph DB Impl ............. SUCCESS [ 43.352 s]
[INFO] Apache Atlas Graph Database Implementation Dependencies SUCCESS [  0.676 s]
[INFO] Shaded version of Apache hbase server .............. SUCCESS [ 23.111 s]
[INFO] Apache Atlas Repository ............................ SUCCESS [01:50 min]
[INFO] Apache Atlas Authorization ......................... SUCCESS [ 12.116 s]
[INFO] Apache Atlas Business Catalog ...................... SUCCESS [ 16.600 s]
[INFO] Apache Atlas UI .................................... SUCCESS [01:03 min]
[INFO] Apache Atlas Web Application ....................... FAILURE [06:15 min]
[INFO] Apache Atlas Documentation ......................... SKIPPED
[INFO] Apache Atlas FileSystem Model ...................... SKIPPED
[INFO] Apache Atlas Plugin Classloader .................... SKIPPED
[INFO] Apache Atlas Hive Bridge Shim ...................... SKIPPED
[INFO] Apache Atlas Hive Bridge ........................... SKIPPED
[INFO] Apache Atlas Falcon Bridge Shim .................... SKIPPED
[INFO] Apache Atlas Falcon Bridge ......................... SKIPPED
[INFO] Apache Atlas Sqoop Bridge Shim ..................... SKIPPED
[INFO] Apache Atlas Sqoop Bridge .......................... SKIPPED
[INFO] Apache Atlas Storm Bridge Shim ..................... SKIPPED
[INFO] Apache Atlas Storm Bridge .......................... SKIPPED
[INFO] Apache Atlas Distribution .......................... SKIPPED
[INFO] ------------------------------------------------------------------------
[INFO] BUILD FAILURE
[INFO] ------------------------------------------------------------------------
[INFO] Total time: 14:24 min
[INFO] Finished at: 2017-08-17T02:48:48Z
[INFO] Final Memory: 362M/2096M
[INFO] ------------------------------------------------------------------------
[ERROR] Failed to execute goal org.apache.maven.plugins:maven-failsafe-plugin:2.19.1:verify
(verify) on project atlas-webapp: There are test failures.
[ERROR] 
[ERROR] Please refer to <https://builds.apache.org/job/Atlas-master-IntegrationTests/ws/webapp/target/failsafe-reports>
for the individual test results.
[ERROR] -> [Help 1]
[ERROR] 
[ERROR] To see the full stack trace of the errors, re-run Maven with the -e switch.
[ERROR] Re-run Maven using the -X switch to enable full debug logging.
[ERROR] 
[ERROR] For more information about the errors and possible solutions, please read the following
articles:
[ERROR] [Help 1] http://cwiki.apache.org/confluence/display/MAVEN/MojoFailureException
[ERROR] 
[ERROR] After correcting the problems, you can resume the build with the command
[ERROR]   mvn <goals> -rf :atlas-webapp
Build step 'Execute shell' marked build as failure
[CHECKSTYLE] Collecting checkstyle analysis files...
[CHECKSTYLE] Searching for all files in <https://builds.apache.org/job/Atlas-master-IntegrationTests/ws/>
that match the pattern **/target/checkstyle-result.xml
[CHECKSTYLE] Parsing 19 files in <https://builds.apache.org/job/Atlas-master-IntegrationTests/ws/>
[CHECKSTYLE] Successfully parsed file <https://builds.apache.org/job/Atlas-master-IntegrationTests/ws/authorization/target/checkstyle-result.xml>
with 467 unique warnings and 0 duplicates.
[CHECKSTYLE] Successfully parsed file <https://builds.apache.org/job/Atlas-master-IntegrationTests/ws/catalog/target/checkstyle-result.xml>
with 2612 unique warnings and 0 duplicates.
[CHECKSTYLE] Successfully parsed file <https://builds.apache.org/job/Atlas-master-IntegrationTests/ws/client/target/checkstyle-result.xml>
with 4248 unique warnings and 0 duplicates.
[CHECKSTYLE] Successfully parsed file <https://builds.apache.org/job/Atlas-master-IntegrationTests/ws/common/target/checkstyle-result.xml>
with 5460 unique warnings and 0 duplicates.
[CHECKSTYLE] Successfully parsed file <https://builds.apache.org/job/Atlas-master-IntegrationTests/ws/dashboardv2/target/checkstyle-result.xml>
with 5460 unique warnings and 0 duplicates.
[CHECKSTYLE] Successfully parsed file <https://builds.apache.org/job/Atlas-master-IntegrationTests/ws/graphdb/api/target/checkstyle-result.xml>
with 5729 unique warnings and 0 duplicates.
[CHECKSTYLE] Successfully parsed file <https://builds.apache.org/job/Atlas-master-IntegrationTests/ws/graphdb/common/target/checkstyle-result.xml>
with 5916 unique warnings and 0 duplicates.
[CHECKSTYLE] Successfully parsed file <https://builds.apache.org/job/Atlas-master-IntegrationTests/ws/graphdb/graphdb-impls/target/checkstyle-result.xml>
with 5916 unique warnings and 0 duplicates.
[CHECKSTYLE] Successfully parsed file <https://builds.apache.org/job/Atlas-master-IntegrationTests/ws/graphdb/target/checkstyle-result.xml>
with 5916 unique warnings and 0 duplicates.
[CHECKSTYLE] Successfully parsed file <https://builds.apache.org/job/Atlas-master-IntegrationTests/ws/graphdb/titan0/target/checkstyle-result.xml>
with 8190 unique warnings and 0 duplicates.
[CHECKSTYLE] Successfully parsed file <https://builds.apache.org/job/Atlas-master-IntegrationTests/ws/graphdb/titan1/target/checkstyle-result.xml>
with 9138 unique warnings and 0 duplicates.
[CHECKSTYLE] Successfully parsed file <https://builds.apache.org/job/Atlas-master-IntegrationTests/ws/intg/target/checkstyle-result.xml>
with 16638 unique warnings and 0 duplicates.
[CHECKSTYLE] Successfully parsed file <https://builds.apache.org/job/Atlas-master-IntegrationTests/ws/notification/target/checkstyle-result.xml>
with 17848 unique warnings and 0 duplicates.
[CHECKSTYLE] Successfully parsed file <https://builds.apache.org/job/Atlas-master-IntegrationTests/ws/repository/target/checkstyle-result.xml>
with 37278 unique warnings and 0 duplicates.
[CHECKSTYLE] Successfully parsed file <https://builds.apache.org/job/Atlas-master-IntegrationTests/ws/server-api/target/checkstyle-result.xml>
with 37657 unique warnings and 0 duplicates.
[CHECKSTYLE] Successfully parsed file <https://builds.apache.org/job/Atlas-master-IntegrationTests/ws/shaded/hbase-client-shaded/target/checkstyle-result.xml>
with 37657 unique warnings and 0 duplicates.
[CHECKSTYLE] Successfully parsed file <https://builds.apache.org/job/Atlas-master-IntegrationTests/ws/shaded/hbase-server-shaded/target/checkstyle-result.xml>
with 37657 unique warnings and 0 duplicates.
[CHECKSTYLE] Successfully parsed file <https://builds.apache.org/job/Atlas-master-IntegrationTests/ws/target/checkstyle-result.xml>
with 37657 unique warnings and 0 duplicates.
[CHECKSTYLE] Successfully parsed file <https://builds.apache.org/job/Atlas-master-IntegrationTests/ws/typesystem/target/checkstyle-result.xml>
with 41875 unique warnings and 0 duplicates.
<Git Blamer> Using GitBlamer to create author and commit information for all warnings.
<Git Blamer> GIT_COMMIT=56374ff7e3a6faa3e444db1ba3fa14905f356dc9, workspace=<https://builds.apache.org/job/Atlas-master-IntegrationTests/ws/>
 > git rev-parse 56374ff7e3a6faa3e444db1ba3fa14905f356dc9^{commit} # timeout=10
[FINDBUGS] Collecting findbugs analysis files...
[FINDBUGS] Searching for all files in <https://builds.apache.org/job/Atlas-master-IntegrationTests/ws/>
that match the pattern **/target/findbugs.xml
[FINDBUGS] Parsing 12 files in <https://builds.apache.org/job/Atlas-master-IntegrationTests/ws/>
[FINDBUGS] Successfully parsed file <https://builds.apache.org/job/Atlas-master-IntegrationTests/ws/authorization/target/findbugs.xml>
with 0 unique warnings and 0 duplicates.
[FINDBUGS] Successfully parsed file <https://builds.apache.org/job/Atlas-master-IntegrationTests/ws/catalog/target/findbugs.xml>
with 0 unique warnings and 0 duplicates.
[FINDBUGS] Successfully parsed file <https://builds.apache.org/job/Atlas-master-IntegrationTests/ws/client/target/findbugs.xml>
with 0 unique warnings and 0 duplicates.
[FINDBUGS] Successfully parsed file <https://builds.apache.org/job/Atlas-master-IntegrationTests/ws/common/target/findbugs.xml>
with 0 unique warnings and 0 duplicates.
[FINDBUGS] Successfully parsed file <https://builds.apache.org/job/Atlas-master-IntegrationTests/ws/graphdb/api/target/findbugs.xml>
with 0 unique warnings and 0 duplicates.
[FINDBUGS] Successfully parsed file <https://builds.apache.org/job/Atlas-master-IntegrationTests/ws/graphdb/common/target/findbugs.xml>
with 0 unique warnings and 0 duplicates.
[FINDBUGS] Successfully parsed file <https://builds.apache.org/job/Atlas-master-IntegrationTests/ws/graphdb/titan0/target/findbugs.xml>
with 0 unique warnings and 0 duplicates.
[FINDBUGS] Successfully parsed file <https://builds.apache.org/job/Atlas-master-IntegrationTests/ws/intg/target/findbugs.xml>
with 0 unique warnings and 0 duplicates.
[FINDBUGS] Successfully parsed file <https://builds.apache.org/job/Atlas-master-IntegrationTests/ws/notification/target/findbugs.xml>
with 0 unique warnings and 0 duplicates.
[FINDBUGS] Successfully parsed file <https://builds.apache.org/job/Atlas-master-IntegrationTests/ws/repository/target/findbugs.xml>
with 0 unique warnings and 0 duplicates.
[FINDBUGS] Successfully parsed file <https://builds.apache.org/job/Atlas-master-IntegrationTests/ws/server-api/target/findbugs.xml>
with 0 unique warnings and 0 duplicates.
[FINDBUGS] Successfully parsed file <https://builds.apache.org/job/Atlas-master-IntegrationTests/ws/typesystem/target/findbugs.xml>
with 0 unique warnings and 0 duplicates.
<Git Blamer> Using GitBlamer to create author and commit information for all warnings.
<Git Blamer> GIT_COMMIT=56374ff7e3a6faa3e444db1ba3fa14905f356dc9, workspace=<https://builds.apache.org/job/Atlas-master-IntegrationTests/ws/>
Archiving artifacts
[Fast Archiver] No prior successful build to compare, so performing full copy of artifacts
TestNG Reports Processing: START
Looking for TestNG results report in workspace using pattern: **/target/surefire-reports/testng-results.xml,**/target/failsafe-reports/testng-results.xml
Saving reports...
Processing '/x1/jenkins/jenkins-home/jobs/Atlas-master-IntegrationTests/builds/14/testng/testng-results.xml'
3.030303% of tests failed, which exceeded threshold of 0%. Marking build as UNSTABLE
TestNG Reports Processing: FINISH

Mime
View raw message