atlas-dev mailing list archives

Site index · List index
Message view « Date » · « Thread »
Top « Date » · « Thread »
From "alanding (Jira)" <j...@apache.org>
Subject [jira] [Created] (ATLAS-4018) 编译失败
Date Tue, 10 Nov 2020 10:31:00 GMT
alanding created ATLAS-4018:
-------------------------------

             Summary: 编译失败
                 Key: ATLAS-4018
                 URL: https://issues.apache.org/jira/browse/ATLAS-4018
             Project: Atlas
          Issue Type: Improvement
         Environment: apache-maven-3.6.3
apache-atlas-sources-2.1.0
            Reporter: alanding


[ERROR] Unable to save binary /data01/atlas/apache-atlas-sources-2.1.0/dashboardv2/target/node_modules/node-sass/vendor/linux-x64-72
: Error: EACCES: permission denied, mkdir '/data01/atlas/apache-atlas-sources-2.1.0/dashboardv2/target/node_modules/node-sass/vendor'
[ERROR] at Object.mkdirSync (fs.js:840:3)
[ERROR] at sync (/data01/atlas/apache-atlas-sources-2.1.0/dashboardv2/target/node_modules/mkdirp/index.js:72:13)
[ERROR] at Function.sync (/data01/atlas/apache-atlas-sources-2.1.0/dashboardv2/target/node_modules/mkdirp/index.js:78:24)
[ERROR] at checkAndDownloadBinary (/data01/atlas/apache-atlas-sources-2.1.0/dashboardv2/target/node_modules/node-sass/scripts/install.js:114:11)
[ERROR] at Object.<anonymous> (/data01/atlas/apache-atlas-sources-2.1.0/dashboardv2/target/node_modules/node-sass/scripts/install.js:157:1)
[ERROR] at Module._compile (internal/modules/cjs/loader.js:1157:30)
[ERROR] at Object.Module._extensions..js (internal/modules/cjs/loader.js:1177:10)
[ERROR] at Module.load (internal/modules/cjs/loader.js:1001:32)
[ERROR] at Function.Module._load (internal/modules/cjs/loader.js:900:14)
[ERROR] at Function.executeUserEntryPoint [as runMain] (internal/modules/run_main.js:74:12)
{
[ERROR] errno: -13,
[ERROR] syscall: 'mkdir',
[ERROR] code: 'EACCES',
[ERROR] path: '/data01/atlas/apache-atlas-sources-2.1.0/dashboardv2/target/node_modules/node-sass/vendor'
[ERROR] }

 

 

 

[INFO] Apache Atlas UI 2.1.0 .............................. FAILURE [ 11.911 s]
[INFO] Apache Atlas New UI 2.1.0 .......................... SKIPPED
[INFO] Apache Atlas Web Application 2.1.0 ................. SKIPPED
[INFO] Apache Atlas Documentation 2.1.0 ................... SKIPPED
[INFO] Apache Atlas FileSystem Model 2.1.0 ................ SKIPPED
[INFO] Apache Atlas Plugin Classloader 2.1.0 .............. SKIPPED
[INFO] Apache Atlas Hive Bridge Shim 2.1.0 ................ SKIPPED
[INFO] Apache Atlas Hive Bridge 2.1.0 ..................... SKIPPED
[INFO] Apache Atlas Falcon Bridge Shim 2.1.0 .............. SKIPPED
[INFO] Apache Atlas Falcon Bridge 2.1.0 ................... SKIPPED
[INFO] Apache Atlas Sqoop Bridge Shim 2.1.0 ............... SKIPPED
[INFO] Apache Atlas Sqoop Bridge 2.1.0 .................... SKIPPED
[INFO] Apache Atlas Storm Bridge Shim 2.1.0 ............... SKIPPED
[INFO] Apache Atlas Storm Bridge 2.1.0 .................... SKIPPED
[INFO] Apache Atlas Hbase Bridge Shim 2.1.0 ............... SKIPPED
[INFO] Apache Atlas Hbase Bridge 2.1.0 .................... SKIPPED
[INFO] Apache HBase - Testing Util 2.1.0 .................. SKIPPED
[INFO] Apache Atlas Kafka Bridge 2.1.0 .................... SKIPPED
[INFO] Apache Atlas classification updater 2.1.0 .......... SKIPPED
[INFO] Apache Atlas Impala Hook API 2.1.0 ................. SKIPPED
[INFO] Apache Atlas Impala Bridge Shim 2.1.0 .............. SKIPPED
[INFO] Apache Atlas Impala Bridge 2.1.0 ................... SKIPPED
[INFO] Apache Atlas Distribution 2.1.0 .................... SKIPPED
[INFO] ------------------------------------------------------------------------
[INFO] BUILD FAILURE
[INFO] ------------------------------------------------------------------------
[INFO] Total time: 03:29 min
[INFO] Finished at: 2020-11-10T18:21:18+08:00
[INFO] ------------------------------------------------------------------------
[ERROR] Failed to execute goal com.github.eirslett:frontend-maven-plugin:1.4:npm (npm install)
on project atlas-dashboardv2: Failed to run task: 'npm install' failed. org.apache.commons.exec.ExecuteException:
Process exited with an error: 1 (Exit value: 1) -> [Help 1]
org.apache.maven.lifecycle.LifecycleExecutionException: Failed to execute goal com.github.eirslett:frontend-maven-plugin:1.4:npm
(npm install) on project atlas-dashboardv2: Failed to run task



--
This message was sent by Atlassian Jira
(v8.3.4#803005)

Mime
View raw message