axis-c-dev mailing list archives

Site index · List index
Message view « Date » · « Thread »
Top « Date » · « Thread »
From damitha kumarage <dami...@opensource.lk>
Subject [test-results]Axis C++ Autobuild and regression test
Date Thu, 16 Sep 2004 08:30:01 GMT
16/09/2004 14:06:19: Regression test on AxisBench.cpp: RUN FAILED
16/09/2004 14:06:31: Regression test on Calculator.cpp: RUN SUCCESS
16/09/2004 14:06:43: Regression test on ComplexTypeAll.cpp: RUN FAILED
16/09/2004 14:06:56: Regression test on Enumeration.cpp: RUN FAILED
16/09/2004 14:07:10: Regression test on ExceptionTest.cpp: RUN SUCCESS
16/09/2004 14:07:22: Regression test on ExtensibilityQuery.cpp: RUN FAILED
16/09/2004 14:07:36: Regression test on FaultMapping.cpp: RUN SUCCESS
16/09/2004 14:07:52: Regression test on InteropTestRound1.cpp: RUN SUCCESS
16/09/2004 14:08:01: Regression test on LargeReturningString.cpp: BUILD FAILED
16/09/2004 14:08:14: Regression test on ManyTypeRefRoot.cpp: RUN FAILED
16/09/2004 14:08:24: Regression test on MathOps.cpp: BUILD FAILED
16/09/2004 14:08:36: Regression test on RecurseTypes.cpp: BUILD FAILED
16/09/2004 14:08:44: Regression test on RpcHttpHeaderTest1.cpp: BUILD FAILED
16/09/2004 14:08:46: Regression test on RpcHttpHeaderTest2.cpp: BUILD FAILED
16/09/2004 14:08:58: Regression test on RpcHttpHeaderTest3.cpp: RUN SUCCESS
16/09/2004 14:09:11: Regression test on RpcHttpHeaderTest4.cpp: RUN SUCCESS
16/09/2004 14:09:24: Regression test on RpcHttpHeaderTest5.cpp: RUN SUCCESS
16/09/2004 14:09:37: Regression test on RpcHttpHeaderTest7.cpp: RUN SUCCESS
16/09/2004 14:09:50: Regression test on RpcHttpHeaderTest8.cpp: RUN SUCCESS
16/09/2004 14:10:03: Regression test on RpcSoapHeaderTest1.cpp: RUN SUCCESS
16/09/2004 14:10:16: Regression test on RpcSoapHeaderTest10.cpp: RUN SUCCESS
16/09/2004 14:10:19: Regression test on RpcSoapHeaderTest2.cpp: BUILD FAILED
16/09/2004 14:10:32: Regression test on RpcSoapHeaderTest3.cpp: RUN SUCCESS
16/09/2004 14:10:45: Regression test on RpcSoapHeaderTest4.cpp: RUN SUCCESS
16/09/2004 14:10:57: Regression test on RpcSoapHeaderTest6.cpp: RUN SUCCESS
16/09/2004 14:11:10: Regression test on RpcSoapHeaderTest8.cpp: RUN SUCCESS
16/09/2004 14:11:23: Regression test on RpcSoapHeaderTest9.cpp: BUILD FAILED
16/09/2004 14:11:35: Regression test on SimpleArray.cpp: RUN SUCCESS
16/09/2004 14:11:47: Regression test on SimpleRef.cpp: RUN SUCCESS
16/09/2004 14:12:00: Regression test on SimpleTypeArray.cpp: RUN FAILED
16/09/2004 14:12:13: Regression test on SimpleTypeInnerUnbounded.cpp: RUN FAILED
16/09/2004 14:12:26: Regression test on SimpleTypeInnerUnboundedInOutput.cpp: RUN FAILED
16/09/2004 14:13:16: Regression test on inquire_v2.cpp: BUILD FAILED
16/09/2004 14:13:26: Regression test on AxisBench.cpp: BUILD FAILED
16/09/2004 14:13:34: Regression test on Calculator.cpp: BUILD FAILED
16/09/2004 14:13:47: Regression test on ComplexTypeAll.cpp: RUN FAILED
16/09/2004 14:14:00: Regression test on Enumeration.cpp: RUN FAILED
16/09/2004 14:14:14: Regression test on ExceptionTest.cpp: RUN SUCCESS
16/09/2004 14:14:17: Regression test on ExtensibilityQuery.cpp: BUILD FAILED
16/09/2004 14:14:31: Regression test on FaultMapping.cpp: RUN SUCCESS
16/09/2004 14:14:47: Regression test on InteropTestRound1.cpp: RUN SUCCESS
16/09/2004 14:14:57: Regression test on LargeReturningString.cpp: BUILD FAILED
16/09/2004 14:15:10: Regression test on ManyTypeRefRoot.cpp: RUN FAILED
16/09/2004 14:15:23: Regression test on MathOps.cpp: RUN FAILED
16/09/2004 14:15:38: Regression test on RecurseTypes.cpp: RUN FAILED
16/09/2004 14:15:51: Regression test on RpcHttpHeaderTest1.cpp: RUN SUCCESS
16/09/2004 14:16:04: Regression test on RpcHttpHeaderTest2.cpp: RUN SUCCESS
16/09/2004 14:16:17: Regression test on RpcHttpHeaderTest3.cpp: RUN SUCCESS
16/09/2004 14:16:30: Regression test on RpcHttpHeaderTest4.cpp: RUN SUCCESS
16/09/2004 14:16:43: Regression test on RpcHttpHeaderTest5.cpp: RUN SUCCESS
16/09/2004 14:16:56: Regression test on RpcHttpHeaderTest7.cpp: RUN SUCCESS
16/09/2004 14:17:05: Regression test on RpcHttpHeaderTest8.cpp: BUILD FAILED
16/09/2004 14:17:18: Regression test on RpcSoapHeaderTest1.cpp: RUN SUCCESS
16/09/2004 14:17:31: Regression test on RpcSoapHeaderTest10.cpp: RUN SUCCESS
16/09/2004 14:17:44: Regression test on RpcSoapHeaderTest2.cpp: RUN SUCCESS
16/09/2004 14:17:53: Regression test on RpcSoapHeaderTest3.cpp: BUILD FAILED
16/09/2004 14:18:06: Regression test on RpcSoapHeaderTest4.cpp: RUN SUCCESS
16/09/2004 14:18:19: Regression test on RpcSoapHeaderTest6.cpp: RUN SUCCESS
16/09/2004 14:18:32: Regression test on RpcSoapHeaderTest8.cpp: RUN SUCCESS
16/09/2004 14:18:45: Regression test on RpcSoapHeaderTest9.cpp: RUN SUCCESS
16/09/2004 14:18:57: Regression test on SimpleArray.cpp: RUN SUCCESS
16/09/2004 14:19:05: Regression test on SimpleRef.cpp: BUILD FAILED
16/09/2004 14:19:15: Regression test on SimpleTypeArray.cpp: BUILD FAILED
16/09/2004 14:19:28: Regression test on SimpleTypeInnerUnbounded.cpp: RUN FAILED
16/09/2004 14:19:40: Regression test on SimpleTypeInnerUnboundedInOutput.cpp: RUN FAILED
16/09/2004 14:23:40: Regression test on inquire_v2.cpp: RUN FAILED

Mime
View raw message