axis-c-dev mailing list archives

Site index · List index
Message view « Date » · « Thread »
Top « Date » · « Thread »
From damitha kumarage <dami...@opensource.lk>
Subject [test-results]Axis C++ Autobuild and regression test
Date Mon, 20 Sep 2004 13:30:00 GMT
20/09/2004 19:06:07: Regression test on AxisBench.cpp: RUN FAILED
20/09/2004 19:06:17: Regression test on Calculator.cpp: BUILD FAILED
20/09/2004 19:06:29: Regression test on ComplexTypeAll.cpp: RUN FAILED
20/09/2004 19:06:43: Regression test on Enumeration.cpp: RUN FAILED
20/09/2004 19:06:56: Regression test on ExceptionTest.cpp: RUN SUCCESS
20/09/2004 19:07:08: Regression test on ExtensibilityQuery.cpp: RUN FAILED
20/09/2004 19:07:22: Regression test on FaultMapping.cpp: RUN SUCCESS
20/09/2004 19:07:38: Regression test on InteropTestRound1.cpp: RUN SUCCESS
20/09/2004 19:07:49: Regression test on LargeReturningString.cpp: BUILD FAILED
20/09/2004 19:08:02: Regression test on ManyTypeRefRoot.cpp: RUN FAILED
20/09/2004 19:08:14: Regression test on MathOps.cpp: RUN FAILED
20/09/2004 19:08:27: Regression test on RecurseTypes.cpp: RUN FAILED
20/09/2004 19:08:40: Regression test on RpcHttpHeaderTest1.cpp: RUN SUCCESS
20/09/2004 19:08:53: Regression test on RpcHttpHeaderTest2.cpp: RUN SUCCESS
20/09/2004 19:09:06: Regression test on RpcHttpHeaderTest3.cpp: RUN SUCCESS
20/09/2004 19:09:19: Regression test on RpcHttpHeaderTest4.cpp: RUN SUCCESS
20/09/2004 19:09:32: Regression test on RpcHttpHeaderTest5.cpp: RUN SUCCESS
20/09/2004 19:09:45: Regression test on RpcHttpHeaderTest7.cpp: RUN SUCCESS
20/09/2004 19:09:58: Regression test on RpcHttpHeaderTest8.cpp: RUN SUCCESS
20/09/2004 19:10:11: Regression test on RpcSoapHeaderTest1.cpp: RUN SUCCESS
20/09/2004 19:10:24: Regression test on RpcSoapHeaderTest10.cpp: RUN SUCCESS
20/09/2004 19:10:37: Regression test on RpcSoapHeaderTest2.cpp: RUN SUCCESS
20/09/2004 19:10:50: Regression test on RpcSoapHeaderTest3.cpp: RUN SUCCESS
20/09/2004 19:11:03: Regression test on RpcSoapHeaderTest4.cpp: RUN SUCCESS
20/09/2004 19:11:16: Regression test on RpcSoapHeaderTest6.cpp: RUN SUCCESS
20/09/2004 19:11:29: Regression test on RpcSoapHeaderTest8.cpp: RUN SUCCESS
20/09/2004 19:11:42: Regression test on RpcSoapHeaderTest9.cpp: RUN SUCCESS
20/09/2004 19:11:54: Regression test on SimpleArray.cpp: RUN SUCCESS
20/09/2004 19:12:06: Regression test on SimpleRef.cpp: RUN SUCCESS
20/09/2004 19:12:19: Regression test on SimpleTypeArray.cpp: RUN FAILED
20/09/2004 19:12:32: Regression test on SimpleTypeInnerUnbounded.cpp: RUN FAILED
20/09/2004 19:12:45: Regression test on SimpleTypeInnerUnboundedInOutput.cpp: RUN FAILED
20/09/2004 19:13:39: Regression test on inquire_v2.cpp: RUN FAILED
20/09/2004 19:13:54: Regression test on AxisBench.cpp: RUN FAILED
20/09/2004 19:14:06: Regression test on Calculator.cpp: RUN FAILED
20/09/2004 19:14:19: Regression test on ComplexTypeAll.cpp: RUN FAILED
20/09/2004 19:14:32: Regression test on Enumeration.cpp: RUN FAILED
20/09/2004 19:14:46: Regression test on ExceptionTest.cpp: RUN SUCCESS
20/09/2004 19:14:58: Regression test on ExtensibilityQuery.cpp: RUN FAILED
20/09/2004 19:15:12: Regression test on FaultMapping.cpp: RUN SUCCESS
20/09/2004 19:15:28: Regression test on InteropTestRound1.cpp: RUN SUCCESS
20/09/2004 19:15:43: Regression test on LargeReturningString.cpp: BUILD FAILED
20/09/2004 19:15:55: Regression test on ManyTypeRefRoot.cpp: RUN FAILED
20/09/2004 19:16:07: Regression test on MathOps.cpp: RUN FAILED
20/09/2004 19:16:20: Regression test on RecurseTypes.cpp: RUN FAILED
20/09/2004 19:16:33: Regression test on RpcHttpHeaderTest1.cpp: RUN SUCCESS
20/09/2004 19:16:46: Regression test on RpcHttpHeaderTest2.cpp: RUN SUCCESS
20/09/2004 19:16:59: Regression test on RpcHttpHeaderTest3.cpp: RUN SUCCESS
20/09/2004 19:17:12: Regression test on RpcHttpHeaderTest4.cpp: RUN SUCCESS
20/09/2004 19:17:25: Regression test on RpcHttpHeaderTest5.cpp: RUN SUCCESS
20/09/2004 19:17:38: Regression test on RpcHttpHeaderTest7.cpp: RUN SUCCESS
20/09/2004 19:17:51: Regression test on RpcHttpHeaderTest8.cpp: RUN SUCCESS
20/09/2004 19:18:04: Regression test on RpcSoapHeaderTest1.cpp: RUN SUCCESS
20/09/2004 19:18:17: Regression test on RpcSoapHeaderTest10.cpp: RUN SUCCESS
20/09/2004 19:18:30: Regression test on RpcSoapHeaderTest2.cpp: RUN SUCCESS
20/09/2004 19:18:42: Regression test on RpcSoapHeaderTest3.cpp: RUN SUCCESS
20/09/2004 19:18:55: Regression test on RpcSoapHeaderTest4.cpp: RUN SUCCESS
20/09/2004 19:19:08: Regression test on RpcSoapHeaderTest6.cpp: RUN SUCCESS
20/09/2004 19:19:21: Regression test on RpcSoapHeaderTest8.cpp: RUN SUCCESS
20/09/2004 19:19:34: Regression test on RpcSoapHeaderTest9.cpp: RUN SUCCESS
20/09/2004 19:19:46: Regression test on SimpleArray.cpp: RUN SUCCESS
20/09/2004 19:19:58: Regression test on SimpleRef.cpp: RUN SUCCESS
20/09/2004 19:20:11: Regression test on SimpleTypeArray.cpp: RUN FAILED
20/09/2004 19:20:25: Regression test on SimpleTypeInnerUnbounded.cpp: RUN FAILED
20/09/2004 19:20:37: Regression test on SimpleTypeInnerUnboundedInOutput.cpp: RUN FAILED
20/09/2004 19:24:37: Regression test on inquire_v2.cpp: RUN FAILED

Mime
View raw message