axis-java-dev mailing list archives

Site index · List index
Message view « Date » · « Thread »
Top « Date » · « Thread »
From Sam Ruby <ru...@us.ibm.com>
Subject [GUMP] Build timed out - Axis
Date Sun, 16 Mar 2003 10:25:18 GMT
----------------------------------------------------
This email is autogenerated from the output from:
<http://cvs.apache.org/builds/gump/2003-03-16/xml-axis.html>
----------------------------------------------------

Build results exceed maximum length.
Please see URL above for details.
Last 50 lines of build output follows.

    [junit] Tests run: 1, Failures: 0, Errors: 0, Time elapsed: 4.45 sec
    [junit] Running test.wsdl.multibinding.MbServiceTestCase
    [junit] Tests run: 6, Failures: 0, Errors: 0, Time elapsed: 2.841 sec
    [junit] Running test.wsdl.multibinding.VerifyFilesTestCase
    [junit] Tests run: 1, Failures: 0, Errors: 0, Time elapsed: 0.56 sec
    [junit] Running test.wsdl.multiref.MultiRefTestCase
    [junit] Tests run: 1, Failures: 0, Errors: 0, Time elapsed: 3.737 sec
    [junit] Running test.wsdl.multithread.MultithreadTestCase
    [junit] - Throwable caught: 
    [junit] AxisFault
    [junit]  faultCode: {http://schemas.xmlsoap.org/soap/envelope/}Server.userException
    [junit]  faultSubcode: 
    [junit]  faultString: org.xml.sax.SAXParseException: The value following &quot;version&quot;
in the XML declaration must be a quoted string.
    [junit]  faultActor: 
    [junit]  faultNode: 
    [junit]  faultDetail: 
    [junit] 	{http://xml.apache.org/axis/}stackTrace: org.xml.sax.SAXParseException: The value
following &quot;version&quot; in the XML declaration must be a quoted string.
    [junit] 	at org.apache.xerces.parsers.AbstractSAXParser.parse(Unknown Source)
    [junit] 	at javax.xml.parsers.SAXParser.parse(SAXParser.java:345)
    [junit] 	at org.apache.axis.encoding.DeserializationContextImpl.parse(DeserializationContextImpl.java:242)
    [junit] 	at org.apache.axis.SOAPPart.getAsSOAPEnvelope(SOAPPart.java:538)
    [junit] 	at org.apache.axis.Message.getSOAPEnvelope(Message.java:377)
    [junit] 	at org.apache.axis.client.Call.invokeEngine(Call.java:2545)
    [junit] 	at org.apache.axis.client.Call.invoke(Call.java:2515)
    [junit] 	at org.apache.axis.client.Call.invoke(Call.java:2210)
    [junit] 	at org.apache.axis.client.Call.invoke(Call.java:2133)
    [junit] 	at org.apache.axis.client.Call.invoke(Call.java:1656)
    [junit] 	at samples.addr.AddressBookSOAPBindingStub.addEntry(AddressBookSOAPBindingStub.java:159)
    [junit] 	at test.wsdl.multithread.MultithreadTestCase$Run.run(MultithreadTestCase.java:87)
    [junit] 	at java.lang.Thread.run(Thread.java:536)


    [junit] org.xml.sax.SAXParseException: The value following "version" in the XML declaration
must be a quoted string.
    [junit] 	at org.apache.axis.AxisFault.makeFault(AxisFault.java:129)
    [junit] 	at org.apache.axis.SOAPPart.getAsSOAPEnvelope(SOAPPart.java:543)
    [junit] 	at org.apache.axis.Message.getSOAPEnvelope(Message.java:377)
    [junit] 	at org.apache.axis.client.Call.invokeEngine(Call.java:2545)
    [junit] 	at org.apache.axis.client.Call.invoke(Call.java:2515)
    [junit] 	at org.apache.axis.client.Call.invoke(Call.java:2210)
    [junit] 	at org.apache.axis.client.Call.invoke(Call.java:2133)
    [junit] 	at org.apache.axis.client.Call.invoke(Call.java:1656)
    [junit] 	at samples.addr.AddressBookSOAPBindingStub.addEntry(AddressBookSOAPBindingStub.java:159)
    [junit] 	at test.wsdl.multithread.MultithreadTestCase$Run.run(MultithreadTestCase.java:87)
    [junit] 	at java.lang.Thread.run(Thread.java:536)
    [junit] Caused by: org.xml.sax.SAXParseException: The value following "version" in the
XML declaration must be a quoted string.
    [junit] 	at org.apache.xerces.parsers.AbstractSAXParser.parse(Unknown Source)
    [junit] 	at javax.xml.parsers.SAXParser.parse(SAXParser.java:345)
    [junit] 	at org.apache.axis.encoding.DeserializationContextImpl.parse(DeserializationContextImpl.java:242)
    [junit] 	at org.apache.axis.SOAPPart.getAsSOAPEnvelope(SOAPPart.java:538)
    [junit] 	... 9 more
/home/rubys/bin/timeout: timed out

Mime
View raw message