axis-java-dev mailing list archives

Site index · List index
Message view « Date » · « Thread »
Top « Date » · « Thread »
From "Wayne Adams" <wa...@azuresolutions.com>
Subject Cannot build -- sync to head today (9 January)
Date Mon, 09 Jan 2006 23:22:35 GMT
I'm still trying to get my first Axis2 build to succeed.  I'm

using Maven 1.1-beta-2.  My first failure occurs when Maven

can't download bcprov-jdk13-128.jar and opensaml-1.0.1.jar.

After installing those manually in the repository and doing a

clean, attempting to build results in

 

...

    [junit] - Invalid service  PingPort.aar due to Two services can not
have same name, a service with PingPort already exists in the system

    [junit] [ERROR] Test org.apache.axis2.security.Scenario2aTest FAILED

    [junit] Running org.apache.axis2.security.Scenario3Test

    [junit] Tests run: 2, Failures: 2, Errors: 0, Time elapsed: 10.578
sec

    [junit] [ERROR] Test org.apache.axis2.security.Scenario3Test FAILED

    [junit] Running org.apache.axis2.security.Scenario4Test

    [junit] Tests run: 2, Failures: 2, Errors: 0, Time elapsed: 11.515
sec

    [junit] - Invalid service  PingPort.aar due to Two services can not
have same name, a service with PingPort already exists in the system

    [junit] [ERROR] Test org.apache.axis2.security.Scenario4Test FAILED

...

BUILD FAILED

File...... C:\Documents and
Settings\wayne.adams.X\.maven\cache\maven-multiproject-plugin-1.4.1\plug
in.jelly

Element... maven:reactor

Line...... 218

Column.... 9

Unable to obtain goal [multiproject:install-callback] -- C:\Documents
and
Settings\wayne.adams.X\.maven\cache\maven-test-plugin-1.7\plugin.jelly:1
83:54: <fail> There were test failures.

 

I had the same experience with 1.0.2, also.  TIA for

any help.

 

Wayne

 


Mime
View raw message