axis-java-dev mailing list archives

Site index · List index
Message view « Date » · « Thread »
Top « Date » · « Thread »
From Apache Hudson Server <hud...@hudson.apache.org>
Subject Build failed in Hudson: Axis2 #623
Date Tue, 01 Feb 2011 07:06:36 GMT
See <https://hudson.apache.org/hudson/job/Axis2/623/changes>

Changes:

[ruwan] Committing the fix for AXIS2-4914, patch from Pradeep

------------------------------------------
[...truncated 12684 lines...]
[INFO] Installing <https://hudson.apache.org/hudson/job/Axis2/ws/axis2/modules/webapp/target/axis2-SNAPSHOT-sources.jar>
to <https://hudson.apache.org/hudson/job/Axis2/ws/.repository/org/apache/axis2/axis2-webapp/SNAPSHOT/axis2-webapp-SNAPSHOT-sources.jar>
[INFO] Installing <https://hudson.apache.org/hudson/job/Axis2/ws/axis2/modules/webapp/target/axis2-SNAPSHOT-javadoc.jar>
to <https://hudson.apache.org/hudson/job/Axis2/ws/.repository/org/apache/axis2/axis2-webapp/SNAPSHOT/axis2-webapp-SNAPSHOT-javadoc.jar>
[INFO] Downloading: https://repository.apache.org/content/repositories/snapshots/org/apache/axis2/axis2-webapp/SNAPSHOT/maven-metadata.xml

[INFO] --- maven-deploy-plugin:2.5:deploy (default-deploy) @ axis2-webapp ---
Downloaded: https://repository.apache.org/content/repositories/snapshots/org/apache/axis2/axis2-webapp/SNAPSHOT/maven-metadata.xml
(2 KB at 3.0 KB/sec)
Uploading: https://repository.apache.org/content/repositories/snapshots/org/apache/axis2/axis2-webapp/SNAPSHOT/axis2-webapp-20110201.065413-41.war
Uploaded: https://repository.apache.org/content/repositories/snapshots/org/apache/axis2/axis2-webapp/SNAPSHOT/axis2-webapp-20110201.065413-41.war
(18060 KB at 932.5 KB/sec)
Uploading: https://repository.apache.org/content/repositories/snapshots/org/apache/axis2/axis2-webapp/SNAPSHOT/axis2-webapp-20110201.065413-41.pom
Uploaded: https://repository.apache.org/content/repositories/snapshots/org/apache/axis2/axis2-webapp/SNAPSHOT/axis2-webapp-20110201.065413-41.pom
(16 KB at 35.5 KB/sec)
Downloading: https://repository.apache.org/content/repositories/snapshots/org/apache/axis2/axis2-webapp/maven-metadata.xml
Downloaded: https://repository.apache.org/content/repositories/snapshots/org/apache/axis2/axis2-webapp/maven-metadata.xml
(474 B at 5.2 KB/sec)
Uploading: https://repository.apache.org/content/repositories/snapshots/org/apache/axis2/axis2-webapp/SNAPSHOT/maven-metadata.xml
Uploaded: https://repository.apache.org/content/repositories/snapshots/org/apache/axis2/axis2-webapp/SNAPSHOT/maven-metadata.xml
(2 KB at 7.4 KB/sec)
Uploading: https://repository.apache.org/content/repositories/snapshots/org/apache/axis2/axis2-webapp/maven-metadata.xml
Uploaded: https://repository.apache.org/content/repositories/snapshots/org/apache/axis2/axis2-webapp/maven-metadata.xml
(474 B at 3.5 KB/sec)
Uploading: https://repository.apache.org/content/repositories/snapshots/org/apache/axis2/axis2-webapp/SNAPSHOT/axis2-webapp-20110201.065413-41-sources.jar
Uploaded: https://repository.apache.org/content/repositories/snapshots/org/apache/axis2/axis2-webapp/SNAPSHOT/axis2-webapp-20110201.065413-41-sources.jar
(14 KB at 29.4 KB/sec)
Uploading: https://repository.apache.org/content/repositories/snapshots/org/apache/axis2/axis2-webapp/SNAPSHOT/maven-metadata.xml
Uploaded: https://repository.apache.org/content/repositories/snapshots/org/apache/axis2/axis2-webapp/SNAPSHOT/maven-metadata.xml
(2 KB at 6.1 KB/sec)
Uploading: https://repository.apache.org/content/repositories/snapshots/org/apache/axis2/axis2-webapp/SNAPSHOT/axis2-webapp-20110201.065413-41-javadoc.jar
Uploaded: https://repository.apache.org/content/repositories/snapshots/org/apache/axis2/axis2-webapp/SNAPSHOT/axis2-webapp-20110201.065413-41-javadoc.jar
(50 KB at 125.6 KB/sec)
Uploading: https://repository.apache.org/content/repositories/snapshots/org/apache/axis2/axis2-webapp/SNAPSHOT/maven-metadata.xml
Uploaded: https://repository.apache.org/content/repositories/snapshots/org/apache/axis2/axis2-webapp/SNAPSHOT/maven-metadata.xml
(2 KB at 8.7 KB/sec)
projectSucceeded org.apache.axis2:axis2-webapp:SNAPSHOT
[HUDSON] Archiving <https://hudson.apache.org/hudson/job/Axis2/ws/axis2/modules/webapp/pom.xml>
to /home/hudson/hudson/jobs/Axis2/modules/org.apache.axis2$axis2-webapp/builds/2011-02-01_06-01-41/archive/org.apache.axis2/axis2-webapp/SNAPSHOT/pom.xml
[HUDSON] Archiving <https://hudson.apache.org/hudson/job/Axis2/ws/axis2/modules/webapp/target/axis2.war>
to /home/hudson/hudson/jobs/Axis2/modules/org.apache.axis2$axis2-webapp/builds/2011-02-01_06-01-41/archive/org.apache.axis2/axis2-webapp/20110201.065413-41/axis2.war
[HUDSON] Archiving <https://hudson.apache.org/hudson/job/Axis2/ws/axis2/modules/webapp/target/axis2-SNAPSHOT-sources.jar>
to /home/hudson/hudson/jobs/Axis2/modules/org.apache.axis2$axis2-webapp/builds/2011-02-01_06-01-41/archive/org.apache.axis2/axis2-webapp/20110201.065413-41/axis2-SNAPSHOT-sources.jar
[HUDSON] Archiving <https://hudson.apache.org/hudson/job/Axis2/ws/axis2/modules/webapp/target/axis2-SNAPSHOT-javadoc.jar>
to /home/hudson/hudson/jobs/Axis2/modules/org.apache.axis2$axis2-webapp/builds/2011-02-01_06-01-41/archive/org.apache.axis2/axis2-webapp/20110201.065413-41/axis2-SNAPSHOT-javadoc.jar
[INFO]                                                                         
[INFO] ------------------------------------------------------------------------
[INFO] Building Apache Axis2 - Distribution SNAPSHOT
[INFO] ------------------------------------------------------------------------
[INFO] Deleting directory <https://hudson.apache.org/hudson/job/Axis2/ws/axis2/modules/distribution/target>
[INFO] 
[INFO] --- maven-clean-plugin:2.2:clean (default-clean) @ distribution ---
[INFO] 
[INFO] --- maven-remote-resources-plugin:1.1:process (default) @ distribution ---
[INFO] 
[INFO] --- gmaven-plugin:1.2:execute (generate-timestamp) @ distribution ---
[INFO] Adding mex-SNAPSHOT.mar
[INFO] [INFO] Adding mtompolicy-SNAPSHOT.mar
[INFO] Adding soapmonitor-SNAPSHOT.mar
[INFO] Adding version.aar
[INFO] Adding ping-SNAPSHOT.mar
[INFO] Adding scripting-SNAPSHOT.mar
[INFO] Adding addressing-SNAPSHOT.mar
[INFO] Writing services.list
[INFO] Writing modules.list

[INFO] --- axis2-repo-maven-plugin:SNAPSHOT:create-repository (default) @ distribution ---
[INFO] [INFO] Skipping the assembly in this project because it's not the Execution Root

[INFO] --- maven-assembly-plugin:2.2-beta-5:single (source-release-assembly) @ distribution
---
[INFO] [INFO] Reading assembly descriptor: src/main/assembly/war-assembly.xml
[INFO] Reading assembly descriptor: src/main/assembly/src-assembly.xml
[INFO] Reading assembly descriptor: src/main/assembly/bin-assembly.xml

[INFO] --- maven-assembly-plugin:2.2-beta-5:single (distribution-package) @ distribution ---
[INFO] Building zip: <https://hudson.apache.org/hudson/job/Axis2/ws/axis2/modules/distribution/target/axis2-SNAPSHOT-war.zip>
[INFO] Building zip: <https://hudson.apache.org/hudson/job/Axis2/ws/axis2/modules/distribution/target/axis2-SNAPSHOT-src.zip>
[INFO] Building zip: <https://hudson.apache.org/hudson/job/Axis2/ws/axis2/modules/distribution/target/axis2-SNAPSHOT-bin.zip>
mojo forkStarted org.apache.maven.plugins:maven-source-plugin:2.0.4(attach-sources)
mojo forkSucceeded org.apache.maven.plugins:maven-source-plugin:2.0.4(attach-sources)
ignoring exception during new ExecutedMojo null
[INFO] 
[INFO] --- maven-source-plugin:2.0.4:jar (attach-sources) @ distribution ---
[INFO] [INFO] Not executing Javadoc as the project is not a Java classpath-capable package

[INFO] --- maven-javadoc-plugin:2.5:jar (attach-javadocs) @ distribution ---
[INFO] 
[INFO] --- maven-gpg-plugin:1.1:sign (default) @ distribution ---
[INFO] [INFO] Installing <https://hudson.apache.org/hudson/job/Axis2/ws/axis2/modules/distribution/pom.xml>
to <https://hudson.apache.org/hudson/job/Axis2/ws/.repository/org/apache/axis2/distribution/SNAPSHOT/distribution-SNAPSHOT.pom>
[INFO] Installing <https://hudson.apache.org/hudson/job/Axis2/ws/axis2/modules/distribution/target/axis2-SNAPSHOT-war.zip>
to <https://hudson.apache.org/hudson/job/Axis2/ws/.repository/org/apache/axis2/distribution/SNAPSHOT/distribution-SNAPSHOT-war.zip>

[INFO] --- maven-install-plugin:2.2:install (default-install) @ distribution ---
[INFO] Creating Checksums...
[INFO] Installing <https://hudson.apache.org/hudson/job/Axis2/ws/axis2/modules/distribution/target/axis2-SNAPSHOT-src.zip>
to <https://hudson.apache.org/hudson/job/Axis2/ws/.repository/org/apache/axis2/distribution/SNAPSHOT/distribution-SNAPSHOT-src.zip>
[INFO] Creating Checksums...
[INFO] Installing <https://hudson.apache.org/hudson/job/Axis2/ws/axis2/modules/distribution/target/axis2-SNAPSHOT-bin.zip>
to <https://hudson.apache.org/hudson/job/Axis2/ws/.repository/org/apache/axis2/distribution/SNAPSHOT/distribution-SNAPSHOT-bin.zip>
[INFO] Creating Checksums...
[INFO] Skipping artifact deployment
[INFO] 
[INFO] --- maven-deploy-plugin:2.5:deploy (default-deploy) @ distribution ---
projectSucceeded org.apache.axis2:distribution:SNAPSHOT
[HUDSON] Archiving <https://hudson.apache.org/hudson/job/Axis2/ws/axis2/modules/distribution/pom.xml>
to /home/hudson/hudson/jobs/Axis2/modules/org.apache.axis2$distribution/builds/2011-02-01_06-01-41/archive/org.apache.axis2/distribution/SNAPSHOT/pom.xml
[HUDSON] Archiving <https://hudson.apache.org/hudson/job/Axis2/ws/axis2/modules/distribution/target/axis2-SNAPSHOT-war.zip>
to /home/hudson/hudson/jobs/Axis2/modules/org.apache.axis2$distribution/builds/2011-02-01_06-01-41/archive/org.apache.axis2/distribution/SNAPSHOT/axis2-SNAPSHOT-war.zip
[HUDSON] Archiving <https://hudson.apache.org/hudson/job/Axis2/ws/axis2/modules/distribution/target/axis2-SNAPSHOT-src.zip>
to /home/hudson/hudson/jobs/Axis2/modules/org.apache.axis2$distribution/builds/2011-02-01_06-01-41/archive/org.apache.axis2/distribution/SNAPSHOT/axis2-SNAPSHOT-src.zip
[HUDSON] Archiving <https://hudson.apache.org/hudson/job/Axis2/ws/axis2/modules/distribution/target/axis2-SNAPSHOT-bin.zip>
to /home/hudson/hudson/jobs/Axis2/modules/org.apache.axis2$distribution/builds/2011-02-01_06-01-41/archive/org.apache.axis2/distribution/SNAPSHOT/axis2-SNAPSHOT-bin.zip
[INFO]                                                                         
[INFO] ------------------------------------------------------------------------
[INFO] Building Apache Axis2 - Root SNAPSHOT
[INFO] ------------------------------------------------------------------------
[INFO] [INFO] Deleting file set: <https://hudson.apache.org/hudson/job/Axis2/ws/axis2/target>
(included: [**], excluded: [])

[INFO] --- maven-clean-plugin:2.3:clean (default-clean) @ axis2 ---
[INFO] 
[INFO] --- maven-enforcer-plugin:1.0-beta-1:enforce (default) @ axis2 ---
[INFO] 
[INFO] --- maven-remote-resources-plugin:1.1:process (default) @ axis2 ---
[INFO] Setting property: classpath.resource.loader.class => 'org.codehaus.plexus.velocity.ContextClassLoaderResourceLoader'.
[INFO] Setting property: velocimacro.messages.on => 'false'.
[INFO] Setting property: resource.loader => 'classpath'.
[INFO] Setting property: resource.manager.logwhenfound => 'false'.
[INFO] 
[INFO] --- maven-site-plugin:2.1.1:site (default) @ axis2 ---
[INFO] Parent project loaded from repository.
[INFO] Parent project loaded from repository.
[WARNING] [XHTML Sink] No HTML tag found for unknown event: 'A', ignoring!
[HUDSON] Archiving site from <https://hudson.apache.org/hudson/job/Axis2/ws/axis2/target/site>
to /home/hudson/hudson/jobs/Axis2/site
[INFO] 
[INFO] --- gmaven-plugin:1.2:execute (generate-timestamp) @ axis2 ---
mojo forkStarted org.apache.maven.plugins:maven-javadoc-plugin:2.7(distribution-javadoc)
forkedProjectStarted org.apache.axis2:axis2SNAPSHOT
[INFO]                                                                         
[INFO] >>>>>>>>>>>>>>>>>>>>>>>>>>>>>>>>>>>>>>>>>>>>>>>>>>>>>>>>>>>>>>>>>>>>>>>>
[INFO] Forking Apache Axis2 - Root SNAPSHOT
[INFO] >>>>>>>>>>>>>>>>>>>>>>>>>>>>>>>>>>>>>>>>>>>>>>>>>>>>>>>>>>>>>>>>>>>>>>>>
[INFO] 
[INFO] --- maven-enforcer-plugin:1.0-beta-1:enforce (default) @ axis2 ---
forkedProjectSucceeded org.apache.axis2:axis2SNAPSHOT
[HUDSON] Archiving <https://hudson.apache.org/hudson/job/Axis2/ws/axis2/pom.xml> to
/home/hudson/hudson/jobs/Axis2/modules/org.apache.axis2$axis2/builds/2011-02-01_06-01-41/archive/org.apache.axis2/axis2/SNAPSHOT/pom.xml
mojo forkSucceeded org.apache.maven.plugins:maven-javadoc-plugin:2.7(distribution-javadoc)
ignoring exception during new ExecutedMojo null
[HUDSON] Archiving aggregated javadoc
projectFailed org.apache.axis2:axis2:SNAPSHOT
sessionEnded
[INFO] ------------------------------------------------------------------------
[INFO] Reactor Summary:
[INFO] 
[INFO] Apache Axis2 - Parent ............................. SUCCESS [13.494s]
[INFO] Apache Axis2 - Resource bundle .................... SUCCESS [5.900s]
[INFO] Apache Axis2 - Kernel ............................. SUCCESS [50.746s]
[INFO] Apache Axis2 - Data Binding ....................... SUCCESS [23.535s]
[INFO] Apache Axis2 - Transport - Local .................. SUCCESS [8.503s]
[INFO] Apache Axis2 - Transport - HTTP ................... SUCCESS [10.590s]
[INFO] Apache Axis2 - Code Generation .................... SUCCESS [18.942s]
[INFO] Apache Axis2 - ADB Codegen ........................ SUCCESS [35.715s]
[INFO] Apache Axis2 - Addressing ......................... SUCCESS [11.445s]
[INFO] Apache Axis2 - Java2WSDL .......................... SUCCESS [16.185s]
[INFO] Apache Axis2 - tool - Repository Maven Plugin ..... SUCCESS [9.371s]
[INFO] Apache Axis2 - Fast Infoset ....................... SUCCESS [19.191s]
[INFO] Apache Axis2 - Clustering ......................... SUCCESS [1:17.109s]
[INFO] Apache Axis2 - Scripting .......................... SUCCESS [11.069s]
[INFO] Apache Axis2 - JAXB-RI Data Binding ............... SUCCESS [17.331s]
[INFO] Apache Axis2 - SAAJ ............................... SUCCESS [27.348s]
[INFO] Apache Axis2 - Metadata ........................... SUCCESS [27.064s]
[INFO] Apache Axis2 - JAXWS .............................. SUCCESS [9:17.940s]
[INFO] Apache Axis2 - Test Utilities ..................... SUCCESS [10.317s]
[INFO] Apache Axis2 - JAXWS Integration Tests ............ SUCCESS [11:21.289s]
[INFO] Apache Axis2 - JiBX Data Binding .................. SUCCESS [23.990s]
[INFO] Apache Axis2 - JSON ............................... SUCCESS [17.904s]
[INFO] Apache Axis2 - MTOM Policy ........................ SUCCESS [11.677s]
[INFO] Apache Axis2 - spring ............................. SUCCESS [9.939s]
[INFO] Apache Axis2 - OSGi Integration ................... SUCCESS [15.985s]
[INFO] Apache Axis2 - XMLBeans Data Binding .............. SUCCESS [54.750s]
[INFO] Apache Axis2 - Integration ........................ SUCCESS [10:34.285s]
[INFO] Apache Axis2 - MEX ................................ SUCCESS [15.983s]
[INFO] Apache Axis2 - MTOM Policy module ................. SUCCESS [11.077s]
[INFO] Apache Axis2 - Ping ............................... SUCCESS [9.922s]
[INFO] Apache Axis2 - Version Service .................... SUCCESS [10.002s]
[INFO] Apache Axis2 - SOAP Monitor Servlet ............... SUCCESS [11.109s]
[INFO] Apache Axis2 - SOAP Monitor Module ................ SUCCESS [9.486s]
[INFO] Apache Axis2 - tool - AAR Maven Plugin ............ SUCCESS [11.706s]
[INFO] Apache Axis2 - tool - Ant Plugin .................. SUCCESS [12.431s]
[INFO] Apache Axis2 - tool - Eclipse Codegen Plugin ...... SUCCESS [39.334s]
[INFO] Apache Axis2 - tool - Eclipse service Plugin ...... SUCCESS [17.821s]
[INFO] Apache Axis2 - tool - Intellij IDEA Plugin ........ SUCCESS [23.825s]
[INFO] Apache Axis2 - tool - Java2WSDL Maven Plugin ...... SUCCESS [13.141s]
[INFO] Apache Axis2 - tool - MAR Maven Plugin ............ SUCCESS [10.945s]
[INFO] Apache Axis2 - tool - WSDL2Code Maven Plugin ...... SUCCESS [14.780s]
[INFO] Apache Axis2 - CORBA .............................. SUCCESS [15.809s]
[INFO] Apache Axis2 - JAXWS (mar) ........................ SUCCESS [9.904s]
[INFO] Apache Axis2 - Web Application module ............. SUCCESS [42.614s]
[INFO] Apache Axis2 - Distribution ....................... SUCCESS [1:29.235s]
[INFO] Apache Axis2 - Root ............................... FAILURE [54.183s]
[INFO] ------------------------------------------------------------------------
[INFO] BUILD FAILURE
[INFO] ------------------------------------------------------------------------
[INFO] Total time: 1:04:39.178s
[INFO] Finished at: Tue Feb 01 07:06:46 UTC 2011
[INFO] Final Memory: 92M/978M
[INFO] ------------------------------------------------------------------------
maven builder waiting
mavenExecutionResult exceptions not empty
org.apache.maven.InternalErrorException: Internal error: java.lang.NegativeArraySizeException
	at org.apache.maven.lifecycle.internal.BuilderCommon.handleBuildError(BuilderCommon.java:128)
	at org.apache.maven.lifecycle.internal.LifecycleModuleBuilder.buildProject(LifecycleModuleBuilder.java:95)
	at org.apache.maven.lifecycle.internal.LifecycleModuleBuilder.buildProject(LifecycleModuleBuilder.java:59)
	at org.apache.maven.lifecycle.internal.LifecycleStarter.singleThreadedBuild(LifecycleStarter.java:183)
	at org.apache.maven.lifecycle.internal.LifecycleStarter.execute(LifecycleStarter.java:161)
	at org.apache.maven.DefaultMaven.doExecute(DefaultMaven.java:319)
	at org.apache.maven.DefaultMaven.execute(DefaultMaven.java:156)
	at org.jvnet.hudson.maven3.launcher.Maven3Launcher.main(Maven3Launcher.java:79)
	at sun.reflect.NativeMethodAccessorImpl.invoke0(Native Method)
	at sun.reflect.NativeMethodAccessorImpl.invoke(NativeMethodAccessorImpl.java:39)
	at sun.reflect.DelegatingMethodAccessorImpl.invoke(DelegatingMethodAccessorImpl.java:25)
	at java.lang.reflect.Method.invoke(Method.java:592)
	at org.codehaus.plexus.classworlds.launcher.Launcher.launchStandard(Launcher.java:329)
	at org.codehaus.plexus.classworlds.launcher.Launcher.launch(Launcher.java:239)
	at org.jvnet.hudson.maven3.agent.Maven3Main.launch(Maven3Main.java:145)
	at hudson.maven.Maven3Builder.call(Maven3Builder.java:124)
	at hudson.maven.Maven3Builder.call(Maven3Builder.java:71)
	at hudson.remoting.UserRequest.perform(UserRequest.java:114)
	at hudson.remoting.UserRequest.perform(UserRequest.java:48)
	at hudson.remoting.Request$2.run(Request.java:270)
	at java.util.concurrent.Executors$RunnableAdapter.call(Executors.java:417)
	at java.util.concurrent.FutureTask$Sync.innerRun(FutureTask.java:269)
	at java.util.concurrent.FutureTask.run(FutureTask.java:123)
	at java.util.concurrent.ThreadPoolExecutor$Worker.runTask(ThreadPoolExecutor.java:651)
	at java.util.concurrent.ThreadPoolExecutor$Worker.run(ThreadPoolExecutor.java:676)
	at java.lang.Thread.run(Thread.java:595)
Caused by: java.lang.NegativeArraySizeException
	at hudson.remoting.ProxyOutputStream$Chunk.<init>(ProxyOutputStream.java:175)
	at hudson.remoting.ProxyOutputStream._write(ProxyOutputStream.java:123)
	at hudson.remoting.ProxyOutputStream.write(ProxyOutputStream.java:103)
	at java.io.BufferedOutputStream.flushBuffer(BufferedOutputStream.java:65)
	at java.io.BufferedOutputStream.write(BufferedOutputStream.java:109)
	at java.util.zip.DeflaterOutputStream.deflate(DeflaterOutputStream.java:161)
	at java.util.zip.DeflaterOutputStream.write(DeflaterOutputStream.java:118)
	at java.util.zip.GZIPOutputStream.write(GZIPOutputStream.java:72)
	at java.io.BufferedOutputStream.write(BufferedOutputStream.java:105)
	at org.apache.tools.tar.TarBuffer.writeBlock(TarBuffer.java:410)
	at org.apache.tools.tar.TarBuffer.writeRecord(TarBuffer.java:351)
	at hudson.org.apache.tools.tar.TarOutputStream.writeEOFRecord(TarOutputStream.java:356)
	at hudson.org.apache.tools.tar.TarOutputStream.finish(TarOutputStream.java:137)
	at hudson.org.apache.tools.tar.TarOutputStream.close(TarOutputStream.java:149)
	at hudson.util.io.TarArchiver.close(TarArchiver.java:114)
	at hudson.FilePath.writeToTar(FilePath.java:1579)
	at hudson.FilePath.copyRecursiveTo(FilePath.java:1504)
	at hudson.FilePath.copyRecursiveTo(FilePath.java:1433)
	at hudson.maven.reporters.MavenJavadocArchiver.postExecute(MavenJavadocArchiver.java:90)
	at hudson.maven.Maven3Builder$MavenExecutionListener.reccordMojoSucceeded(Maven3Builder.java:568)
	at hudson.maven.Maven3Builder$MavenExecutionListener.forkSucceeded(Maven3Builder.java:660)
	at org.apache.maven.lifecycle.internal.DefaultExecutionEventCatapult.fire(DefaultExecutionEventCatapult.java:97)
	at org.apache.maven.lifecycle.internal.DefaultExecutionEventCatapult.fire(DefaultExecutionEventCatapult.java:42)
	at org.apache.maven.lifecycle.internal.MojoExecutor.executeForkedExecutions(MojoExecutor.java:383)
	at org.apache.maven.lifecycle.internal.MojoExecutor.execute(MojoExecutor.java:199)
	at org.apache.maven.lifecycle.internal.MojoExecutor.execute(MojoExecutor.java:153)
	at org.apache.maven.lifecycle.internal.MojoExecutor.execute(MojoExecutor.java:145)
	at org.apache.maven.lifecycle.internal.LifecycleModuleBuilder.buildProject(LifecycleModuleBuilder.java:84)
	... 24 more
Maven failed with error.
Sending e-mails to: java-dev@axis.apache.org
Sending e-mails to: java-dev@axis.apache.org
Sending e-mails to: java-dev@axis.apache.org
channel stopped
[locks-and-latches] Releasing all the locks
[locks-and-latches] All the locks released


---------------------------------------------------------------------
To unsubscribe, e-mail: java-dev-unsubscribe@axis.apache.org
For additional commands, e-mail: java-dev-help@axis.apache.org


Mime
View raw message