axis-java-dev mailing list archives

Site index · List index
Message view « Date » · « Thread »
Top « Date » · « Thread »
From Apache Jenkins Server <jenk...@builds.apache.org>
Subject Build failed in Jenkins: axis2-1.5 #353
Date Wed, 07 Mar 2012 15:48:32 GMT
See <https://builds.apache.org/job/axis2-1.5/353/>

------------------------------------------
[...truncated 4265 lines...]
Generating <https://builds.apache.org/job/axis2-1.5/ws/axis2/modules/scripting/target/apidocs/org/apache/axis2/scripting//ScriptModule.html...>
Generating <https://builds.apache.org/job/axis2-1.5/ws/axis2/modules/scripting/target/apidocs/org/apache/axis2/scripting//ScriptReceiver.html...>
Generating <https://builds.apache.org/job/axis2-1.5/ws/axis2/modules/scripting/target/apidocs/org/apache/axis2/scripting//ScriptRepositoryListener.html...>
Generating <https://builds.apache.org/job/axis2-1.5/ws/axis2/modules/scripting/target/apidocs/org/apache/axis2/scripting/convertors//ConvertorFactory.html...>
Generating <https://builds.apache.org/job/axis2-1.5/ws/axis2/modules/scripting/target/apidocs/org/apache/axis2/scripting/convertors//DefaultOMElementConvertor.html...>
Generating <https://builds.apache.org/job/axis2-1.5/ws/axis2/modules/scripting/target/apidocs/org/apache/axis2/scripting/convertors//JSOMElementConvertor.html...>
Generating <https://builds.apache.org/job/axis2-1.5/ws/axis2/modules/scripting/target/apidocs/org/apache/axis2/scripting/convertors//OMElementConvertor.html...>
Generating <https://builds.apache.org/job/axis2-1.5/ws/axis2/modules/scripting/target/apidocs/org/apache/axis2/scripting/convertors//RBOMElementConvertor.html...>
Generating <https://builds.apache.org/job/axis2-1.5/ws/axis2/modules/scripting/target/apidocs/overview-frame.html...>
Generating <https://builds.apache.org/job/axis2-1.5/ws/axis2/modules/scripting/target/apidocs/org/apache/axis2/scripting//package-frame.html...>
Generating <https://builds.apache.org/job/axis2-1.5/ws/axis2/modules/scripting/target/apidocs/org/apache/axis2/scripting//package-summary.html...>
Generating <https://builds.apache.org/job/axis2-1.5/ws/axis2/modules/scripting/target/apidocs/org/apache/axis2/scripting//package-tree.html...>
Generating <https://builds.apache.org/job/axis2-1.5/ws/axis2/modules/scripting/target/apidocs/org/apache/axis2/scripting/convertors//package-frame.html...>
Generating <https://builds.apache.org/job/axis2-1.5/ws/axis2/modules/scripting/target/apidocs/org/apache/axis2/scripting/convertors//package-summary.html...>
Generating <https://builds.apache.org/job/axis2-1.5/ws/axis2/modules/scripting/target/apidocs/org/apache/axis2/scripting/convertors//package-tree.html...>
Generating <https://builds.apache.org/job/axis2-1.5/ws/axis2/modules/scripting/target/apidocs/constant-values.html...>
Generating <https://builds.apache.org/job/axis2-1.5/ws/axis2/modules/scripting/target/apidocs/serialized-form.html...>
Generating <https://builds.apache.org/job/axis2-1.5/ws/axis2/modules/scripting/target/apidocs/org/apache/axis2/scripting/class-use//ScriptMessageContext.html...>
Generating <https://builds.apache.org/job/axis2-1.5/ws/axis2/modules/scripting/target/apidocs/org/apache/axis2/scripting/class-use//ScriptInvoker.html...>
Generating <https://builds.apache.org/job/axis2-1.5/ws/axis2/modules/scripting/target/apidocs/org/apache/axis2/scripting/class-use//ScriptReceiver.html...>
Generating <https://builds.apache.org/job/axis2-1.5/ws/axis2/modules/scripting/target/apidocs/org/apache/axis2/scripting/class-use//ScriptModule.html...>
Generating <https://builds.apache.org/job/axis2-1.5/ws/axis2/modules/scripting/target/apidocs/org/apache/axis2/scripting/class-use//ScriptDeploymentEngine.html...>
Generating <https://builds.apache.org/job/axis2-1.5/ws/axis2/modules/scripting/target/apidocs/org/apache/axis2/scripting/class-use//ScriptRepositoryListener.html...>
Generating <https://builds.apache.org/job/axis2-1.5/ws/axis2/modules/scripting/target/apidocs/org/apache/axis2/scripting/convertors/class-use//DefaultOMElementConvertor.html...>
Generating <https://builds.apache.org/job/axis2-1.5/ws/axis2/modules/scripting/target/apidocs/org/apache/axis2/scripting/convertors/class-use//RBOMElementConvertor.html...>
Generating <https://builds.apache.org/job/axis2-1.5/ws/axis2/modules/scripting/target/apidocs/org/apache/axis2/scripting/convertors/class-use//ConvertorFactory.html...>
Generating <https://builds.apache.org/job/axis2-1.5/ws/axis2/modules/scripting/target/apidocs/org/apache/axis2/scripting/convertors/class-use//OMElementConvertor.html...>
Generating <https://builds.apache.org/job/axis2-1.5/ws/axis2/modules/scripting/target/apidocs/org/apache/axis2/scripting/convertors/class-use//JSOMElementConvertor.html...>
Generating <https://builds.apache.org/job/axis2-1.5/ws/axis2/modules/scripting/target/apidocs/org/apache/axis2/scripting//package-use.html...>
Generating <https://builds.apache.org/job/axis2-1.5/ws/axis2/modules/scripting/target/apidocs/org/apache/axis2/scripting/convertors//package-use.html...>
Building index for all the packages and classes...
Generating <https://builds.apache.org/job/axis2-1.5/ws/axis2/modules/scripting/target/apidocs/overview-tree.html...>
Generating <https://builds.apache.org/job/axis2-1.5/ws/axis2/modules/scripting/target/apidocs/index-all.html...>
Generating <https://builds.apache.org/job/axis2-1.5/ws/axis2/modules/scripting/target/apidocs/deprecated-list.html...>
Building index for all classes...
Generating <https://builds.apache.org/job/axis2-1.5/ws/axis2/modules/scripting/target/apidocs/allclasses-frame.html...>
Generating <https://builds.apache.org/job/axis2-1.5/ws/axis2/modules/scripting/target/apidocs/allclasses-noframe.html...>
Generating <https://builds.apache.org/job/axis2-1.5/ws/axis2/modules/scripting/target/apidocs/index.html...>
Generating <https://builds.apache.org/job/axis2-1.5/ws/axis2/modules/scripting/target/apidocs/overview-summary.html...>
Generating <https://builds.apache.org/job/axis2-1.5/ws/axis2/modules/scripting/target/apidocs/help-doc.html...>
Generating <https://builds.apache.org/job/axis2-1.5/ws/axis2/modules/scripting/target/apidocs/stylesheet.css...>
[INFO] Building jar: <https://builds.apache.org/job/axis2-1.5/ws/axis2/modules/scripting/target/scripting-1.5.7-SNAPSHOT-javadoc.jar>
[INFO] [gpg:sign {execution: default}]
[INFO] [install:install {execution: default-install}]
[INFO] Installing <https://builds.apache.org/job/axis2-1.5/ws/axis2/modules/scripting/target/scripting-1.5.7-SNAPSHOT.mar>
to /home/jenkins/jenkins-slave/maven-repositories/0/org/apache/axis2/scripting/1.5.7-SNAPSHOT/scripting-1.5.7-SNAPSHOT.mar
[INFO] Installing <https://builds.apache.org/job/axis2-1.5/ws/axis2/modules/scripting/target/scripting-1.5.7-SNAPSHOT-sources.jar>
to /home/jenkins/jenkins-slave/maven-repositories/0/org/apache/axis2/scripting/1.5.7-SNAPSHOT/scripting-1.5.7-SNAPSHOT-sources.jar
[INFO] Installing <https://builds.apache.org/job/axis2-1.5/ws/axis2/modules/scripting/target/scripting-1.5.7-SNAPSHOT-javadoc.jar>
to /home/jenkins/jenkins-slave/maven-repositories/0/org/apache/axis2/scripting/1.5.7-SNAPSHOT/scripting-1.5.7-SNAPSHOT-javadoc.jar
[INFO] [deploy:deploy {execution: default-deploy}]
[INFO] Retrieving previous build number from apache.snapshots.https
[WARNING] *** CHECKSUM FAILED - Checksum failed on download: local = '9bc9470cfa3cbba928642f522357eda89f09777c';
remote = '006359536dc2587720161e1716c9392553089051' - RETRYING
[WARNING] *** CHECKSUM FAILED - Checksum failed on download: local = '9bc9470cfa3cbba928642f522357eda89f09777c';
remote = '006359536dc2587720161e1716c9392553089051' - IGNORING
Uploading: https://repository.apache.org/content/repositories/snapshots/org/apache/axis2/scripting/1.5.7-SNAPSHOT/scripting-1.5.7-20120307.153930-170.mar
33K uploaded  (scripting-1.5.7-20120307.153930-170.mar)
[INFO] Retrieving previous metadata from apache.snapshots.https
[WARNING] *** CHECKSUM FAILED - Checksum failed on download: local = '1bc08bd7b2af6f57264bde04077b41ed038aec1d';
remote = '594377474e08484c1903e3038ac2ed2261eff033' - RETRYING
[WARNING] *** CHECKSUM FAILED - Checksum failed on download: local = '1bc08bd7b2af6f57264bde04077b41ed038aec1d';
remote = '594377474e08484c1903e3038ac2ed2261eff033' - IGNORING
[INFO] Uploading repository metadata for: 'artifact org.apache.axis2:scripting'
[INFO] Retrieving previous metadata from apache.snapshots.https
[WARNING] *** CHECKSUM FAILED - Checksum failed on download: local = '9bc9470cfa3cbba928642f522357eda89f09777c';
remote = '006359536dc2587720161e1716c9392553089051' - RETRYING
[WARNING] *** CHECKSUM FAILED - Checksum failed on download: local = '9bc9470cfa3cbba928642f522357eda89f09777c';
remote = '006359536dc2587720161e1716c9392553089051' - IGNORING
[INFO] Uploading repository metadata for: 'snapshot org.apache.axis2:scripting:1.5.7-SNAPSHOT'
[INFO] Uploading project information for scripting 1.5.7-20120307.153930-170
[INFO] Retrieving previous build number from apache.snapshots.https
Uploading: https://repository.apache.org/content/repositories/snapshots/org/apache/axis2/scripting/1.5.7-SNAPSHOT/scripting-1.5.7-20120307.153930-170-sources.jar
28K uploaded  (scripting-1.5.7-20120307.153930-170-sources.jar)
[INFO] Retrieving previous build number from apache.snapshots.https
Uploading: https://repository.apache.org/content/repositories/snapshots/org/apache/axis2/scripting/1.5.7-SNAPSHOT/scripting-1.5.7-20120307.153930-170-javadoc.jar
97K uploaded  (scripting-1.5.7-20120307.153930-170-javadoc.jar)
[JENKINS] Archiving <https://builds.apache.org/job/axis2-1.5/ws/axis2/modules/scripting/pom.xml>
to /home/hudson/hudson/jobs/axis2-1.5/modules/org.apache.axis2$scripting/builds/2012-03-07_15-38-43/archive/org.apache.axis2/scripting/1.5.7-SNAPSHOT/scripting-1.5.7-SNAPSHOT.pom
[JENKINS] Archiving <https://builds.apache.org/job/axis2-1.5/ws/axis2/modules/scripting/target/scripting-1.5.7-SNAPSHOT.mar>
to /home/hudson/hudson/jobs/axis2-1.5/modules/org.apache.axis2$scripting/builds/2012-03-07_15-38-43/archive/org.apache.axis2/scripting/1.5.7-20120307.153930-170/scripting-1.5.7-20120307.153930-170.mar
[JENKINS] Archiving <https://builds.apache.org/job/axis2-1.5/ws/axis2/modules/scripting/target/scripting-1.5.7-SNAPSHOT-sources.jar>
to /home/hudson/hudson/jobs/axis2-1.5/modules/org.apache.axis2$scripting/builds/2012-03-07_15-38-43/archive/org.apache.axis2/scripting/1.5.7-20120307.153930-170/scripting-1.5.7-20120307.153930-170-sources.jar
[JENKINS] Archiving <https://builds.apache.org/job/axis2-1.5/ws/axis2/modules/scripting/target/scripting-1.5.7-SNAPSHOT-javadoc.jar>
to /home/hudson/hudson/jobs/axis2-1.5/modules/org.apache.axis2$scripting/builds/2012-03-07_15-38-43/archive/org.apache.axis2/scripting/1.5.7-20120307.153930-170/scripting-1.5.7-20120307.153930-170-javadoc.jar
[INFO] ------------------------------------------------------------------------
[INFO] Building Apache Axis2 - JAXB-RI Data Binding
[INFO]    task-segment: [clean, deploy]
[INFO] ------------------------------------------------------------------------
[INFO] [clean:clean {execution: default-clean}]
[INFO] Deleting directory <https://builds.apache.org/job/axis2-1.5/ws/axis2/modules/jaxbri/target>
[INFO] [remote-resources:process {execution: default}]
[INFO] [resources:resources {execution: default-resources}]
[INFO] Using 'UTF-8' encoding to copy filtered resources.
[INFO] skip non existing resourceDirectory <https://builds.apache.org/job/axis2-1.5/ws/axis2/modules/jaxbri/conf>
[INFO] Copying 1 resource
[INFO] Copying 4 resources
[INFO] [compiler:compile {execution: default-compile}]
[INFO] Compiling 3 source files to <https://builds.apache.org/job/axis2-1.5/ws/axis2/modules/jaxbri/target/classes>
[INFO] [antrun:run {execution: gen-ts}]
[INFO] Executing tasks
    [mkdir] Created dir: <https://builds.apache.org/job/axis2-1.5/ws/axis2/modules/jaxbri/target/schema>
    [mkdir] Created dir: <https://builds.apache.org/job/axis2-1.5/ws/axis2/modules/jaxbri/target/schema/src>
    [mkdir] Created dir: <https://builds.apache.org/job/axis2-1.5/ws/axis2/modules/jaxbri/target/schema/classes>
     [echo] Generating JAX-B classes for DocLitBareService test
     [echo] Generating Service / Service Client for Test01 test
     [java] Retrieving document at 'test-resources/wsdl/Test01.wsdl'.

init:
    [mkdir] Created dir: <https://builds.apache.org/job/axis2-1.5/ws/axis2/modules/jaxbri/target/wsdl/Test01/build>
    [mkdir] Created dir: <https://builds.apache.org/job/axis2-1.5/ws/axis2/modules/jaxbri/target/wsdl/Test01/build/classes>
    [mkdir] Created dir: <https://builds.apache.org/job/axis2-1.5/ws/axis2/modules/jaxbri/target/wsdl/Test01/build/lib>
    [mkdir] Created dir: <https://builds.apache.org/job/axis2-1.5/ws/axis2/modules/jaxbri/target/wsdl/Test01/test>

pre.compile.test:
     [echo] JAX-B RI Availability = true
     [echo] Stax Availability= true
     [echo] Axis2 Availability= true

compile.src:
    [javac] Compiling 5 source files to <https://builds.apache.org/job/axis2-1.5/ws/axis2/modules/jaxbri/target/wsdl/Test01/build/classes>
    [javac] Note: <https://builds.apache.org/job/axis2-1.5/ws/axis2/modules/jaxbri/target/wsdl/Test01/src/com/foo/wsns/axis2/test01/Test01MessageReceiverInOut.java>
uses unchecked or unsafe operations.
    [javac] Note: Recompile with -Xlint:unchecked for details.

echo.classpath.problem:

jar.server:
     [copy] Copying 2 files to <https://builds.apache.org/job/axis2-1.5/ws/axis2/modules/jaxbri/target/wsdl/Test01/build/classes/META-INF>
      [jar] Building jar: <https://builds.apache.org/job/axis2-1.5/ws/axis2/modules/jaxbri/target/wsdl/Test01/build/lib/Test01.aar>
[INFO] Executed tasks
[INFO] [resources:testResources {execution: default-testResources}]
[INFO] Using 'UTF-8' encoding to copy filtered resources.
[INFO] Copying 2 resources to ../test-resources
[INFO] Copying 4 resources
[INFO] [build-helper:add-test-source {execution: add-test-source}]
[INFO] Test Source directory: <https://builds.apache.org/job/axis2-1.5/ws/axis2/modules/jaxbri/target/schema/src>
added.
[INFO] [compiler:testCompile {execution: default-testCompile}]
[INFO] Compiling 76 source files to <https://builds.apache.org/job/axis2-1.5/ws/axis2/modules/jaxbri/target/test-classes>
[INFO] [surefire:test {execution: default-test}]
[INFO] Surefire report directory: <https://builds.apache.org/job/axis2-1.5/ws/axis2/modules/jaxbri/target/surefire-reports>

-------------------------------------------------------
 T E S T S
-------------------------------------------------------
Running org.temp.doclitbare.DocLitBareWSDLTest
Tests run: 1, Failures: 0, Errors: 0, Skipped: 0, Time elapsed: 1.745 sec

Results :

Tests run: 1, Failures: 0, Errors: 0, Skipped: 0

[JENKINS] Recording test results
[INFO] [jar:jar {execution: default-jar}]
[INFO] Building jar: <https://builds.apache.org/job/axis2-1.5/ws/axis2/modules/jaxbri/target/axis2-jaxbri-1.5.7-SNAPSHOT.jar>
[INFO] [assembly:single {execution: source-release-assembly}]
[INFO] Skipping the assembly in this project because it's not the Execution Root
[INFO] Preparing source:jar
[WARNING] Removing: jar from forked lifecycle, to prevent recursive invocation.
[INFO] No goals needed for project - skipping
[INFO] [source:jar {execution: attach-sources}]
[INFO] Building jar: <https://builds.apache.org/job/axis2-1.5/ws/axis2/modules/jaxbri/target/axis2-jaxbri-1.5.7-SNAPSHOT-sources.jar>
[INFO] [javadoc:jar {execution: attach-javadocs}]
Loading source files for package org.apache.axis2.jaxbri...
Constructing Javadoc information...
Standard Doclet version 1.5.0_22
Building tree for all the packages and classes...
Generating <https://builds.apache.org/job/axis2-1.5/ws/axis2/modules/jaxbri/target/apidocs/org/apache/axis2/jaxbri//CodeGenerationUtility.html...>
Generating <https://builds.apache.org/job/axis2-1.5/ws/axis2/modules/jaxbri/target/apidocs/org/apache/axis2/jaxbri//DocLitBareJaxbSchemaGenerator.html...>
Generating <https://builds.apache.org/job/axis2-1.5/ws/axis2/modules/jaxbri/target/apidocs/org/apache/axis2/jaxbri//JaxbSchemaGenerator.html...>
Generating <https://builds.apache.org/job/axis2-1.5/ws/axis2/modules/jaxbri/target/apidocs/org/apache/axis2/jaxbri//package-frame.html...>
Generating <https://builds.apache.org/job/axis2-1.5/ws/axis2/modules/jaxbri/target/apidocs/org/apache/axis2/jaxbri//package-summary.html...>
Generating <https://builds.apache.org/job/axis2-1.5/ws/axis2/modules/jaxbri/target/apidocs/org/apache/axis2/jaxbri//package-tree.html...>
Generating <https://builds.apache.org/job/axis2-1.5/ws/axis2/modules/jaxbri/target/apidocs/constant-values.html...>
Generating <https://builds.apache.org/job/axis2-1.5/ws/axis2/modules/jaxbri/target/apidocs/org/apache/axis2/jaxbri/class-use//JaxbSchemaGenerator.html...>
Generating <https://builds.apache.org/job/axis2-1.5/ws/axis2/modules/jaxbri/target/apidocs/org/apache/axis2/jaxbri/class-use//CodeGenerationUtility.html...>
Generating <https://builds.apache.org/job/axis2-1.5/ws/axis2/modules/jaxbri/target/apidocs/org/apache/axis2/jaxbri/class-use//DocLitBareJaxbSchemaGenerator.html...>
Generating <https://builds.apache.org/job/axis2-1.5/ws/axis2/modules/jaxbri/target/apidocs/org/apache/axis2/jaxbri//package-use.html...>
Building index for all the packages and classes...
Generating <https://builds.apache.org/job/axis2-1.5/ws/axis2/modules/jaxbri/target/apidocs/overview-tree.html...>
Generating <https://builds.apache.org/job/axis2-1.5/ws/axis2/modules/jaxbri/target/apidocs/index-all.html...>
Generating <https://builds.apache.org/job/axis2-1.5/ws/axis2/modules/jaxbri/target/apidocs/deprecated-list.html...>
Building index for all classes...
Generating <https://builds.apache.org/job/axis2-1.5/ws/axis2/modules/jaxbri/target/apidocs/allclasses-frame.html...>
Generating <https://builds.apache.org/job/axis2-1.5/ws/axis2/modules/jaxbri/target/apidocs/allclasses-noframe.html...>
Generating <https://builds.apache.org/job/axis2-1.5/ws/axis2/modules/jaxbri/target/apidocs/index.html...>
Generating <https://builds.apache.org/job/axis2-1.5/ws/axis2/modules/jaxbri/target/apidocs/help-doc.html...>
Generating <https://builds.apache.org/job/axis2-1.5/ws/axis2/modules/jaxbri/target/apidocs/stylesheet.css...>
[INFO] Building jar: <https://builds.apache.org/job/axis2-1.5/ws/axis2/modules/jaxbri/target/axis2-jaxbri-1.5.7-SNAPSHOT-javadoc.jar>
[INFO] [gpg:sign {execution: default}]
[INFO] [install:install {execution: default-install}]
[INFO] Installing <https://builds.apache.org/job/axis2-1.5/ws/axis2/modules/jaxbri/target/axis2-jaxbri-1.5.7-SNAPSHOT.jar>
to /home/jenkins/jenkins-slave/maven-repositories/0/org/apache/axis2/axis2-jaxbri/1.5.7-SNAPSHOT/axis2-jaxbri-1.5.7-SNAPSHOT.jar
[INFO] Installing <https://builds.apache.org/job/axis2-1.5/ws/axis2/modules/jaxbri/target/axis2-jaxbri-1.5.7-SNAPSHOT-sources.jar>
to /home/jenkins/jenkins-slave/maven-repositories/0/org/apache/axis2/axis2-jaxbri/1.5.7-SNAPSHOT/axis2-jaxbri-1.5.7-SNAPSHOT-sources.jar
[INFO] Installing <https://builds.apache.org/job/axis2-1.5/ws/axis2/modules/jaxbri/target/axis2-jaxbri-1.5.7-SNAPSHOT-javadoc.jar>
to /home/jenkins/jenkins-slave/maven-repositories/0/org/apache/axis2/axis2-jaxbri/1.5.7-SNAPSHOT/axis2-jaxbri-1.5.7-SNAPSHOT-javadoc.jar
[INFO] [deploy:deploy {execution: default-deploy}]
[INFO] Retrieving previous build number from apache.snapshots.https
[WARNING] *** CHECKSUM FAILED - Checksum failed on download: local = '2d3b34201b08304e2e9172a622df19aa4f43fcdf';
remote = '5db6d8c9e79e2175f0032536da6353198679e5ee' - RETRYING
[WARNING] *** CHECKSUM FAILED - Checksum failed on download: local = '2d3b34201b08304e2e9172a622df19aa4f43fcdf';
remote = '5db6d8c9e79e2175f0032536da6353198679e5ee' - IGNORING
Uploading: https://repository.apache.org/content/repositories/snapshots/org/apache/axis2/axis2-jaxbri/1.5.7-SNAPSHOT/axis2-jaxbri-1.5.7-20120307.153930-169.jar
30K uploaded  (axis2-jaxbri-1.5.7-20120307.153930-169.jar)
[INFO] Retrieving previous metadata from apache.snapshots.https
[WARNING] *** CHECKSUM FAILED - Checksum failed on download: local = '2d3b34201b08304e2e9172a622df19aa4f43fcdf';
remote = '5db6d8c9e79e2175f0032536da6353198679e5ee' - RETRYING
[WARNING] *** CHECKSUM FAILED - Checksum failed on download: local = '2d3b34201b08304e2e9172a622df19aa4f43fcdf';
remote = '5db6d8c9e79e2175f0032536da6353198679e5ee' - IGNORING
[INFO] Uploading repository metadata for: 'snapshot org.apache.axis2:axis2-jaxbri:1.5.7-SNAPSHOT'
[INFO] Retrieving previous metadata from apache.snapshots.https
[WARNING] *** CHECKSUM FAILED - Checksum failed on download: local = '47eb545305e48abb1cceb042df125f3083856d85';
remote = '9b6c3246d93c1fc07aee1c25f21df47e97057fa0' - RETRYING
[WARNING] *** CHECKSUM FAILED - Checksum failed on download: local = '47eb545305e48abb1cceb042df125f3083856d85';
remote = '9b6c3246d93c1fc07aee1c25f21df47e97057fa0' - IGNORING
[INFO] Uploading repository metadata for: 'artifact org.apache.axis2:axis2-jaxbri'
[INFO] Uploading project information for axis2-jaxbri 1.5.7-20120307.153930-169
[INFO] Retrieving previous build number from apache.snapshots.https
Uploading: https://repository.apache.org/content/repositories/snapshots/org/apache/axis2/axis2-jaxbri/1.5.7-SNAPSHOT/axis2-jaxbri-1.5.7-20120307.153930-169-sources.jar
20K uploaded  (axis2-jaxbri-1.5.7-20120307.153930-169-sources.jar)
[INFO] Retrieving previous build number from apache.snapshots.https
Uploading: https://repository.apache.org/content/repositories/snapshots/org/apache/axis2/axis2-jaxbri/1.5.7-SNAPSHOT/axis2-jaxbri-1.5.7-20120307.153930-169-javadoc.jar
46K uploaded  (axis2-jaxbri-1.5.7-20120307.153930-169-javadoc.jar)
[JENKINS] Archiving <https://builds.apache.org/job/axis2-1.5/ws/axis2/modules/jaxbri/pom.xml>
to /home/hudson/hudson/jobs/axis2-1.5/modules/org.apache.axis2$axis2-jaxbri/builds/2012-03-07_15-38-43/archive/org.apache.axis2/axis2-jaxbri/1.5.7-SNAPSHOT/axis2-jaxbri-1.5.7-SNAPSHOT.pom
[JENKINS] Archiving <https://builds.apache.org/job/axis2-1.5/ws/axis2/modules/jaxbri/target/axis2-jaxbri-1.5.7-SNAPSHOT.jar>
to /home/hudson/hudson/jobs/axis2-1.5/modules/org.apache.axis2$axis2-jaxbri/builds/2012-03-07_15-38-43/archive/org.apache.axis2/axis2-jaxbri/1.5.7-20120307.153930-169/axis2-jaxbri-1.5.7-20120307.153930-169.jar
[JENKINS] Archiving <https://builds.apache.org/job/axis2-1.5/ws/axis2/modules/jaxbri/target/axis2-jaxbri-1.5.7-SNAPSHOT-sources.jar>
to /home/hudson/hudson/jobs/axis2-1.5/modules/org.apache.axis2$axis2-jaxbri/builds/2012-03-07_15-38-43/archive/org.apache.axis2/axis2-jaxbri/1.5.7-20120307.153930-169/axis2-jaxbri-1.5.7-20120307.153930-169-sources.jar
[JENKINS] Archiving <https://builds.apache.org/job/axis2-1.5/ws/axis2/modules/jaxbri/target/axis2-jaxbri-1.5.7-SNAPSHOT-javadoc.jar>
to /home/hudson/hudson/jobs/axis2-1.5/modules/org.apache.axis2$axis2-jaxbri/builds/2012-03-07_15-38-43/archive/org.apache.axis2/axis2-jaxbri/1.5.7-20120307.153930-169/axis2-jaxbri-1.5.7-20120307.153930-169-javadoc.jar
[INFO] ------------------------------------------------------------------------
[INFO] Building Apache Axis2 - SAAJ
[INFO]    task-segment: [clean, deploy]
[INFO] ------------------------------------------------------------------------
[INFO] [clean:clean {execution: default-clean}]
[INFO] Deleting directory <https://builds.apache.org/job/axis2-1.5/ws/axis2/modules/saaj/target>
[INFO] [remote-resources:process {execution: default}]
[INFO] [resources:resources {execution: default-resources}]
[INFO] Using 'UTF-8' encoding to copy filtered resources.
[INFO] Copying 4 resources
[INFO] Copying 4 resources
[INFO] [compiler:compile {execution: default-compile}]
[INFO] Compiling 27 source files to <https://builds.apache.org/job/axis2-1.5/ws/axis2/modules/saaj/target/classes>
[INFO] -------------------------------------------------------------
[ERROR] COMPILATION ERROR : 
[INFO] -------------------------------------------------------------
[ERROR] <https://builds.apache.org/job/axis2-1.5/ws/axis2/modules/saaj/src/org/apache/axis2/saaj/SOAPEnvelopeImpl.java>:[56,13]
cannot find symbol
symbol  : method setOwnerDocument(org.apache.axiom.om.impl.dom.DocumentImpl)
location: class org.apache.axis2.saaj.SOAPElementImpl

[INFO] 1error
[INFO] -------------------------------------------------------------
[JENKINS] Archiving <https://builds.apache.org/job/axis2-1.5/ws/axis2/modules/saaj/pom.xml>
to /home/hudson/hudson/jobs/axis2-1.5/modules/org.apache.axis2$axis2-saaj/builds/2012-03-07_15-38-43/archive/org.apache.axis2/axis2-saaj/1.5.7-SNAPSHOT/axis2-saaj-1.5.7-SNAPSHOT.pom
[INFO] ------------------------------------------------------------------------
[ERROR] BUILD FAILURE
[INFO] ------------------------------------------------------------------------
[INFO] Compilation failure
<https://builds.apache.org/job/axis2-1.5/ws/axis2/modules/saaj/src/org/apache/axis2/saaj/SOAPEnvelopeImpl.java>:[56,13]
cannot find symbol
symbol  : method setOwnerDocument(org.apache.axiom.om.impl.dom.DocumentImpl)
location: class org.apache.axis2.saaj.SOAPElementImpl


[INFO] ------------------------------------------------------------------------
[INFO] For more information, run Maven with the -e switch
[INFO] ------------------------------------------------------------------------
[INFO] Total time: 9 minutes 20 seconds
[INFO] Finished at: Wed Mar 07 15:48:30 UTC 2012
[INFO] Final Memory: 78M/246M
[INFO] ------------------------------------------------------------------------
Waiting for Jenkins to finish collecting data
Sending e-mails to: java-dev@axis.apache.org
channel stopped
[locks-and-latches] Releasing all the locks
[locks-and-latches] All the locks released


---------------------------------------------------------------------
To unsubscribe, e-mail: java-dev-unsubscribe@axis.apache.org
For additional commands, e-mail: java-dev-help@axis.apache.org


Mime
View raw message