axis-java-dev mailing list archives

Site index · List index
Message view « Date » · « Thread »
Top « Date » · « Thread »
From Apache Jenkins Server <jenk...@builds.apache.org>
Subject Build failed in Jenkins: axis2-1.6 #261
Date Fri, 09 Mar 2012 04:07:40 GMT
See <https://builds.apache.org/job/axis2-1.6/261/changes>

Changes:

[sagara] Merged r1298688 to the 1.6 branch.

------------------------------------------
[...truncated 4324 lines...]
Building tree for all the packages and classes...
Generating <https://builds.apache.org/job/axis2-1.6/ws/axis2/modules/scripting/target/apidocs/org/apache/axis2/scripting//ScriptDeploymentEngine.html...>
Generating <https://builds.apache.org/job/axis2-1.6/ws/axis2/modules/scripting/target/apidocs/org/apache/axis2/scripting//ScriptInvoker.html...>
Generating <https://builds.apache.org/job/axis2-1.6/ws/axis2/modules/scripting/target/apidocs/org/apache/axis2/scripting//ScriptMessageContext.html...>
Generating <https://builds.apache.org/job/axis2-1.6/ws/axis2/modules/scripting/target/apidocs/org/apache/axis2/scripting//ScriptModule.html...>
Generating <https://builds.apache.org/job/axis2-1.6/ws/axis2/modules/scripting/target/apidocs/org/apache/axis2/scripting//ScriptReceiver.html...>
Generating <https://builds.apache.org/job/axis2-1.6/ws/axis2/modules/scripting/target/apidocs/org/apache/axis2/scripting//ScriptRepositoryListener.html...>
Generating <https://builds.apache.org/job/axis2-1.6/ws/axis2/modules/scripting/target/apidocs/org/apache/axis2/scripting/convertors//ConvertorFactory.html...>
Generating <https://builds.apache.org/job/axis2-1.6/ws/axis2/modules/scripting/target/apidocs/org/apache/axis2/scripting/convertors//DefaultOMElementConvertor.html...>
Generating <https://builds.apache.org/job/axis2-1.6/ws/axis2/modules/scripting/target/apidocs/org/apache/axis2/scripting/convertors//JSOMElementConvertor.html...>
Generating <https://builds.apache.org/job/axis2-1.6/ws/axis2/modules/scripting/target/apidocs/org/apache/axis2/scripting/convertors//OMElementConvertor.html...>
Generating <https://builds.apache.org/job/axis2-1.6/ws/axis2/modules/scripting/target/apidocs/org/apache/axis2/scripting/convertors//RBOMElementConvertor.html...>
Generating <https://builds.apache.org/job/axis2-1.6/ws/axis2/modules/scripting/target/apidocs/overview-frame.html...>
Generating <https://builds.apache.org/job/axis2-1.6/ws/axis2/modules/scripting/target/apidocs/org/apache/axis2/scripting//package-frame.html...>
Generating <https://builds.apache.org/job/axis2-1.6/ws/axis2/modules/scripting/target/apidocs/org/apache/axis2/scripting//package-summary.html...>
Generating <https://builds.apache.org/job/axis2-1.6/ws/axis2/modules/scripting/target/apidocs/org/apache/axis2/scripting//package-tree.html...>
Generating <https://builds.apache.org/job/axis2-1.6/ws/axis2/modules/scripting/target/apidocs/org/apache/axis2/scripting/convertors//package-frame.html...>
Generating <https://builds.apache.org/job/axis2-1.6/ws/axis2/modules/scripting/target/apidocs/org/apache/axis2/scripting/convertors//package-summary.html...>
Generating <https://builds.apache.org/job/axis2-1.6/ws/axis2/modules/scripting/target/apidocs/org/apache/axis2/scripting/convertors//package-tree.html...>
Generating <https://builds.apache.org/job/axis2-1.6/ws/axis2/modules/scripting/target/apidocs/constant-values.html...>
Generating <https://builds.apache.org/job/axis2-1.6/ws/axis2/modules/scripting/target/apidocs/serialized-form.html...>
Generating <https://builds.apache.org/job/axis2-1.6/ws/axis2/modules/scripting/target/apidocs/org/apache/axis2/scripting/class-use//ScriptReceiver.html...>
Generating <https://builds.apache.org/job/axis2-1.6/ws/axis2/modules/scripting/target/apidocs/org/apache/axis2/scripting/class-use//ScriptMessageContext.html...>
Generating <https://builds.apache.org/job/axis2-1.6/ws/axis2/modules/scripting/target/apidocs/org/apache/axis2/scripting/class-use//ScriptDeploymentEngine.html...>
Generating <https://builds.apache.org/job/axis2-1.6/ws/axis2/modules/scripting/target/apidocs/org/apache/axis2/scripting/class-use//ScriptRepositoryListener.html...>
Generating <https://builds.apache.org/job/axis2-1.6/ws/axis2/modules/scripting/target/apidocs/org/apache/axis2/scripting/class-use//ScriptInvoker.html...>
Generating <https://builds.apache.org/job/axis2-1.6/ws/axis2/modules/scripting/target/apidocs/org/apache/axis2/scripting/class-use//ScriptModule.html...>
Generating <https://builds.apache.org/job/axis2-1.6/ws/axis2/modules/scripting/target/apidocs/org/apache/axis2/scripting/convertors/class-use//OMElementConvertor.html...>
Generating <https://builds.apache.org/job/axis2-1.6/ws/axis2/modules/scripting/target/apidocs/org/apache/axis2/scripting/convertors/class-use//RBOMElementConvertor.html...>
Generating <https://builds.apache.org/job/axis2-1.6/ws/axis2/modules/scripting/target/apidocs/org/apache/axis2/scripting/convertors/class-use//DefaultOMElementConvertor.html...>
Generating <https://builds.apache.org/job/axis2-1.6/ws/axis2/modules/scripting/target/apidocs/org/apache/axis2/scripting/convertors/class-use//ConvertorFactory.html...>
Generating <https://builds.apache.org/job/axis2-1.6/ws/axis2/modules/scripting/target/apidocs/org/apache/axis2/scripting/convertors/class-use//JSOMElementConvertor.html...>
Generating <https://builds.apache.org/job/axis2-1.6/ws/axis2/modules/scripting/target/apidocs/org/apache/axis2/scripting//package-use.html...>
Generating <https://builds.apache.org/job/axis2-1.6/ws/axis2/modules/scripting/target/apidocs/org/apache/axis2/scripting/convertors//package-use.html...>
Building index for all the packages and classes...
Generating <https://builds.apache.org/job/axis2-1.6/ws/axis2/modules/scripting/target/apidocs/overview-tree.html...>
Generating <https://builds.apache.org/job/axis2-1.6/ws/axis2/modules/scripting/target/apidocs/index-all.html...>
Generating <https://builds.apache.org/job/axis2-1.6/ws/axis2/modules/scripting/target/apidocs/deprecated-list.html...>
Building index for all classes...
Generating <https://builds.apache.org/job/axis2-1.6/ws/axis2/modules/scripting/target/apidocs/allclasses-frame.html...>
Generating <https://builds.apache.org/job/axis2-1.6/ws/axis2/modules/scripting/target/apidocs/allclasses-noframe.html...>
Generating <https://builds.apache.org/job/axis2-1.6/ws/axis2/modules/scripting/target/apidocs/index.html...>
Generating <https://builds.apache.org/job/axis2-1.6/ws/axis2/modules/scripting/target/apidocs/overview-summary.html...>
Generating <https://builds.apache.org/job/axis2-1.6/ws/axis2/modules/scripting/target/apidocs/help-doc.html...>
Generating <https://builds.apache.org/job/axis2-1.6/ws/axis2/modules/scripting/target/apidocs/stylesheet.css...>
[INFO] Building jar: <https://builds.apache.org/job/axis2-1.6/ws/axis2/modules/scripting/target/scripting-1.6.2-SNAPSHOT-javadoc.jar>
[INFO] [gpg:sign {execution: default}]
[INFO] [install:install {execution: default-install}]
[INFO] Installing <https://builds.apache.org/job/axis2-1.6/ws/axis2/modules/scripting/target/scripting-1.6.2-SNAPSHOT.mar>
to <https://builds.apache.org/job/axis2-1.6/ws/.repository/org/apache/axis2/scripting/1.6.2-SNAPSHOT/scripting-1.6.2-SNAPSHOT.mar>
[INFO] Installing <https://builds.apache.org/job/axis2-1.6/ws/axis2/modules/scripting/target/scripting-1.6.2-SNAPSHOT-sources.jar>
to <https://builds.apache.org/job/axis2-1.6/ws/.repository/org/apache/axis2/scripting/1.6.2-SNAPSHOT/scripting-1.6.2-SNAPSHOT-sources.jar>
[INFO] Installing <https://builds.apache.org/job/axis2-1.6/ws/axis2/modules/scripting/target/scripting-1.6.2-SNAPSHOT-javadoc.jar>
to <https://builds.apache.org/job/axis2-1.6/ws/.repository/org/apache/axis2/scripting/1.6.2-SNAPSHOT/scripting-1.6.2-SNAPSHOT-javadoc.jar>
[INFO] [deploy:deploy {execution: default-deploy}]
[INFO] Retrieving previous build number from apache.snapshots.https
[WARNING] *** CHECKSUM FAILED - Checksum failed on download: local = 'bc28f013794750800633e58cf029c7821f259984';
remote = '3a655614aaf137f36c92da2514902986c06b6779' - RETRYING
[WARNING] *** CHECKSUM FAILED - Checksum failed on download: local = 'bc28f013794750800633e58cf029c7821f259984';
remote = '3a655614aaf137f36c92da2514902986c06b6779' - IGNORING
Uploading: https://repository.apache.org/content/repositories/snapshots/org/apache/axis2/scripting/1.6.2-SNAPSHOT/scripting-1.6.2-20120309.040315-173.mar
28K uploaded  (scripting-1.6.2-20120309.040315-173.mar)
[INFO] Retrieving previous metadata from apache.snapshots.https
[INFO] Uploading repository metadata for: 'artifact org.apache.axis2:scripting'
[INFO] Retrieving previous metadata from apache.snapshots.https
[WARNING] *** CHECKSUM FAILED - Checksum failed on download: local = 'bc28f013794750800633e58cf029c7821f259984';
remote = '3a655614aaf137f36c92da2514902986c06b6779' - RETRYING
[WARNING] *** CHECKSUM FAILED - Checksum failed on download: local = 'bc28f013794750800633e58cf029c7821f259984';
remote = '3a655614aaf137f36c92da2514902986c06b6779' - IGNORING
[INFO] Uploading repository metadata for: 'snapshot org.apache.axis2:scripting:1.6.2-SNAPSHOT'
[INFO] Uploading project information for scripting 1.6.2-20120309.040315-173
[INFO] Retrieving previous build number from apache.snapshots.https
Uploading: https://repository.apache.org/content/repositories/snapshots/org/apache/axis2/scripting/1.6.2-SNAPSHOT/scripting-1.6.2-20120309.040315-173-sources.jar
23K uploaded  (scripting-1.6.2-20120309.040315-173-sources.jar)
[INFO] Retrieving previous build number from apache.snapshots.https
Uploading: https://repository.apache.org/content/repositories/snapshots/org/apache/axis2/scripting/1.6.2-SNAPSHOT/scripting-1.6.2-20120309.040315-173-javadoc.jar
93K uploaded  (scripting-1.6.2-20120309.040315-173-javadoc.jar)
[JENKINS] Archiving <https://builds.apache.org/job/axis2-1.6/ws/axis2/modules/scripting/pom.xml>
to /home/hudson/hudson/jobs/axis2-1.6/modules/org.apache.axis2$scripting/builds/2012-03-09_04-02-58/archive/org.apache.axis2/scripting/1.6.2-SNAPSHOT/scripting-1.6.2-SNAPSHOT.pom
[JENKINS] Archiving <https://builds.apache.org/job/axis2-1.6/ws/axis2/modules/scripting/target/scripting-1.6.2-SNAPSHOT.mar>
to /home/hudson/hudson/jobs/axis2-1.6/modules/org.apache.axis2$scripting/builds/2012-03-09_04-02-58/archive/org.apache.axis2/scripting/1.6.2-20120309.040315-173/scripting-1.6.2-20120309.040315-173.mar
[JENKINS] Archiving <https://builds.apache.org/job/axis2-1.6/ws/axis2/modules/scripting/target/scripting-1.6.2-SNAPSHOT-sources.jar>
to /home/hudson/hudson/jobs/axis2-1.6/modules/org.apache.axis2$scripting/builds/2012-03-09_04-02-58/archive/org.apache.axis2/scripting/1.6.2-20120309.040315-173/scripting-1.6.2-20120309.040315-173-sources.jar
[JENKINS] Archiving <https://builds.apache.org/job/axis2-1.6/ws/axis2/modules/scripting/target/scripting-1.6.2-SNAPSHOT-javadoc.jar>
to /home/hudson/hudson/jobs/axis2-1.6/modules/org.apache.axis2$scripting/builds/2012-03-09_04-02-58/archive/org.apache.axis2/scripting/1.6.2-20120309.040315-173/scripting-1.6.2-20120309.040315-173-javadoc.jar
[INFO] ------------------------------------------------------------------------
[INFO] Building Apache Axis2 - JAXB-RI Data Binding
[INFO]    task-segment: [clean, deploy]
[INFO] ------------------------------------------------------------------------
[INFO] [clean:clean {execution: default-clean}]
[INFO] Deleting directory <https://builds.apache.org/job/axis2-1.6/ws/axis2/modules/jaxbri/target>
[INFO] [remote-resources:process {execution: default}]
[INFO] [resources:resources {execution: default-resources}]
[INFO] Using 'UTF-8' encoding to copy filtered resources.
[INFO] skip non existing resourceDirectory <https://builds.apache.org/job/axis2-1.6/ws/axis2/modules/jaxbri/conf>
[INFO] Copying 1 resource
[INFO] Copying 2 resources
[INFO] [compiler:compile {execution: default-compile}]
[INFO] Compiling 3 source files to <https://builds.apache.org/job/axis2-1.6/ws/axis2/modules/jaxbri/target/classes>
[INFO] [antrun:run {execution: gen-ts}]
[INFO] Executing tasks
    [mkdir] Created dir: <https://builds.apache.org/job/axis2-1.6/ws/axis2/modules/jaxbri/target/schema>
    [mkdir] Created dir: <https://builds.apache.org/job/axis2-1.6/ws/axis2/modules/jaxbri/target/schema/src>
    [mkdir] Created dir: <https://builds.apache.org/job/axis2-1.6/ws/axis2/modules/jaxbri/target/schema/classes>
     [echo] Generating JAX-B classes for DocLitBareService test
     [echo] Generating Service / Service Client for Test01 test
     [java] Retrieving document at 'test-resources/wsdl/Test01.wsdl'.

init:
    [mkdir] Created dir: <https://builds.apache.org/job/axis2-1.6/ws/axis2/modules/jaxbri/target/wsdl/Test01/build>
    [mkdir] Created dir: <https://builds.apache.org/job/axis2-1.6/ws/axis2/modules/jaxbri/target/wsdl/Test01/build/classes>
    [mkdir] Created dir: <https://builds.apache.org/job/axis2-1.6/ws/axis2/modules/jaxbri/target/wsdl/Test01/build/lib>
    [mkdir] Created dir: <https://builds.apache.org/job/axis2-1.6/ws/axis2/modules/jaxbri/target/wsdl/Test01/test>

pre.compile.test:
     [echo] JAX-B RI Availability = true
     [echo] Stax Availability= true
     [echo] Axis2 Availability= true

compile.src:
    [javac] Compiling 5 source files to <https://builds.apache.org/job/axis2-1.6/ws/axis2/modules/jaxbri/target/wsdl/Test01/build/classes>
    [javac] Note: <https://builds.apache.org/job/axis2-1.6/ws/axis2/modules/jaxbri/target/wsdl/Test01/src/com/foo/wsns/axis2/test01/Test01MessageReceiverInOut.java>
uses unchecked or unsafe operations.
    [javac] Note: Recompile with -Xlint:unchecked for details.

echo.classpath.problem:

jar.server:
     [copy] Copying 2 files to <https://builds.apache.org/job/axis2-1.6/ws/axis2/modules/jaxbri/target/wsdl/Test01/build/classes/META-INF>
      [jar] Building jar: <https://builds.apache.org/job/axis2-1.6/ws/axis2/modules/jaxbri/target/wsdl/Test01/build/lib/Test01.aar>
[INFO] Executed tasks
[INFO] [resources:testResources {execution: default-testResources}]
[INFO] Using 'UTF-8' encoding to copy filtered resources.
[INFO] Copying 2 resources to ../test-resources
[INFO] Copying 2 resources
[INFO] [build-helper:add-test-source {execution: add-test-source}]
[INFO] Test Source directory: <https://builds.apache.org/job/axis2-1.6/ws/axis2/modules/jaxbri/target/schema/src>
added.
[INFO] [compiler:testCompile {execution: default-testCompile}]
[INFO] Compiling 76 source files to <https://builds.apache.org/job/axis2-1.6/ws/axis2/modules/jaxbri/target/test-classes>
[INFO] [surefire:test {execution: default-test}]
[INFO] Surefire report directory: <https://builds.apache.org/job/axis2-1.6/ws/axis2/modules/jaxbri/target/surefire-reports>

-------------------------------------------------------
 T E S T S
-------------------------------------------------------
Running org.temp.doclitbare.DocLitBareWSDLTest
Tests run: 1, Failures: 0, Errors: 0, Skipped: 0, Time elapsed: 1.242 sec

Results :

Tests run: 1, Failures: 0, Errors: 0, Skipped: 0

[JENKINS] Recording test results
[INFO] [jar:jar {execution: default-jar}]
[INFO] Building jar: <https://builds.apache.org/job/axis2-1.6/ws/axis2/modules/jaxbri/target/axis2-jaxbri-1.6.2-SNAPSHOT.jar>
[INFO] [assembly:single {execution: source-release-assembly}]
[INFO] Skipping the assembly in this project because it's not the Execution Root
[INFO] Preparing source:jar
[WARNING] Removing: jar from forked lifecycle, to prevent recursive invocation.
[INFO] No goals needed for project - skipping
[INFO] [source:jar {execution: attach-sources}]
[INFO] Building jar: <https://builds.apache.org/job/axis2-1.6/ws/axis2/modules/jaxbri/target/axis2-jaxbri-1.6.2-SNAPSHOT-sources.jar>
[INFO] [javadoc:jar {execution: attach-javadocs}]
Loading source files for package org.apache.axis2.jaxbri...
Constructing Javadoc information...
Standard Doclet version 1.5.0_22
Building tree for all the packages and classes...
Generating <https://builds.apache.org/job/axis2-1.6/ws/axis2/modules/jaxbri/target/apidocs/org/apache/axis2/jaxbri//CodeGenerationUtility.html...>
Generating <https://builds.apache.org/job/axis2-1.6/ws/axis2/modules/jaxbri/target/apidocs/org/apache/axis2/jaxbri//DocLitBareJaxbSchemaGenerator.html...>
Generating <https://builds.apache.org/job/axis2-1.6/ws/axis2/modules/jaxbri/target/apidocs/org/apache/axis2/jaxbri//JaxbSchemaGenerator.html...>
Generating <https://builds.apache.org/job/axis2-1.6/ws/axis2/modules/jaxbri/target/apidocs/org/apache/axis2/jaxbri//package-frame.html...>
Generating <https://builds.apache.org/job/axis2-1.6/ws/axis2/modules/jaxbri/target/apidocs/org/apache/axis2/jaxbri//package-summary.html...>
Generating <https://builds.apache.org/job/axis2-1.6/ws/axis2/modules/jaxbri/target/apidocs/org/apache/axis2/jaxbri//package-tree.html...>
Generating <https://builds.apache.org/job/axis2-1.6/ws/axis2/modules/jaxbri/target/apidocs/constant-values.html...>
Generating <https://builds.apache.org/job/axis2-1.6/ws/axis2/modules/jaxbri/target/apidocs/org/apache/axis2/jaxbri/class-use//DocLitBareJaxbSchemaGenerator.html...>
Generating <https://builds.apache.org/job/axis2-1.6/ws/axis2/modules/jaxbri/target/apidocs/org/apache/axis2/jaxbri/class-use//JaxbSchemaGenerator.html...>
Generating <https://builds.apache.org/job/axis2-1.6/ws/axis2/modules/jaxbri/target/apidocs/org/apache/axis2/jaxbri/class-use//CodeGenerationUtility.html...>
Generating <https://builds.apache.org/job/axis2-1.6/ws/axis2/modules/jaxbri/target/apidocs/org/apache/axis2/jaxbri//package-use.html...>
Building index for all the packages and classes...
Generating <https://builds.apache.org/job/axis2-1.6/ws/axis2/modules/jaxbri/target/apidocs/overview-tree.html...>
Generating <https://builds.apache.org/job/axis2-1.6/ws/axis2/modules/jaxbri/target/apidocs/index-all.html...>
Generating <https://builds.apache.org/job/axis2-1.6/ws/axis2/modules/jaxbri/target/apidocs/deprecated-list.html...>
Building index for all classes...
Generating <https://builds.apache.org/job/axis2-1.6/ws/axis2/modules/jaxbri/target/apidocs/allclasses-frame.html...>
Generating <https://builds.apache.org/job/axis2-1.6/ws/axis2/modules/jaxbri/target/apidocs/allclasses-noframe.html...>
Generating <https://builds.apache.org/job/axis2-1.6/ws/axis2/modules/jaxbri/target/apidocs/index.html...>
Generating <https://builds.apache.org/job/axis2-1.6/ws/axis2/modules/jaxbri/target/apidocs/help-doc.html...>
Generating <https://builds.apache.org/job/axis2-1.6/ws/axis2/modules/jaxbri/target/apidocs/stylesheet.css...>
[INFO] Building jar: <https://builds.apache.org/job/axis2-1.6/ws/axis2/modules/jaxbri/target/axis2-jaxbri-1.6.2-SNAPSHOT-javadoc.jar>
[INFO] [gpg:sign {execution: default}]
[INFO] [install:install {execution: default-install}]
[INFO] Installing <https://builds.apache.org/job/axis2-1.6/ws/axis2/modules/jaxbri/target/axis2-jaxbri-1.6.2-SNAPSHOT.jar>
to <https://builds.apache.org/job/axis2-1.6/ws/.repository/org/apache/axis2/axis2-jaxbri/1.6.2-SNAPSHOT/axis2-jaxbri-1.6.2-SNAPSHOT.jar>
[INFO] Installing <https://builds.apache.org/job/axis2-1.6/ws/axis2/modules/jaxbri/target/axis2-jaxbri-1.6.2-SNAPSHOT-sources.jar>
to <https://builds.apache.org/job/axis2-1.6/ws/.repository/org/apache/axis2/axis2-jaxbri/1.6.2-SNAPSHOT/axis2-jaxbri-1.6.2-SNAPSHOT-sources.jar>
[INFO] Installing <https://builds.apache.org/job/axis2-1.6/ws/axis2/modules/jaxbri/target/axis2-jaxbri-1.6.2-SNAPSHOT-javadoc.jar>
to <https://builds.apache.org/job/axis2-1.6/ws/.repository/org/apache/axis2/axis2-jaxbri/1.6.2-SNAPSHOT/axis2-jaxbri-1.6.2-SNAPSHOT-javadoc.jar>
[INFO] [deploy:deploy {execution: default-deploy}]
[INFO] Retrieving previous build number from apache.snapshots.https
[WARNING] *** CHECKSUM FAILED - Checksum failed on download: local = 'b3d46e07fd8ac1da1623ef4b2c999bc28f7326d1';
remote = '40a2c7f71d5432062a64e3925a652b2695d04bfc' - RETRYING
[WARNING] *** CHECKSUM FAILED - Checksum failed on download: local = 'b3d46e07fd8ac1da1623ef4b2c999bc28f7326d1';
remote = '40a2c7f71d5432062a64e3925a652b2695d04bfc' - IGNORING
Uploading: https://repository.apache.org/content/repositories/snapshots/org/apache/axis2/axis2-jaxbri/1.6.2-SNAPSHOT/axis2-jaxbri-1.6.2-20120309.040315-173.jar
28K uploaded  (axis2-jaxbri-1.6.2-20120309.040315-173.jar)
[INFO] Retrieving previous metadata from apache.snapshots.https
[INFO] Uploading repository metadata for: 'artifact org.apache.axis2:axis2-jaxbri'
[INFO] Retrieving previous metadata from apache.snapshots.https
[WARNING] *** CHECKSUM FAILED - Checksum failed on download: local = 'b3d46e07fd8ac1da1623ef4b2c999bc28f7326d1';
remote = '40a2c7f71d5432062a64e3925a652b2695d04bfc' - RETRYING
[WARNING] *** CHECKSUM FAILED - Checksum failed on download: local = 'b3d46e07fd8ac1da1623ef4b2c999bc28f7326d1';
remote = '40a2c7f71d5432062a64e3925a652b2695d04bfc' - IGNORING
[INFO] Uploading repository metadata for: 'snapshot org.apache.axis2:axis2-jaxbri:1.6.2-SNAPSHOT'
[INFO] Uploading project information for axis2-jaxbri 1.6.2-20120309.040315-173
[INFO] Retrieving previous build number from apache.snapshots.https
Uploading: https://repository.apache.org/content/repositories/snapshots/org/apache/axis2/axis2-jaxbri/1.6.2-SNAPSHOT/axis2-jaxbri-1.6.2-20120309.040315-173-sources.jar
17K uploaded  (axis2-jaxbri-1.6.2-20120309.040315-173-sources.jar)
[INFO] Retrieving previous build number from apache.snapshots.https
Uploading: https://repository.apache.org/content/repositories/snapshots/org/apache/axis2/axis2-jaxbri/1.6.2-SNAPSHOT/axis2-jaxbri-1.6.2-20120309.040315-173-javadoc.jar
41K uploaded  (axis2-jaxbri-1.6.2-20120309.040315-173-javadoc.jar)
[JENKINS] Archiving <https://builds.apache.org/job/axis2-1.6/ws/axis2/modules/jaxbri/pom.xml>
to /home/hudson/hudson/jobs/axis2-1.6/modules/org.apache.axis2$axis2-jaxbri/builds/2012-03-09_04-02-58/archive/org.apache.axis2/axis2-jaxbri/1.6.2-SNAPSHOT/axis2-jaxbri-1.6.2-SNAPSHOT.pom
[JENKINS] Archiving <https://builds.apache.org/job/axis2-1.6/ws/axis2/modules/jaxbri/target/axis2-jaxbri-1.6.2-SNAPSHOT.jar>
to /home/hudson/hudson/jobs/axis2-1.6/modules/org.apache.axis2$axis2-jaxbri/builds/2012-03-09_04-02-58/archive/org.apache.axis2/axis2-jaxbri/1.6.2-20120309.040315-173/axis2-jaxbri-1.6.2-20120309.040315-173.jar
[JENKINS] Archiving <https://builds.apache.org/job/axis2-1.6/ws/axis2/modules/jaxbri/target/axis2-jaxbri-1.6.2-SNAPSHOT-sources.jar>
to /home/hudson/hudson/jobs/axis2-1.6/modules/org.apache.axis2$axis2-jaxbri/builds/2012-03-09_04-02-58/archive/org.apache.axis2/axis2-jaxbri/1.6.2-20120309.040315-173/axis2-jaxbri-1.6.2-20120309.040315-173-sources.jar
[JENKINS] Archiving <https://builds.apache.org/job/axis2-1.6/ws/axis2/modules/jaxbri/target/axis2-jaxbri-1.6.2-SNAPSHOT-javadoc.jar>
to /home/hudson/hudson/jobs/axis2-1.6/modules/org.apache.axis2$axis2-jaxbri/builds/2012-03-09_04-02-58/archive/org.apache.axis2/axis2-jaxbri/1.6.2-20120309.040315-173/axis2-jaxbri-1.6.2-20120309.040315-173-javadoc.jar
[INFO] ------------------------------------------------------------------------
[INFO] Building Apache Axis2 - SAAJ
[INFO]    task-segment: [clean, deploy]
[INFO] ------------------------------------------------------------------------
[INFO] [clean:clean {execution: default-clean}]
[INFO] Deleting directory <https://builds.apache.org/job/axis2-1.6/ws/axis2/modules/saaj/target>
[INFO] [remote-resources:process {execution: default}]
[INFO] [resources:resources {execution: default-resources}]
[INFO] Using 'UTF-8' encoding to copy filtered resources.
[INFO] Copying 4 resources
[INFO] Copying 2 resources
[INFO] [compiler:compile {execution: default-compile}]
[INFO] Compiling 27 source files to <https://builds.apache.org/job/axis2-1.6/ws/axis2/modules/saaj/target/classes>
[INFO] -------------------------------------------------------------
[ERROR] COMPILATION ERROR : 
[INFO] -------------------------------------------------------------
[ERROR] <https://builds.apache.org/job/axis2-1.6/ws/axis2/modules/saaj/src/org/apache/axis2/saaj/TextImplEx.java>:[32,7]
org.apache.axis2.saaj.TextImplEx is not abstract and does not override abstract method getOwnerDocument()
in org.w3c.dom.Node

[ERROR] <https://builds.apache.org/job/axis2-1.6/ws/axis2/modules/saaj/src/org/apache/axis2/saaj/CommentImpl.java>:[26,7]
org.apache.axis2.saaj.CommentImpl is not abstract and does not override abstract method getOwnerDocument()
in org.w3c.dom.Node

[INFO] 2 errors 
[INFO] -------------------------------------------------------------
[JENKINS] Archiving <https://builds.apache.org/job/axis2-1.6/ws/axis2/modules/saaj/pom.xml>
to /home/hudson/hudson/jobs/axis2-1.6/modules/org.apache.axis2$axis2-saaj/builds/2012-03-09_04-02-58/archive/org.apache.axis2/axis2-saaj/1.6.2-SNAPSHOT/axis2-saaj-1.6.2-SNAPSHOT.pom
[INFO] ------------------------------------------------------------------------
[ERROR] BUILD FAILURE
[INFO] ------------------------------------------------------------------------
[INFO] Compilation failure

<https://builds.apache.org/job/axis2-1.6/ws/axis2/modules/saaj/src/org/apache/axis2/saaj/TextImplEx.java>:[32,7]
org.apache.axis2.saaj.TextImplEx is not abstract and does not override abstract method getOwnerDocument()
in org.w3c.dom.Node

<https://builds.apache.org/job/axis2-1.6/ws/axis2/modules/saaj/src/org/apache/axis2/saaj/CommentImpl.java>:[26,7]
org.apache.axis2.saaj.CommentImpl is not abstract and does not override abstract method getOwnerDocument()
in org.w3c.dom.Node


[INFO] ------------------------------------------------------------------------
[INFO] For more information, run Maven with the -e switch
[INFO] ------------------------------------------------------------------------
[INFO] Total time: 4 minutes 35 seconds
[INFO] Finished at: Fri Mar 09 04:07:39 GMT 2012
[INFO] Final Memory: 105M/418M
[INFO] ------------------------------------------------------------------------
Sending e-mails to: java-dev@axis.apache.org
channel stopped
[locks-and-latches] Releasing all the locks
[locks-and-latches] All the locks released


---------------------------------------------------------------------
To unsubscribe, e-mail: java-dev-unsubscribe@axis.apache.org
For additional commands, e-mail: java-dev-help@axis.apache.org


Mime
View raw message