axis-java-dev mailing list archives

Site index · List index
Message view « Date » · « Thread »
Top « Date » · « Thread »
From Apache Jenkins Server <jenk...@builds.apache.org>
Subject Build failed in Jenkins: axis2-1.5 » Apache Axis2 - SAAJ #353
Date Wed, 07 Mar 2012 15:48:31 GMT
See <https://builds.apache.org/job/axis2-1.5/org.apache.axis2$axis2-saaj/353/>

------------------------------------------
[INFO] ------------------------------------------------------------------------
[INFO] Building Apache Axis2 - SAAJ
[INFO]    task-segment: [clean, deploy]
[INFO] ------------------------------------------------------------------------
[INFO] [clean:clean {execution: default-clean}]
[INFO] Deleting directory <https://builds.apache.org/job/axis2-1.5/org.apache.axis2$axis2-saaj/ws/target>
[INFO] [remote-resources:process {execution: default}]
[INFO] [resources:resources {execution: default-resources}]
[INFO] Using 'UTF-8' encoding to copy filtered resources.
[INFO] Copying 4 resources
[INFO] Copying 4 resources
[INFO] [compiler:compile {execution: default-compile}]
[INFO] Compiling 27 source files to <https://builds.apache.org/job/axis2-1.5/org.apache.axis2$axis2-saaj/ws/target/classes>
[INFO] -------------------------------------------------------------
[ERROR] COMPILATION ERROR : 
[INFO] -------------------------------------------------------------
[ERROR] <https://builds.apache.org/job/axis2-1.5/org.apache.axis2$axis2-saaj/ws/src/org/apache/axis2/saaj/SOAPEnvelopeImpl.java>:[56,13]
cannot find symbol
symbol  : method setOwnerDocument(org.apache.axiom.om.impl.dom.DocumentImpl)
location: class org.apache.axis2.saaj.SOAPElementImpl

[INFO] 1error
[INFO] -------------------------------------------------------------
[JENKINS] Archiving <https://builds.apache.org/job/axis2-1.5/org.apache.axis2$axis2-saaj/ws/pom.xml>
to /home/hudson/hudson/jobs/axis2-1.5/modules/org.apache.axis2$axis2-saaj/builds/2012-03-07_15-38-43/archive/org.apache.axis2/axis2-saaj/1.5.7-SNAPSHOT/axis2-saaj-1.5.7-SNAPSHOT.pom
[INFO] ------------------------------------------------------------------------
[ERROR] BUILD FAILURE
[INFO] ------------------------------------------------------------------------
[INFO] Compilation failure
<https://builds.apache.org/job/axis2-1.5/org.apache.axis2$axis2-saaj/ws/src/org/apache/axis2/saaj/SOAPEnvelopeImpl.java>:[56,13]
cannot find symbol
symbol  : method setOwnerDocument(org.apache.axiom.om.impl.dom.DocumentImpl)
location: class org.apache.axis2.saaj.SOAPElementImpl


[INFO] ------------------------------------------------------------------------
[INFO] For more information, run Maven with the -e switch
[INFO] ------------------------------------------------------------------------
[INFO] Total time: 9 minutes 20 seconds
[INFO] Finished at: Wed Mar 07 15:48:30 UTC 2012
[INFO] Final Memory: 78M/246M
[INFO] ------------------------------------------------------------------------
Waiting for Jenkins to finish collecting data


---------------------------------------------------------------------
To unsubscribe, e-mail: java-dev-unsubscribe@axis.apache.org
For additional commands, e-mail: java-dev-help@axis.apache.org


Mime
View raw message