axis-java-dev mailing list archives

Site index · List index
Message view « Date » · « Thread »
Top « Date » · « Thread »
From Apache Jenkins Server <jenk...@builds.apache.org>
Subject Build failed in Jenkins: axis2-1.5 » Apache Axis2 - SAAJ #346
Date Fri, 02 Mar 2012 07:33:00 GMT
See <https://builds.apache.org/job/axis2-1.5/org.apache.axis2$axis2-saaj/346/>

------------------------------------------
[INFO] ------------------------------------------------------------------------
[INFO] Building Apache Axis2 - SAAJ
[INFO]    task-segment: [clean, deploy]
[INFO] ------------------------------------------------------------------------
[INFO] [clean:clean {execution: default-clean}]
[INFO] [remote-resources:process {execution: default}]
Downloading: http://repo1.maven.org/maven2/org/apache/geronimo/specs/geronimo-saaj_1.3_spec/1.0.1/geronimo-saaj_1.3_spec-1.0.1.pom

Downloading: http://repo1.maven.org/maven2/com/sun/xml/messaging/saaj/saaj-impl/1.3.2/saaj-impl-1.3.2.pom

Downloading: http://repo1.maven.org/maven2/com/sun/xml/parsers/jaxp-ri/1.4.2/jaxp-ri-1.4.2.pom

Downloading: http://repo1.maven.org/maven2/javax/xml/parsers/jaxp-api/1.4.2/jaxp-api-1.4.2.pom

Downloading: http://repo1.maven.org/maven2/com/sun/xml/parsers/jaxp-ri/1.4.2/jaxp-ri-1.4.2.jar
Downloading: http://repo1.maven.org/maven2/javax/xml/parsers/jaxp-api/1.4.2/jaxp-api-1.4.2.jar
Downloading: http://repo1.maven.org/maven2/org/apache/geronimo/specs/geronimo-saaj_1.3_spec/1.0.1/geronimo-saaj_1.3_spec-1.0.1.jar
Downloading: http://repo1.maven.org/maven2/com/sun/xml/messaging/saaj/saaj-impl/1.3.2/saaj-impl-1.3.2.jar




[INFO] [resources:resources {execution: default-resources}]
[INFO] Using 'UTF-8' encoding to copy filtered resources.
[INFO] Copying 4 resources
[INFO] Copying 4 resources
[INFO] [compiler:compile {execution: default-compile}]
[INFO] Compiling 27 source files to <https://builds.apache.org/job/axis2-1.5/org.apache.axis2$axis2-saaj/ws/target/classes>
[INFO] -------------------------------------------------------------
[ERROR] COMPILATION ERROR : 
[INFO] -------------------------------------------------------------
[ERROR] <https://builds.apache.org/job/axis2-1.5/org.apache.axis2$axis2-saaj/ws/src/org/apache/axis2/saaj/SOAPEnvelopeImpl.java>:[204,12]
cannot find symbol
symbol  : method setPreviousOMSibling(org.apache.axiom.om.impl.dom.TextImpl)
location: class org.apache.axiom.om.impl.dom.NodeImpl

[INFO] 1error
[INFO] -------------------------------------------------------------
[JENKINS] Archiving <https://builds.apache.org/job/axis2-1.5/org.apache.axis2$axis2-saaj/ws/pom.xml>
to /home/hudson/hudson/jobs/axis2-1.5/modules/org.apache.axis2$axis2-saaj/builds/2012-03-02_07-17-49/archive/org.apache.axis2/axis2-saaj/1.5.7-SNAPSHOT/axis2-saaj-1.5.7-SNAPSHOT.pom
[INFO] ------------------------------------------------------------------------
[ERROR] BUILD FAILURE
[INFO] ------------------------------------------------------------------------
[INFO] Compilation failure
<https://builds.apache.org/job/axis2-1.5/org.apache.axis2$axis2-saaj/ws/src/org/apache/axis2/saaj/SOAPEnvelopeImpl.java>:[204,12]
cannot find symbol
symbol  : method setPreviousOMSibling(org.apache.axiom.om.impl.dom.TextImpl)
location: class org.apache.axiom.om.impl.dom.NodeImpl


[INFO] ------------------------------------------------------------------------
[INFO] For more information, run Maven with the -e switch
[INFO] ------------------------------------------------------------------------
[INFO] Total time: 14 minutes 18 seconds
[INFO] Finished at: Fri Mar 02 07:32:59 UTC 2012
[INFO] Final Memory: 75M/233M
[INFO] ------------------------------------------------------------------------


---------------------------------------------------------------------
To unsubscribe, e-mail: java-dev-unsubscribe@axis.apache.org
For additional commands, e-mail: java-dev-help@axis.apache.org


Mime
View raw message