axis-java-dev mailing list archives

Site index · List index
Message view « Date » · « Thread »
Top « Date » · « Thread »
From Apache Jenkins Server <jenk...@builds.apache.org>
Subject Build failed in Jenkins: Axis2-trunk-java-1.6 #783
Date Tue, 06 Mar 2012 21:36:17 GMT
See <https://builds.apache.org/job/Axis2-trunk-java-1.6/783/changes>

Changes:

[thilinamb] removing an unused variable introduced in r1297344.

[thilinamb] Fixing RAMPART-332 - Making getEffectivePolicy() method thread safe.

[sagara] Fixed AXIS2-5258

------------------------------------------
[...truncated 1434 lines...]

[INFO] --- maven-compiler-plugin:2.3.1:compile (default-compile) @ scripting ---
[INFO] [INFO] Using 'UTF-8' encoding to copy filtered resources.
[INFO] Copying 2 resources to ../test-resources
[INFO] Copying 2 resources

[INFO] --- maven-resources-plugin:2.4.2:testResources (default-testResources) @ scripting
---
[INFO] [INFO] Compiling 5 source files to <https://builds.apache.org/job/Axis2-trunk-java-1.6/ws/axis2/modules/scripting/target/test-classes>

[INFO] --- maven-compiler-plugin:2.3.1:testCompile (default-testCompile) @ scripting ---
[INFO] [INFO] Surefire report directory: <https://builds.apache.org/job/Axis2-trunk-java-1.6/ws/axis2/modules/scripting/target/surefire-reports>

[INFO] --- maven-surefire-plugin:2.4.3:test (default-test) @ scripting ---

-------------------------------------------------------
 T E S T S
-------------------------------------------------------
Running org.apache.axis2.scripting.convertors.JSOMElementConvertorTest
Tests run: 2, Failures: 0, Errors: 0, Skipped: 0, Time elapsed: 0.719 sec
Running org.apache.axis2.scripting.ScriptReceiverTest
Tests run: 2, Failures: 0, Errors: 0, Skipped: 0, Time elapsed: 0.135 sec

Results :

Tests run: 4, Failures: 0, Errors: 0, Skipped: 0

[JENKINS] Recording test results
[INFO] [INFO] Generating mar <https://builds.apache.org/job/Axis2-trunk-java-1.6/ws/axis2/modules/scripting/target/scripting-1.7.0-SNAPSHOT.mar>
[INFO] Building jar: <https://builds.apache.org/job/Axis2-trunk-java-1.6/ws/axis2/modules/scripting/target/scripting-1.7.0-SNAPSHOT.mar>

[INFO] --- axis2-mar-maven-plugin:1.5.2:mar (default-mar) @ scripting ---
[INFO] [INFO] Installing <https://builds.apache.org/job/Axis2-trunk-java-1.6/ws/axis2/modules/scripting/target/scripting-1.7.0-SNAPSHOT.mar>
to <https://builds.apache.org/job/Axis2-trunk-java-1.6/ws/.repository/org/apache/axis2/scripting/1.7.0-SNAPSHOT/scripting-1.7.0-SNAPSHOT.mar>
[INFO] Installing <https://builds.apache.org/job/Axis2-trunk-java-1.6/ws/axis2/modules/scripting/pom.xml>
to <https://builds.apache.org/job/Axis2-trunk-java-1.6/ws/.repository/org/apache/axis2/scripting/1.7.0-SNAPSHOT/scripting-1.7.0-SNAPSHOT.pom>

[INFO] --- maven-install-plugin:2.2:install (default-install) @ scripting ---
[JENKINS] Archiving <https://builds.apache.org/job/Axis2-trunk-java-1.6/ws/axis2/modules/scripting/pom.xml>
to /home/hudson/hudson/jobs/Axis2-trunk-java-1.6/modules/org.apache.axis2$scripting/builds/2012-03-06_21-30-33/archive/org.apache.axis2/scripting/1.7.0-SNAPSHOT/scripting-1.7.0-SNAPSHOT.pom
[JENKINS] Archiving <https://builds.apache.org/job/Axis2-trunk-java-1.6/ws/axis2/modules/scripting/target/scripting-1.7.0-SNAPSHOT.mar>
to /home/hudson/hudson/jobs/Axis2-trunk-java-1.6/modules/org.apache.axis2$scripting/builds/2012-03-06_21-30-33/archive/org.apache.axis2/scripting/1.7.0-SNAPSHOT/scripting-1.7.0-SNAPSHOT.mar
[INFO]                                                                         
[INFO] ------------------------------------------------------------------------
[INFO] Building Apache Axis2 - JAXB-RI Data Binding 1.7.0-SNAPSHOT
[INFO] ------------------------------------------------------------------------
[INFO] 
[INFO] --- maven-clean-plugin:2.2:clean (default-clean) @ axis2-jaxbri ---
[INFO] Deleting directory <https://builds.apache.org/job/Axis2-trunk-java-1.6/ws/axis2/modules/jaxbri/target>
[INFO] 
[INFO] --- maven-remote-resources-plugin:1.1:process (default) @ axis2-jaxbri ---
[INFO] [INFO] Using 'UTF-8' encoding to copy filtered resources.
[INFO] skip non existing resourceDirectory <https://builds.apache.org/job/Axis2-trunk-java-1.6/ws/axis2/modules/jaxbri/conf>
[INFO] Copying 1 resource
[INFO] Copying 2 resources

[INFO] --- maven-resources-plugin:2.4.2:resources (default-resources) @ axis2-jaxbri ---
[INFO] [INFO] Compiling 3 source files to <https://builds.apache.org/job/Axis2-trunk-java-1.6/ws/axis2/modules/jaxbri/target/classes>

[INFO] --- maven-compiler-plugin:2.3.1:compile (default-compile) @ axis2-jaxbri ---
[INFO] [INFO] Executing tasks
    [mkdir] Created dir: <https://builds.apache.org/job/Axis2-trunk-java-1.6/ws/axis2/modules/jaxbri/target/schema>
    [mkdir] Created dir: <https://builds.apache.org/job/Axis2-trunk-java-1.6/ws/axis2/modules/jaxbri/target/schema/src>
    [mkdir] Created dir: <https://builds.apache.org/job/Axis2-trunk-java-1.6/ws/axis2/modules/jaxbri/target/schema/classes>
     [echo] Generating JAX-B classes for DocLitBareService test

[INFO] --- maven-antrun-plugin:1.2:run (gen-ts) @ axis2-jaxbri ---
     [echo] Generating Service / Service Client for Test01 test
     [java] Retrieving document at 'test-resources/wsdl/Test01.wsdl'.

init:
    [mkdir] Created dir: <https://builds.apache.org/job/Axis2-trunk-java-1.6/ws/axis2/modules/jaxbri/target/wsdl/Test01/build>
    [mkdir] Created dir: <https://builds.apache.org/job/Axis2-trunk-java-1.6/ws/axis2/modules/jaxbri/target/wsdl/Test01/build/classes>
    [mkdir] Created dir: <https://builds.apache.org/job/Axis2-trunk-java-1.6/ws/axis2/modules/jaxbri/target/wsdl/Test01/build/lib>
    [mkdir] Created dir: <https://builds.apache.org/job/Axis2-trunk-java-1.6/ws/axis2/modules/jaxbri/target/wsdl/Test01/test>

pre.compile.test:
     [echo] JAX-B RI Availability = true
     [echo] Stax Availability= true
     [echo] Axis2 Availability= true

compile.src:
    [javac] Compiling 5 source files to <https://builds.apache.org/job/Axis2-trunk-java-1.6/ws/axis2/modules/jaxbri/target/wsdl/Test01/build/classes>
    [javac] Note: <https://builds.apache.org/job/Axis2-trunk-java-1.6/ws/axis2/modules/jaxbri/target/wsdl/Test01/src/com/foo/wsns/axis2/test01/Test01MessageReceiverInOut.java>
uses unchecked or unsafe operations.
    [javac] Note: Recompile with -Xlint:unchecked for details.

echo.classpath.problem:

jar.server:
     [copy] Copying 2 files to <https://builds.apache.org/job/Axis2-trunk-java-1.6/ws/axis2/modules/jaxbri/target/wsdl/Test01/build/classes/META-INF>
      [jar] Building jar: <https://builds.apache.org/job/Axis2-trunk-java-1.6/ws/axis2/modules/jaxbri/target/wsdl/Test01/build/lib/Test01.aar>
[INFO] Executed tasks
[INFO] [INFO] Using 'UTF-8' encoding to copy filtered resources.
[INFO] Copying 2 resources to ../test-resources
[INFO] Copying 2 resources

[INFO] --- maven-resources-plugin:2.4.2:testResources (default-testResources) @ axis2-jaxbri
---
[INFO] [INFO] Test Source directory: <https://builds.apache.org/job/Axis2-trunk-java-1.6/ws/axis2/modules/jaxbri/target/schema/src>
added.

[INFO] --- build-helper-maven-plugin:1.4:add-test-source (add-test-source) @ axis2-jaxbri
---
[INFO] [INFO] Compiling 76 source files to <https://builds.apache.org/job/Axis2-trunk-java-1.6/ws/axis2/modules/jaxbri/target/test-classes>

[INFO] --- maven-compiler-plugin:2.3.1:testCompile (default-testCompile) @ axis2-jaxbri ---
[INFO] [INFO] Surefire report directory: <https://builds.apache.org/job/Axis2-trunk-java-1.6/ws/axis2/modules/jaxbri/target/surefire-reports>

[INFO] --- maven-surefire-plugin:2.4.3:test (default-test) @ axis2-jaxbri ---

-------------------------------------------------------
 T E S T S
-------------------------------------------------------
Running org.temp.doclitbare.DocLitBareWSDLTest
Tests run: 1, Failures: 0, Errors: 0, Skipped: 0, Time elapsed: 1.34 sec

Results :

Tests run: 1, Failures: 0, Errors: 0, Skipped: 0

[JENKINS] Recording test results
[INFO] [INFO] Building jar: <https://builds.apache.org/job/Axis2-trunk-java-1.6/ws/axis2/modules/jaxbri/target/axis2-jaxbri-1.7.0-SNAPSHOT.jar>

[INFO] --- maven-jar-plugin:2.2:jar (default-jar) @ axis2-jaxbri ---
[INFO] [INFO] Installing <https://builds.apache.org/job/Axis2-trunk-java-1.6/ws/axis2/modules/jaxbri/target/axis2-jaxbri-1.7.0-SNAPSHOT.jar>
to <https://builds.apache.org/job/Axis2-trunk-java-1.6/ws/.repository/org/apache/axis2/axis2-jaxbri/1.7.0-SNAPSHOT/axis2-jaxbri-1.7.0-SNAPSHOT.jar>
[INFO] Installing <https://builds.apache.org/job/Axis2-trunk-java-1.6/ws/axis2/modules/jaxbri/pom.xml>
to <https://builds.apache.org/job/Axis2-trunk-java-1.6/ws/.repository/org/apache/axis2/axis2-jaxbri/1.7.0-SNAPSHOT/axis2-jaxbri-1.7.0-SNAPSHOT.pom>

[INFO] --- maven-install-plugin:2.2:install (default-install) @ axis2-jaxbri ---
[JENKINS] Archiving <https://builds.apache.org/job/Axis2-trunk-java-1.6/ws/axis2/modules/jaxbri/pom.xml>
to /home/hudson/hudson/jobs/Axis2-trunk-java-1.6/modules/org.apache.axis2$axis2-jaxbri/builds/2012-03-06_21-30-33/archive/org.apache.axis2/axis2-jaxbri/1.7.0-SNAPSHOT/axis2-jaxbri-1.7.0-SNAPSHOT.pom
[JENKINS] Archiving <https://builds.apache.org/job/Axis2-trunk-java-1.6/ws/axis2/modules/jaxbri/target/axis2-jaxbri-1.7.0-SNAPSHOT.jar>
to /home/hudson/hudson/jobs/Axis2-trunk-java-1.6/modules/org.apache.axis2$axis2-jaxbri/builds/2012-03-06_21-30-33/archive/org.apache.axis2/axis2-jaxbri/1.7.0-SNAPSHOT/axis2-jaxbri-1.7.0-SNAPSHOT.jar
[INFO]                                                                         
[INFO] ------------------------------------------------------------------------
[INFO] Building Apache Axis2 - SAAJ 1.7.0-SNAPSHOT
[INFO] ------------------------------------------------------------------------
[INFO] [INFO] Deleting directory <https://builds.apache.org/job/Axis2-trunk-java-1.6/ws/axis2/modules/saaj/target>

[INFO] --- maven-clean-plugin:2.2:clean (default-clean) @ axis2-saaj ---
[INFO] 
[INFO] --- maven-remote-resources-plugin:1.1:process (default) @ axis2-saaj ---
[INFO] [INFO] Using 'UTF-8' encoding to copy filtered resources.
[INFO] Copying 4 resources
[INFO] Copying 2 resources

[INFO] --- maven-resources-plugin:2.4.2:resources (default-resources) @ axis2-saaj ---
[INFO] [INFO] Compiling 27 source files to <https://builds.apache.org/job/Axis2-trunk-java-1.6/ws/axis2/modules/saaj/target/classes>

[INFO] --- maven-compiler-plugin:2.3.1:compile (default-compile) @ axis2-saaj ---
[INFO] -------------------------------------------------------------
[ERROR] COMPILATION ERROR : 
[INFO] -------------------------------------------------------------
[ERROR] <https://builds.apache.org/job/Axis2-trunk-java-1.6/ws/axis2/modules/saaj/src/org/apache/axis2/saaj/TextImplEx.java>:[32,7]
org.apache.axis2.saaj.TextImplEx is not abstract and does not override abstract method getParentNode()
in org.w3c.dom.Node

[ERROR] <https://builds.apache.org/job/Axis2-trunk-java-1.6/ws/axis2/modules/saaj/src/org/apache/axis2/saaj/CommentImpl.java>:[26,7]
org.apache.axis2.saaj.CommentImpl is not abstract and does not override abstract method getParentNode()
in org.w3c.dom.Node

[INFO] 2 errors 
[INFO] -------------------------------------------------------------
[JENKINS] Archiving <https://builds.apache.org/job/Axis2-trunk-java-1.6/ws/axis2/modules/saaj/pom.xml>
to /home/hudson/hudson/jobs/Axis2-trunk-java-1.6/modules/org.apache.axis2$axis2-saaj/builds/2012-03-06_21-30-33/archive/org.apache.axis2/axis2-saaj/1.7.0-SNAPSHOT/axis2-saaj-1.7.0-SNAPSHOT.pom
[INFO] ------------------------------------------------------------------------
[INFO] Reactor Summary:
[INFO] 
[INFO] Apache Axis2 - Parent ............................. SUCCESS [35.663s]
[INFO] Apache Axis2 - Resource bundle .................... SUCCESS [4.969s]
[INFO] Apache Axis2 - Kernel ............................. SUCCESS [50.157s]
[INFO] Apache Axis2 - Data Binding ....................... SUCCESS [13.641s]
[INFO] Apache Axis2 - Transport - Local .................. SUCCESS [5.997s]
[INFO] Apache Axis2 - Transport - HTTP ................... SUCCESS [8.236s]
[INFO] Apache Axis2 - Code Generation .................... SUCCESS [10.296s]
[INFO] Apache Axis2 - ADB Codegen ........................ SUCCESS [30.788s]
[INFO] Apache Axis2 - Addressing ......................... SUCCESS [5.749s]
[INFO] Apache Axis2 - Java2WSDL .......................... SUCCESS [13.172s]
[INFO] Apache Axis2 - tool - Repository Maven Plugin ..... SUCCESS [5.189s]
[INFO] Apache Axis2 - Fast Infoset ....................... SUCCESS [12.813s]
[INFO] Apache Axis2 - Clustering ......................... SUCCESS [1:09.721s]
[INFO] Apache Axis2 - Scripting .......................... SUCCESS [4.210s]
[INFO] Apache Axis2 - JAXB-RI Data Binding ............... SUCCESS [9.511s]
[INFO] Apache Axis2 - SAAJ ............................... FAILURE [2.221s]
[INFO] Apache Axis2 - Metadata ........................... SKIPPED
[INFO] Apache Axis2 - JAXWS .............................. SKIPPED
[INFO] Apache Axis2 - Test Utilities ..................... SKIPPED
[INFO] Apache Axis2 - XMLBeans Data Binding .............. SKIPPED
[INFO] Apache Axis2 - tool - WSDL2Code Maven Plugin ...... SKIPPED
[INFO] Apache Axis2 - JAXWS Integration Tests ............ SKIPPED
[INFO] Apache Axis2 - JiBX Data Binding .................. SKIPPED
[INFO] Apache Axis2 - JSON ............................... SKIPPED
[INFO] Apache Axis2 - MTOM Policy ........................ SKIPPED
[INFO] Apache Axis2 - spring ............................. SKIPPED
[INFO] Apache Axis2 - OSGi Integration ................... SKIPPED
[INFO] Apache Axis2 - Integration ........................ SKIPPED
[INFO] Apache Axis2 - MEX ................................ SKIPPED
[INFO] Apache Axis2 - MTOM Policy module ................. SKIPPED
[INFO] Apache Axis2 - Ping ............................... SKIPPED
[INFO] Apache Axis2 - Version Service .................... SKIPPED
[INFO] Apache Axis2 - SOAP Monitor Servlet ............... SKIPPED
[INFO] Apache Axis2 - SOAP Monitor Module ................ SKIPPED
[INFO] Apache Axis2 - tool - AAR Maven Plugin ............ SKIPPED
[INFO] Apache Axis2 - tool - Ant Plugin .................. SKIPPED
[INFO] Apache Axis2 - tool - Eclipse Codegen Plugin ...... SKIPPED
[INFO] Apache Axis2 - tool - Eclipse service Plugin ...... SKIPPED
[INFO] Apache Axis2 - tool - Intellij IDEA Plugin ........ SKIPPED
[INFO] Apache Axis2 - tool - Java2WSDL Maven Plugin ...... SKIPPED
[INFO] Apache Axis2 - tool - MAR Maven Plugin ............ SKIPPED
[INFO] Apache Axis2 Simple HTTP server Maven Plugin ...... SKIPPED
[INFO] Axis2 quickstart archetype ........................ SKIPPED
[INFO] Axis2 quickstart-web archetype .................... SKIPPED
[INFO] Apache Axis2 - CORBA .............................. SKIPPED
[INFO] Apache Axis2 - JAXWS (mar) ........................ SKIPPED
[INFO] Apache Axis2 - Web Application module ............. SKIPPED
[INFO] Apache Axis2 - Root ............................... SKIPPED
[INFO] ------------------------------------------------------------------------
[INFO] BUILD FAILURE
[INFO] ------------------------------------------------------------------------
[INFO] Total time: 5:33.574s
[INFO] Finished at: Tue Mar 06 21:36:15 UTC 2012
[INFO] Final Memory: 68M/187M
[INFO] ------------------------------------------------------------------------
mavenExecutionResult exceptions not empty
message : Failed to execute goal org.apache.maven.plugins:maven-compiler-plugin:2.3.1:compile
(default-compile) on project axis2-saaj: Compilation failure
cause : Compilation failure
Stack trace : 
org.apache.maven.lifecycle.LifecycleExecutionException: Failed to execute goal org.apache.maven.plugins:maven-compiler-plugin:2.3.1:compile
(default-compile) on project axis2-saaj: Compilation failure
	at org.apache.maven.lifecycle.internal.MojoExecutor.execute(MojoExecutor.java:213)
	at org.apache.maven.lifecycle.internal.MojoExecutor.execute(MojoExecutor.java:153)
	at org.apache.maven.lifecycle.internal.MojoExecutor.execute(MojoExecutor.java:145)
	at org.apache.maven.lifecycle.internal.LifecycleModuleBuilder.buildProject(LifecycleModuleBuilder.java:84)
	at org.apache.maven.lifecycle.internal.LifecycleModuleBuilder.buildProject(LifecycleModuleBuilder.java:59)
	at org.apache.maven.lifecycle.internal.LifecycleStarter.singleThreadedBuild(LifecycleStarter.java:183)
	at org.apache.maven.lifecycle.internal.LifecycleStarter.execute(LifecycleStarter.java:161)
	at org.apache.maven.DefaultMaven.doExecute(DefaultMaven.java:319)
	at org.apache.maven.DefaultMaven.execute(DefaultMaven.java:156)
	at org.jvnet.hudson.maven3.launcher.Maven3Launcher.main(Maven3Launcher.java:79)
	at sun.reflect.NativeMethodAccessorImpl.invoke0(Native Method)
	at sun.reflect.NativeMethodAccessorImpl.invoke(NativeMethodAccessorImpl.java:39)
	at sun.reflect.DelegatingMethodAccessorImpl.invoke(DelegatingMethodAccessorImpl.java:25)
	at java.lang.reflect.Method.invoke(Method.java:597)
	at org.codehaus.plexus.classworlds.launcher.Launcher.launchStandard(Launcher.java:329)
	at org.codehaus.plexus.classworlds.launcher.Launcher.launch(Launcher.java:239)
	at org.jvnet.hudson.maven3.agent.Maven3Main.launch(Maven3Main.java:158)
	at hudson.maven.Maven3Builder.call(Maven3Builder.java:104)
	at hudson.maven.Maven3Builder.call(Maven3Builder.java:70)
	at hudson.remoting.UserRequest.perform(UserRequest.java:118)
	at hudson.remoting.UserRequest.perform(UserRequest.java:48)
	at hudson.remoting.Request$2.run(Request.java:287)
	at hudson.remoting.InterceptingExecutorService$1.call(InterceptingExecutorService.java:72)
	at java.util.concurrent.FutureTask$Sync.innerRun(FutureTask.java:303)
	at java.util.concurrent.FutureTask.run(FutureTask.java:138)
	at java.util.concurrent.ThreadPoolExecutor$Worker.runTask(ThreadPoolExecutor.java:886)
	at java.util.concurrent.ThreadPoolExecutor$Worker.run(ThreadPoolExecutor.java:908)
	at java.lang.Thread.run(Thread.java:662)
Caused by: org.apache.maven.plugin.CompilationFailureException: Compilation failure
	at org.apache.maven.plugin.AbstractCompilerMojo.execute(AbstractCompilerMojo.java:656)
	at org.apache.maven.plugin.CompilerMojo.execute(CompilerMojo.java:128)
	at org.apache.maven.plugin.DefaultBuildPluginManager.executeMojo(DefaultBuildPluginManager.java:101)
	at org.apache.maven.lifecycle.internal.MojoExecutor.execute(MojoExecutor.java:209)
	... 27 more
channel stopped
[locks-and-latches] Releasing all the locks
[locks-and-latches] All the locks released


---------------------------------------------------------------------
To unsubscribe, e-mail: java-dev-unsubscribe@axis.apache.org
For additional commands, e-mail: java-dev-help@axis.apache.org


Mime
View raw message