axis-java-dev mailing list archives

Site index · List index
Message view « Date » · « Thread »
Top « Date » · « Thread »
From Apache Jenkins Server <jenk...@builds.apache.org>
Subject Build failed in Jenkins: Axis2-trunk-java-1.6 #788
Date Sat, 10 Mar 2012 01:56:18 GMT
See <https://builds.apache.org/job/Axis2-trunk-java-1.6/788/changes>

Changes:

[sagara] Fixed AXIS2-5264.

------------------------------------------
[...truncated 1770 lines...]
[INFO] 
[INFO] --- maven-jar-plugin:2.2:jar (default-jar) @ axis2-metadata ---
[INFO] Building jar: <https://builds.apache.org/job/Axis2-trunk-java-1.6/ws/axis2/modules/metadata/target/axis2-metadata-1.7.0-SNAPSHOT.jar>
[INFO] [INFO] Installing <https://builds.apache.org/job/Axis2-trunk-java-1.6/ws/axis2/modules/metadata/target/axis2-metadata-1.7.0-SNAPSHOT.jar>
to <https://builds.apache.org/job/Axis2-trunk-java-1.6/ws/.repository/org/apache/axis2/axis2-metadata/1.7.0-SNAPSHOT/axis2-metadata-1.7.0-SNAPSHOT.jar>

[INFO] --- maven-install-plugin:2.2:install (default-install) @ axis2-metadata ---
[INFO] Installing <https://builds.apache.org/job/Axis2-trunk-java-1.6/ws/axis2/modules/metadata/pom.xml>
to <https://builds.apache.org/job/Axis2-trunk-java-1.6/ws/.repository/org/apache/axis2/axis2-metadata/1.7.0-SNAPSHOT/axis2-metadata-1.7.0-SNAPSHOT.pom>
[JENKINS] Archiving <https://builds.apache.org/job/Axis2-trunk-java-1.6/ws/axis2/modules/metadata/pom.xml>
to /home/hudson/hudson/jobs/Axis2-trunk-java-1.6/modules/org.apache.axis2$axis2-metadata/builds/2012-03-10_00-33-18/archive/org.apache.axis2/axis2-metadata/1.7.0-SNAPSHOT/axis2-metadata-1.7.0-SNAPSHOT.pom
[JENKINS] Archiving <https://builds.apache.org/job/Axis2-trunk-java-1.6/ws/axis2/modules/metadata/target/axis2-metadata-1.7.0-SNAPSHOT.jar>
to /home/hudson/hudson/jobs/Axis2-trunk-java-1.6/modules/org.apache.axis2$axis2-metadata/builds/2012-03-10_00-33-18/archive/org.apache.axis2/axis2-metadata/1.7.0-SNAPSHOT/axis2-metadata-1.7.0-SNAPSHOT.jar
[INFO]                                                                         
[INFO] ------------------------------------------------------------------------
[INFO] Building Apache Axis2 - JAXWS 1.7.0-SNAPSHOT
[INFO] ------------------------------------------------------------------------
[INFO] [INFO] Deleting directory <https://builds.apache.org/job/Axis2-trunk-java-1.6/ws/axis2/modules/jaxws/target>

[INFO] --- maven-clean-plugin:2.2:clean (default-clean) @ axis2-jaxws ---
[INFO] 
[INFO] --- maven-remote-resources-plugin:1.1:process (default) @ axis2-jaxws ---
[INFO] [INFO] Configured Artifact: javax.xml.bind:jaxb-api:?:jar
[INFO] Configured Artifact: org.apache.geronimo.specs:geronimo-saaj_1.3_spec:?:jar
[INFO] Configured Artifact: org.apache.geronimo.specs:geronimo-jaxws_2.2_spec:?:jar
[INFO] Copying jaxb-api-2.1.jar to <https://builds.apache.org/job/Axis2-trunk-java-1.6/ws/axis2/modules/jaxws/target/endorsed/jaxb-api.jar>

[INFO] Copying geronimo-saaj_1.3_spec-1.0.1.jar to <https://builds.apache.org/job/Axis2-trunk-java-1.6/ws/axis2/modules/jaxws/target/endorsed/geronimo-saaj_1.3_spec.jar>
[INFO] --- maven-dependency-plugin:2.0:copy (default) @ axis2-jaxws ---[INFO] Copying geronimo-jaxws_2.2_spec-1.0.jar
to <https://builds.apache.org/job/Axis2-trunk-java-1.6/ws/axis2/modules/jaxws/target/endorsed/geronimo-jaxws_2.2_spec.jar>

[INFO] [INFO] Using 'UTF-8' encoding to copy filtered resources.
[INFO] skip non existing resourceDirectory <https://builds.apache.org/job/Axis2-trunk-java-1.6/ws/axis2/modules/jaxws/conf>

[INFO] --- maven-resources-plugin:2.4.2:resources (default-resources) @ axis2-jaxws ---
[INFO] Copying 0 resource
[INFO] Copying 1 resource
[INFO] Copying 2 resources
[INFO] 
[INFO] --- maven-compiler-plugin:2.3.1:compile (default-compile) @ axis2-jaxws ---
[INFO] Compiling 282 source files to <https://builds.apache.org/job/Axis2-trunk-java-1.6/ws/axis2/modules/jaxws/target/classes>
[INFO] 
[INFO] [INFO] Executing tasks
    [mkdir] Created dir: <https://builds.apache.org/job/Axis2-trunk-java-1.6/ws/axis2/modules/jaxws/target/schema>
    [mkdir] Created dir: <https://builds.apache.org/job/Axis2-trunk-java-1.6/ws/axis2/modules/jaxws/target/schema/src>
    [mkdir] Created dir: <https://builds.apache.org/job/Axis2-trunk-java-1.6/ws/axis2/modules/jaxws/target/schema/classes>
     [echo] Generating JAX-B classes from XSDs
     [echo] Generating java from echo.xsd
--- maven-antrun-plugin:1.2:run (gen-ts) @ axis2-jaxws ---
     [echo] Generating java from stock1.xsd
     [echo] Generating java from stock2.xsd
     [echo] Generating java from samplemtom.xsd
     [echo] Generating java from ProxyDocLitWrapped.wsdl
     [echo] Generating java from AddNumbers.wsdl
[INFO] Executed tasks
[INFO] [INFO] Using 'UTF-8' encoding to copy filtered resources.

[INFO] --- maven-resources-plugin:2.4.2:testResources (default-testResources) @ axis2-jaxws
---
[INFO] Copying 7 resources
[INFO] Copying 61 resources
[INFO] Copying 2 resources
[INFO] [INFO] Test Source directory: <https://builds.apache.org/job/Axis2-trunk-java-1.6/ws/axis2/modules/jaxws/target/schema/src>
added.

[INFO] --- build-helper-maven-plugin:1.4:add-test-source (add-test-source) @ axis2-jaxws ---
[INFO] 
[INFO] --- maven-compiler-plugin:2.3.1:testCompile (default-testCompile) @ axis2-jaxws ---
[INFO] Compiling 184 source files to <https://builds.apache.org/job/Axis2-trunk-java-1.6/ws/axis2/modules/jaxws/target/test-classes>
[INFO] 
[INFO] [INFO] Executing tasks
--- maven-antrun-plugin:1.2:run (build-repo) @ axis2-jaxws ---

build-repo:
    [mkdir] Created dir: <https://builds.apache.org/job/Axis2-trunk-java-1.6/ws/axis2/modules/jaxws/target/repository>
    [mkdir] Created dir: <https://builds.apache.org/job/Axis2-trunk-java-1.6/ws/axis2/modules/jaxws/target/repository/conf>
    [mkdir] Created dir: <https://builds.apache.org/job/Axis2-trunk-java-1.6/ws/axis2/modules/jaxws/target/repository/services>
    [mkdir] Created dir: <https://builds.apache.org/job/Axis2-trunk-java-1.6/ws/axis2/modules/jaxws/target/repository/modules>
     [copy] Copying 1 file to <https://builds.apache.org/job/Axis2-trunk-java-1.6/ws/axis2/modules/jaxws/target/repository/modules>
     [copy] Copying 1 file to <https://builds.apache.org/job/Axis2-trunk-java-1.6/ws/axis2/modules/jaxws/target/repository/conf>
[INFO] Executed tasks
[INFO] [INFO] Surefire report directory: <https://builds.apache.org/job/Axis2-trunk-java-1.6/ws/axis2/modules/jaxws/target/surefire-reports>

[INFO] --- maven-surefire-plugin:2.4.3:test (default-test) @ axis2-jaxws ---

-------------------------------------------------------
 T E S T S
-------------------------------------------------------
Running org.apache.axis2.jaxws.server.dispatcher.JavaDispatcherLoggingTest
Tests run: 1, Failures: 0, Errors: 0, Skipped: 0, Time elapsed: 0.019 sec
Running org.apache.axis2.jaxws.wsdl.schemareader.SchemaReaderTests
Tests run: 1, Failures: 0, Errors: 0, Skipped: 0, Time elapsed: 0.116 sec
Running org.apache.axis2.jaxws.utility.JavaUtilsTests
Tests run: 2, Failures: 0, Errors: 0, Skipped: 0, Time elapsed: 0.003 sec
Running org.apache.axis2.jaxws.client.proxy.ProxyAddressingMetadataTest
Tests run: 3, Failures: 0, Errors: 0, Skipped: 0, Time elapsed: 0.712 sec
Running org.apache.axis2.jaxws.i18n.JaxwsMessageBundleTests
Tests run: 1, Failures: 0, Errors: 0, Skipped: 0, Time elapsed: 0.009 sec
Running org.apache.axis2.jaxws.jaxb.wrapper.WrapperToolTest
Tests run: 4, Failures: 0, Errors: 0, Skipped: 0, Time elapsed: 0.009 sec
Running org.apache.axis2.jaxws.handler.HandlerPrePostInvokerTests
Tests run: 3, Failures: 0, Errors: 0, Skipped: 0, Time elapsed: 0.059 sec
Running org.apache.axis2.jaxws.addressing.util.ReferenceParameterListTests
Tests run: 1, Failures: 0, Errors: 0, Skipped: 0, Time elapsed: 0.008 sec
Running org.apache.axis2.jaxws.handler.context.SOAPMessageContextTests
Tests run: 2, Failures: 0, Errors: 0, Skipped: 0, Time elapsed: 0.032 sec
Running org.apache.axis2.jaxws.description.PortSelectionTests
Tests run: 3, Failures: 0, Errors: 0, Skipped: 0, Time elapsed: 0.132 sec
Running org.apache.axis2.jaxws.exception.ExceptionFactoryTests
Tests run: 4, Failures: 0, Errors: 0, Skipped: 0, Time elapsed: 0.003 sec
Running org.apache.axis2.jaxws.message.databinding.JAXBUtilsTests
Tests run: 1, Failures: 0, Errors: 0, Skipped: 0, Time elapsed: 0.028 sec
Running org.apache.axis2.jaxws.context.listener.CompositeInputStreamTests
Tests run: 2, Failures: 0, Errors: 0, Skipped: 0, Time elapsed: 0.003 sec
Running org.apache.axis2.jaxws.misc.XMLFaultTest
Tests run: 3, Failures: 0, Errors: 0, Skipped: 0, Time elapsed: 0.03 sec
Running org.apache.axis2.jaxws.message.MessagePersistanceTests
Tests run: 4, Failures: 0, Errors: 0, Skipped: 0, Time elapsed: 0.272 sec
Running org.apache.axis2.jaxws.client.dispatch.DispatchSharedSessionTest
Tests run: 3, Failures: 0, Errors: 0, Skipped: 0, Time elapsed: 0.107 sec
Running org.apache.axis2.jaxws.spi.ClientMetadataServiceRefNameTests
Tests run: 6, Failures: 0, Errors: 0, Skipped: 0, Time elapsed: 0.135 sec
Running org.apache.axis2.jaxws.spi.ClientMetadataMTOMFeatureTests
Tests run: 11, Failures: 0, Errors: 0, Skipped: 0, Time elapsed: 0.223 sec
Running org.apache.axis2.jaxws.core.MessageContextTests
Tests run: 1, Failures: 0, Errors: 0, Skipped: 0, Time elapsed: 0.001 sec
Running org.apache.axis2.jaxws.utility.ClassUtilsTests
Tests run: 4, Failures: 0, Errors: 0, Skipped: 0, Time elapsed: 0.003 sec
Running org.apache.axis2.jaxws.client.proxy.ProxyMTOMFeatureTest
Tests run: 4, Failures: 0, Errors: 0, Skipped: 0, Time elapsed: 0.063 sec
Running org.apache.axis2.jaxws.client.dispatch.DispatchAddressingFeatureTest
Tests run: 5, Failures: 0, Errors: 0, Skipped: 0, Time elapsed: 0.087 sec
Running org.apache.axis2.jaxws.description.GetDescFromBindingProviderTests
Tests run: 6, Failures: 0, Errors: 0, Skipped: 0, Time elapsed: 0.094 sec
Running org.apache.axis2.jaxws.client.PortDeserializationTests
Tests run: 4, Failures: 0, Errors: 0, Skipped: 0, Time elapsed: 0.053 sec
Running org.apache.axis2.jaxws.misc.NS2PkgTest
Tests run: 4, Failures: 0, Errors: 0, Skipped: 0, Time elapsed: 0.005 sec
Running org.apache.axis2.jaxws.providerapi.GenericOperationProviderTest
Tests run: 2, Failures: 0, Errors: 0, Skipped: 0, Time elapsed: 0.038 sec
Running org.apache.axis2.jaxws.message.JAXBDSContextTests
Tests run: 2, Failures: 0, Errors: 0, Skipped: 0, Time elapsed: 0.008 sec
Running org.apache.axis2.jaxws.spi.BindingProviderTests
Tests run: 2, Failures: 0, Errors: 0, Skipped: 0, Time elapsed: 0.025 sec
Running org.apache.axis2.jaxws.description.ClientAnnotationTests
Tests run: 1, Failures: 0, Errors: 0, Skipped: 0, Time elapsed: 0.045 sec
Running org.apache.axis2.jaxws.description.WSDLTests
Tests run: 4, Failures: 0, Errors: 0, Skipped: 0, Time elapsed: 0.043 sec
Running org.apache.axis2.jaxws.endpoint.BasicEndpointTests
Build timed out (after 83 minutes). Marking the build as failed.
killed.
[INFO] ------------------------------------------------------------------------
[INFO] Reactor Summary:
[INFO] 
[INFO] Apache Axis2 - Parent ............................. SUCCESS [6.007s]
[INFO] Apache Axis2 - Resource bundle .................... SUCCESS [1.589s]
[INFO] Apache Axis2 - Kernel ............................. SUCCESS [19.697s]
[INFO] Apache Axis2 - Data Binding ....................... SUCCESS [6.576s]
[INFO] Apache Axis2 - Transport - Local .................. SUCCESS [3.239s]
[INFO] Apache Axis2 - Transport - HTTP ................... SUCCESS [4.354s]
[INFO] Apache Axis2 - Code Generation .................... SUCCESS [6.459s]
[INFO] Apache Axis2 - ADB Codegen ........................ SUCCESS [17.735s]
[INFO] Apache Axis2 - Addressing ......................... SUCCESS [3.753s]
[INFO] Apache Axis2 - Java2WSDL .......................... SUCCESS [7.924s]
[INFO] Apache Axis2 - tool - Repository Maven Plugin ..... SUCCESS [2.893s]
[INFO] Apache Axis2 - Fast Infoset ....................... SUCCESS [9.717s]
[INFO] Apache Axis2 - Clustering ......................... SUCCESS [1:18.214s]
[INFO] Apache Axis2 - Scripting .......................... SUCCESS [2.733s]
[INFO] Apache Axis2 - JAXB-RI Data Binding ............... SUCCESS [6.770s]
[INFO] Apache Axis2 - SAAJ ............................... SUCCESS [14.117s]
[INFO] Apache Axis2 - Metadata ........................... SUCCESS [11.224s]
[INFO] Apache Axis2 - JAXWS .............................. FAILURE [1:19:24.184s]
[INFO] Apache Axis2 - Test Utilities ..................... SKIPPED
[INFO] Apache Axis2 - XMLBeans Data Binding .............. SKIPPED
[INFO] Apache Axis2 - tool - WSDL2Code Maven Plugin ...... SKIPPED
[INFO] Apache Axis2 - JAXWS Integration Tests ............ SKIPPED
[INFO] Apache Axis2 - JiBX Data Binding .................. SKIPPED
[INFO] Apache Axis2 - JSON ............................... SKIPPED
[INFO] Apache Axis2 - MTOM Policy ........................ SKIPPED
[INFO] Apache Axis2 - spring ............................. SKIPPED
[INFO] Apache Axis2 - OSGi Integration ................... SKIPPED
[INFO] Apache Axis2 - Integration ........................ SKIPPED
[INFO] Apache Axis2 - MEX ................................ SKIPPED
[INFO] Apache Axis2 - MTOM Policy module ................. SKIPPED
[INFO] Apache Axis2 - Ping ............................... SKIPPED
[INFO] Apache Axis2 - Version Service .................... SKIPPED
[INFO] Apache Axis2 - SOAP Monitor Servlet ............... SKIPPED
[INFO] Apache Axis2 - SOAP Monitor Module ................ SKIPPED
[INFO] Apache Axis2 - tool - AAR Maven Plugin ............ SKIPPED
[INFO] Apache Axis2 - tool - Ant Plugin .................. SKIPPED
[INFO] Apache Axis2 - tool - Eclipse Codegen Plugin ...... SKIPPED
[INFO] Apache Axis2 - tool - Eclipse service Plugin ...... SKIPPED
[INFO] Apache Axis2 - tool - Intellij IDEA Plugin ........ SKIPPED
[INFO] Apache Axis2 - tool - Java2WSDL Maven Plugin ...... SKIPPED
[INFO] Apache Axis2 - tool - MAR Maven Plugin ............ SKIPPED
[INFO] Apache Axis2 Simple HTTP server Maven Plugin ...... SKIPPED
[INFO] Axis2 quickstart archetype ........................ SKIPPED
[INFO] Axis2 quickstart-web archetype .................... SKIPPED
[INFO] Apache Axis2 - CORBA .............................. SKIPPED
[INFO] Apache Axis2 - JAXWS (mar) ........................ SKIPPED
[INFO] Apache Axis2 - Web Application module ............. SKIPPED
[INFO] Apache Axis2 - Root ............................... SKIPPED
[INFO] ------------------------------------------------------------------------
[INFO] BUILD FAILURE
[INFO] ------------------------------------------------------------------------
[INFO] Total time: 1:22:55.112s
[INFO] Finished at: Sat Mar 10 01:56:16 UTC 2012
[INFO] channel stopped
[locks-and-latches] Releasing all the locks
[locks-and-latches] All the locks released
Final Memory: 75M/648M
[INFO] ------------------------------------------------------------------------
mavenExecutionResult exceptions not empty
message : Internal error: java.lang.IllegalStateException: Unable to call setExecutedMojos.
Invalid object ID 27
cause : Unable to call setExecutedMojos. Invalid object ID 27
Stack trace : 
org.apache.maven.InternalErrorException: Internal error: java.lang.IllegalStateException:
Unable to call setExecutedMojos. Invalid object ID 27
	at org.apache.maven.lifecycle.internal.BuilderCommon.handleBuildError(BuilderCommon.java:128)
	at org.apache.maven.lifecycle.internal.LifecycleModuleBuilder.buildProject(LifecycleModuleBuilder.java:95)
	at org.apache.maven.lifecycle.internal.LifecycleModuleBuilder.buildProject(LifecycleModuleBuilder.java:59)
	at org.apache.maven.lifecycle.internal.LifecycleStarter.singleThreadedBuild(LifecycleStarter.java:183)
	at org.apache.maven.lifecycle.internal.LifecycleStarter.execute(LifecycleStarter.java:161)
	at org.apache.maven.DefaultMaven.doExecute(DefaultMaven.java:319)
	at org.apache.maven.DefaultMaven.execute(DefaultMaven.java:156)
	at org.jvnet.hudson.maven3.launcher.Maven3Launcher.main(Maven3Launcher.java:79)
	at sun.reflect.NativeMethodAccessorImpl.invoke0(Native Method)
	at sun.reflect.NativeMethodAccessorImpl.invoke(NativeMethodAccessorImpl.java:39)
	at sun.reflect.DelegatingMethodAccessorImpl.invoke(DelegatingMethodAccessorImpl.java:25)
	at java.lang.reflect.Method.invoke(Method.java:597)
	at org.codehaus.plexus.classworlds.launcher.Launcher.launchStandard(Launcher.java:329)
	at org.codehaus.plexus.classworlds.launcher.Launcher.launch(Launcher.java:239)
	at org.jvnet.hudson.maven3.agent.Maven3Main.launch(Maven3Main.java:158)
	at hudson.maven.Maven3Builder.call(Maven3Builder.java:104)
	at hudson.maven.Maven3Builder.call(Maven3Builder.java:70)
	at hudson.remoting.UserRequest.perform(UserRequest.java:118)
	at hudson.remoting.UserRequest.perform(UserRequest.java:48)
	at hudson.remoting.Request$2.run(Request.java:287)
	at hudson.remoting.InterceptingExecutorService$1.call(InterceptingExecutorService.java:72)
	at java.util.concurrent.FutureTask$Sync.innerRun(FutureTask.java:303)
	at java.util.concurrent.FutureTask.run(FutureTask.java:138)
	at java.util.concurrent.ThreadPoolExecutor$Worker.runTask(ThreadPoolExecutor.java:886)
	at java.util.concurrent.ThreadPoolExecutor$Worker.run(ThreadPoolExecutor.java:908)
	at java.lang.Thread.run(Thread.java:662)
Caused by: java.lang.IllegalStateException: Unable to call setExecutedMojos. Invalid object
ID 27
	at hudson.remoting.RemoteInvocationHandler$RPCRequest.perform(RemoteInvocationHandler.java:268)
	at hudson.remoting.RemoteInvocationHandler$RPCRequest.call(RemoteInvocationHandler.java:255)
	at hudson.remoting.RemoteInvocationHandler$RPCRequest.call(RemoteInvocationHandler.java:215)
	at hudson.remoting.UserRequest.perform(UserRequest.java:118)
	at hudson.remoting.UserRequest.perform(UserRequest.java:48)
	at hudson.remoting.Request$2.run(Request.java:287)
	at hudson.remoting.InterceptingExecutorService$1.call(InterceptingExecutorService.java:72)
	at java.util.concurrent.FutureTask$Sync.innerRun(FutureTask.java:334)
	at java.util.concurrent.FutureTask.run(FutureTask.java:166)
	at java.util.concurrent.ThreadPoolExecutor.runWorker(ThreadPoolExecutor.java:1110)
	at java.util.concurrent.ThreadPoolExecutor$Worker.run(ThreadPoolExecutor.java:603)
	at java.lang.Thread.run(Thread.java:722)


---------------------------------------------------------------------
To unsubscribe, e-mail: java-dev-unsubscribe@axis.apache.org
For additional commands, e-mail: java-dev-help@axis.apache.org


Mime
View raw message