axis-java-dev mailing list archives

Site index · List index
Message view « Date » · « Thread »
Top « Date » · « Thread »
From Apache Jenkins Server <jenk...@builds.apache.org>
Subject Build failed in Jenkins: axis2-1.6 #287
Date Mon, 09 Apr 2012 16:39:58 GMT
See <https://builds.apache.org/job/axis2-1.6/287/changes>

Changes:

[veithen] Switched the Axis2 1.6 branch to Axiom 1.2.13.

------------------------------------------
[...truncated 1422 lines...]
Generating <https://builds.apache.org/job/axis2-1.6/ws/axis2/modules/kernel/target/apidocs/org/apache/axis2/deployment/resolver/class-use//AARFileBasedURIResolver.html...>
Generating <https://builds.apache.org/job/axis2-1.6/ws/axis2/modules/kernel/target/apidocs/org/apache/axis2/deployment/repository/util/class-use//ArchiveReader.html...>
Generating <https://builds.apache.org/job/axis2-1.6/ws/axis2/modules/kernel/target/apidocs/org/apache/axis2/deployment/repository/util/class-use//DeploymentFileData.html...>
Generating <https://builds.apache.org/job/axis2-1.6/ws/axis2/modules/kernel/target/apidocs/org/apache/axis2/deployment/repository/util/class-use//WSInfoList.html...>
Generating <https://builds.apache.org/job/axis2-1.6/ws/axis2/modules/kernel/target/apidocs/org/apache/axis2/deployment/repository/util/class-use//WSInfo.html...>
Generating <https://builds.apache.org/job/axis2-1.6/ws/axis2/modules/kernel/target/apidocs/org/apache/axis2/deployment/util/class-use//ExcludeInfo.html...>
Generating <https://builds.apache.org/job/axis2-1.6/ws/axis2/modules/kernel/target/apidocs/org/apache/axis2/deployment/util/class-use//TempFileManager.html...>
Generating <https://builds.apache.org/job/axis2-1.6/ws/axis2/modules/kernel/target/apidocs/org/apache/axis2/deployment/util/class-use//BeanExcludeInfo.html...>
Generating <https://builds.apache.org/job/axis2-1.6/ws/axis2/modules/kernel/target/apidocs/org/apache/axis2/deployment/util/class-use//PhasesInfo.html...>
Generating <https://builds.apache.org/job/axis2-1.6/ws/axis2/modules/kernel/target/apidocs/org/apache/axis2/deployment/util/class-use//Utils.html...>
Generating <https://builds.apache.org/job/axis2-1.6/ws/axis2/modules/kernel/target/apidocs/org/apache/axis2//package-use.html...>
Generating <https://builds.apache.org/job/axis2-1.6/ws/axis2/modules/kernel/target/apidocs/org/apache/axis2/addressing//package-use.html...>
Generating <https://builds.apache.org/job/axis2-1.6/ws/axis2/modules/kernel/target/apidocs/org/apache/axis2/addressing/i18n//package-use.html...>
Generating <https://builds.apache.org/job/axis2-1.6/ws/axis2/modules/kernel/target/apidocs/org/apache/axis2/addressing/metadata//package-use.html...>
Generating <https://builds.apache.org/job/axis2-1.6/ws/axis2/modules/kernel/target/apidocs/org/apache/axis2/addressing/wsdl//package-use.html...>
Generating <https://builds.apache.org/job/axis2-1.6/ws/axis2/modules/kernel/target/apidocs/org/apache/axis2/builder//package-use.html...>
Generating <https://builds.apache.org/job/axis2-1.6/ws/axis2/modules/kernel/target/apidocs/org/apache/axis2/builder/unknowncontent//package-use.html...>
Generating <https://builds.apache.org/job/axis2-1.6/ws/axis2/modules/kernel/target/apidocs/org/apache/axis2/classloader//package-use.html...>
Generating <https://builds.apache.org/job/axis2-1.6/ws/axis2/modules/kernel/target/apidocs/org/apache/axis2/client//package-use.html...>
Generating <https://builds.apache.org/job/axis2-1.6/ws/axis2/modules/kernel/target/apidocs/org/apache/axis2/client/async//package-use.html...>
Generating <https://builds.apache.org/job/axis2-1.6/ws/axis2/modules/kernel/target/apidocs/org/apache/axis2/clustering//package-use.html...>
Generating <https://builds.apache.org/job/axis2-1.6/ws/axis2/modules/kernel/target/apidocs/org/apache/axis2/clustering/management//package-use.html...>
Generating <https://builds.apache.org/job/axis2-1.6/ws/axis2/modules/kernel/target/apidocs/org/apache/axis2/clustering/state//package-use.html...>
Generating <https://builds.apache.org/job/axis2-1.6/ws/axis2/modules/kernel/target/apidocs/org/apache/axis2/context//package-use.html...>
Generating <https://builds.apache.org/job/axis2-1.6/ws/axis2/modules/kernel/target/apidocs/org/apache/axis2/context/externalize//package-use.html...>
Generating <https://builds.apache.org/job/axis2-1.6/ws/axis2/modules/kernel/target/apidocs/org/apache/axis2/dataretrieval//package-use.html...>
Generating <https://builds.apache.org/job/axis2-1.6/ws/axis2/modules/kernel/target/apidocs/org/apache/axis2/dataretrieval/client//package-use.html...>
Generating <https://builds.apache.org/job/axis2-1.6/ws/axis2/modules/kernel/target/apidocs/org/apache/axis2/deployment//package-use.html...>
Generating <https://builds.apache.org/job/axis2-1.6/ws/axis2/modules/kernel/target/apidocs/org/apache/axis2/deployment/repository/util//package-use.html...>
Generating <https://builds.apache.org/job/axis2-1.6/ws/axis2/modules/kernel/target/apidocs/org/apache/axis2/deployment/resolver//package-use.html...>
Generating <https://builds.apache.org/job/axis2-1.6/ws/axis2/modules/kernel/target/apidocs/org/apache/axis2/deployment/scheduler//package-use.html...>
Generating <https://builds.apache.org/job/axis2-1.6/ws/axis2/modules/kernel/target/apidocs/org/apache/axis2/deployment/util//package-use.html...>
Generating <https://builds.apache.org/job/axis2-1.6/ws/axis2/modules/kernel/target/apidocs/org/apache/axis2/description//package-use.html...>
Generating <https://builds.apache.org/job/axis2-1.6/ws/axis2/modules/kernel/target/apidocs/org/apache/axis2/description/java2wsdl//package-use.html...>
Generating <https://builds.apache.org/job/axis2-1.6/ws/axis2/modules/kernel/target/apidocs/org/apache/axis2/description/java2wsdl/bytecode//package-use.html...>
Generating <https://builds.apache.org/job/axis2-1.6/ws/axis2/modules/kernel/target/apidocs/org/apache/axis2/dispatchers//package-use.html...>
Generating <https://builds.apache.org/job/axis2-1.6/ws/axis2/modules/kernel/target/apidocs/org/apache/axis2/engine//package-use.html...>
Generating <https://builds.apache.org/job/axis2-1.6/ws/axis2/modules/kernel/target/apidocs/org/apache/axis2/handlers//package-use.html...>
Generating <https://builds.apache.org/job/axis2-1.6/ws/axis2/modules/kernel/target/apidocs/org/apache/axis2/i18n//package-use.html...>
Generating <https://builds.apache.org/job/axis2-1.6/ws/axis2/modules/kernel/target/apidocs/org/apache/axis2/java/security//package-use.html...>
Generating <https://builds.apache.org/job/axis2-1.6/ws/axis2/modules/kernel/target/apidocs/org/apache/axis2/jaxrs//package-use.html...>
Generating <https://builds.apache.org/job/axis2-1.6/ws/axis2/modules/kernel/target/apidocs/org/apache/axis2/jsr181//package-use.html...>
Generating <https://builds.apache.org/job/axis2-1.6/ws/axis2/modules/kernel/target/apidocs/org/apache/axis2/modules//package-use.html...>
Generating <https://builds.apache.org/job/axis2-1.6/ws/axis2/modules/kernel/target/apidocs/org/apache/axis2/namespace//package-use.html...>
Generating <https://builds.apache.org/job/axis2-1.6/ws/axis2/modules/kernel/target/apidocs/org/apache/axis2/phaseresolver//package-use.html...>
Generating <https://builds.apache.org/job/axis2-1.6/ws/axis2/modules/kernel/target/apidocs/org/apache/axis2/receivers//package-use.html...>
Generating <https://builds.apache.org/job/axis2-1.6/ws/axis2/modules/kernel/target/apidocs/org/apache/axis2/service//package-use.html...>
Generating <https://builds.apache.org/job/axis2-1.6/ws/axis2/modules/kernel/target/apidocs/org/apache/axis2/transaction//package-use.html...>
Generating <https://builds.apache.org/job/axis2-1.6/ws/axis2/modules/kernel/target/apidocs/org/apache/axis2/transport//package-use.html...>
Generating <https://builds.apache.org/job/axis2-1.6/ws/axis2/modules/kernel/target/apidocs/org/apache/axis2/transport/http//package-use.html...>
Generating <https://builds.apache.org/job/axis2-1.6/ws/axis2/modules/kernel/target/apidocs/org/apache/axis2/transport/http/util//package-use.html...>
Generating <https://builds.apache.org/job/axis2-1.6/ws/axis2/modules/kernel/target/apidocs/org/apache/axis2/util//package-use.html...>
Generating <https://builds.apache.org/job/axis2-1.6/ws/axis2/modules/kernel/target/apidocs/org/apache/axis2/util/threadpool//package-use.html...>
Generating <https://builds.apache.org/job/axis2-1.6/ws/axis2/modules/kernel/target/apidocs/org/apache/axis2/wsdl//package-use.html...>
Generating <https://builds.apache.org/job/axis2-1.6/ws/axis2/modules/kernel/target/apidocs/org/apache/axis2/wsdl/util//package-use.html...>
Building index for all the packages and classes...
Generating <https://builds.apache.org/job/axis2-1.6/ws/axis2/modules/kernel/target/apidocs/overview-tree.html...>
Generating <https://builds.apache.org/job/axis2-1.6/ws/axis2/modules/kernel/target/apidocs/index-all.html...>
Generating <https://builds.apache.org/job/axis2-1.6/ws/axis2/modules/kernel/target/apidocs/deprecated-list.html...>
Building index for all classes...
Generating <https://builds.apache.org/job/axis2-1.6/ws/axis2/modules/kernel/target/apidocs/allclasses-frame.html...>
Generating <https://builds.apache.org/job/axis2-1.6/ws/axis2/modules/kernel/target/apidocs/allclasses-noframe.html...>
Generating <https://builds.apache.org/job/axis2-1.6/ws/axis2/modules/kernel/target/apidocs/index.html...>
Generating <https://builds.apache.org/job/axis2-1.6/ws/axis2/modules/kernel/target/apidocs/overview-summary.html...>
Generating <https://builds.apache.org/job/axis2-1.6/ws/axis2/modules/kernel/target/apidocs/help-doc.html...>
Generating <https://builds.apache.org/job/axis2-1.6/ws/axis2/modules/kernel/target/apidocs/stylesheet.css...>
96 warnings
[WARNING] Javadoc Warnings
[WARNING] <https://builds.apache.org/job/axis2-1.6/ws/axis2/modules/kernel/src/org/apache/axis2/client/Options.java>:1087:
warning - @param argument "out" is not a parameter name.
[WARNING] <https://builds.apache.org/job/axis2-1.6/ws/axis2/modules/kernel/src/org/apache/axis2/client/Options.java>:1211:
warning - @param argument "in" is not a parameter name.
[WARNING] <https://builds.apache.org/job/axis2-1.6/ws/axis2/modules/kernel/src/org/apache/axis2/engine/AxisConfiguration.java>:1338:
warning - @param argument "dialect-" is not a parameter name.
[WARNING] <https://builds.apache.org/job/axis2-1.6/ws/axis2/modules/kernel/src/org/apache/axis2/engine/AxisConfiguration.java>:1350:
warning - @param argument "dialect-" is not a parameter name.
[WARNING] <https://builds.apache.org/job/axis2-1.6/ws/axis2/modules/kernel/src/org/apache/axis2/engine/ObjectSupplier.java>:34:
warning - @return tag has no arguments.
[WARNING] <https://builds.apache.org/job/axis2-1.6/ws/axis2/modules/kernel/src/org/apache/axis2/handlers/AbstractTemplatedHandler.java>:67:
warning - Tag @link: reference not found: InvocationResponse#CONTINUE
[WARNING] <https://builds.apache.org/job/axis2-1.6/ws/axis2/modules/kernel/src/org/apache/axis2/handlers/AbstractTemplatedHandler.java>:67:
warning - Tag @link: reference not found: InvocationResponse#ABORT
[WARNING] <https://builds.apache.org/job/axis2-1.6/ws/axis2/modules/kernel/src/org/apache/axis2/handlers/AbstractTemplatedHandler.java>:67:
warning - Tag @link: reference not found: InvocationResponse#SUSPEND
[WARNING] <https://builds.apache.org/job/axis2-1.6/ws/axis2/modules/kernel/src/org/apache/axis2/addressing/AddressingFaultsHelper.java>:56:
warning - @return tag has no arguments.
[WARNING] <https://builds.apache.org/job/axis2-1.6/ws/axis2/modules/kernel/src/org/apache/axis2/addressing/EndpointReference.java>:453:
warning - Tag @link: can't find toOM(EndpointReference, QName, String) in org.apache.axis2.addressing.EndpointReferenceHelper
[WARNING] <https://builds.apache.org/job/axis2-1.6/ws/axis2/modules/kernel/src/org/apache/axis2/addressing/EndpointReferenceHelper.java>:196:
warning - @return tag has no arguments.
[WARNING] <https://builds.apache.org/job/axis2-1.6/ws/axis2/modules/kernel/src/org/apache/axis2/addressing/RelatesTo.java>:114:
warning - Tag @link: reference not found: AddressingConstants.Final.WSA_DEFAULT_RELATIONSHIP_TYPE
[WARNING] <https://builds.apache.org/job/axis2-1.6/ws/axis2/modules/kernel/src/org/apache/axis2/addressing/RelatesTo.java>:175:
warning - @param argument "out" is not a parameter name.
[WARNING] <https://builds.apache.org/job/axis2-1.6/ws/axis2/modules/kernel/src/org/apache/axis2/addressing/RelatesTo.java>:227:
warning - @param argument "in" is not a parameter name.
[WARNING] <https://builds.apache.org/job/axis2-1.6/ws/axis2/modules/kernel/src/org/apache/axis2/wsdl/WSDLUtil.java>:101:
warning - @return tag has no arguments.
[WARNING] <https://builds.apache.org/job/axis2-1.6/ws/axis2/modules/kernel/src/org/apache/axis2/dataretrieval/Data.java>:58:
warning - @return tag has no arguments.
[WARNING] <https://builds.apache.org/job/axis2-1.6/ws/axis2/modules/kernel/src/org/apache/axis2/transport/RequestResponseTransport.java>:84:
warning - @return tag has no arguments.
[WARNING] <https://builds.apache.org/job/axis2-1.6/ws/axis2/modules/kernel/src/org/apache/axis2/transport/http/ApplicationXMLFormatter.java>:63:
warning - @return tag has no arguments.
[WARNING] <https://builds.apache.org/job/axis2-1.6/ws/axis2/modules/kernel/src/org/apache/axis2/transport/http/MultipartFormDataFormatter.java>:81:
warning - @@@@-@@-@@ is an unknown tag.
[WARNING] <https://builds.apache.org/job/axis2-1.6/ws/axis2/modules/kernel/src/org/apache/axis2/transport/http/util/QueryStringParser.java>:84:
warning - @return tag has no arguments.
[WARNING] <https://builds.apache.org/job/axis2-1.6/ws/axis2/modules/kernel/src/org/apache/axis2/description/AxisMessage.java>:183:
warning - @return tag has no arguments.
[WARNING] <https://builds.apache.org/job/axis2-1.6/ws/axis2/modules/kernel/src/org/apache/axis2/description/AxisService.java>:1813:
warning - @return tag has no arguments.
[WARNING] <https://builds.apache.org/job/axis2-1.6/ws/axis2/modules/kernel/src/org/apache/axis2/description/AxisService.java>:2126:
warning - @return tag has no arguments.
[WARNING] <https://builds.apache.org/job/axis2-1.6/ws/axis2/modules/kernel/src/org/apache/axis2/description/AxisService.java>:1422:
warning - @return tag has no arguments.
[WARNING] <https://builds.apache.org/job/axis2-1.6/ws/axis2/modules/kernel/src/org/apache/axis2/description/AxisService.java>:3016:
warning - @param argument "dialect-" is not a parameter name.
[WARNING] <https://builds.apache.org/job/axis2-1.6/ws/axis2/modules/kernel/src/org/apache/axis2/description/Parameter.java>:271:
warning - @param argument "out" is not a parameter name.
[WARNING] <https://builds.apache.org/job/axis2-1.6/ws/axis2/modules/kernel/src/org/apache/axis2/description/Parameter.java>:329:
warning - @param argument "in" is not a parameter name.
[WARNING] <https://builds.apache.org/job/axis2-1.6/ws/axis2/modules/kernel/src/org/apache/axis2/description/ParameterIncludeImpl.java>:255:
warning - @param argument "out" is not a parameter name.
[WARNING] <https://builds.apache.org/job/axis2-1.6/ws/axis2/modules/kernel/src/org/apache/axis2/description/ParameterIncludeImpl.java>:289:
warning - @param argument "in" is not a parameter name.
[WARNING] <https://builds.apache.org/job/axis2-1.6/ws/axis2/modules/kernel/src/org/apache/axis2/description/WSDL11ToAxisServiceBuilder.java>:266:
warning - Tag @see: reference not found: setCustomWSDLResolver
[WARNING] <https://builds.apache.org/job/axis2-1.6/ws/axis2/modules/kernel/src/org/apache/axis2/description/WSDLToAxisServiceBuilder.java>:256:
warning - @return tag has no arguments.
[WARNING] <https://builds.apache.org/job/axis2-1.6/ws/axis2/modules/kernel/src/org/apache/axis2/dispatchers/AddressingBasedDispatcher.java>:71:
warning - @noinspection is an unknown tag.
[WARNING] <https://builds.apache.org/job/axis2-1.6/ws/axis2/modules/kernel/src/org/apache/axis2/classloader/JarFileClassLoader.java>:178:
warning - @inheritDoc used but internalfindResources(String) does not override or implement
any method.
[WARNING] <https://builds.apache.org/job/axis2-1.6/ws/axis2/modules/kernel/src/org/apache/axis2/classloader/JarFileClassLoader.java>:178:
warning - @inheritDoc used but internalfindResources(String) does not override or implement
any method.
[WARNING] <https://builds.apache.org/job/axis2-1.6/ws/axis2/modules/kernel/src/org/apache/axis2/context/externalize/ActivateUtils.java>:557:
warning - @param argument "handlerClassName" is not a parameter name.
[WARNING] <https://builds.apache.org/job/axis2-1.6/ws/axis2/modules/kernel/src/org/apache/axis2/context/externalize/MessageExternalizeUtils.java>:182:
warning - @return tag has no arguments.
[WARNING] <https://builds.apache.org/job/axis2-1.6/ws/axis2/modules/kernel/src/org/apache/axis2/context/externalize/SafeObjectInputStream.java>:43:
warning - Tag @see: reference not found: SafeObjectInput
[WARNING] <https://builds.apache.org/job/axis2-1.6/ws/axis2/modules/kernel/src/org/apache/axis2/context/externalize/SafeObjectInputStream.java>:61:
warning - @return tag has no arguments.
[WARNING] <https://builds.apache.org/job/axis2-1.6/ws/axis2/modules/kernel/src/org/apache/axis2/context/externalize/SafeObjectInputStream.java>:228:
warning - Tag @see: missing '#': "SafeObjectInputStream.writeList()"
[WARNING] <https://builds.apache.org/job/axis2-1.6/ws/axis2/modules/kernel/src/org/apache/axis2/context/externalize/SafeObjectInputStream.java>:228:
warning - Tag @see: can't find SafeObjectInputStream.writeList() in org.apache.axis2.context.externalize.SafeObjectInputStream
[WARNING] <https://builds.apache.org/job/axis2-1.6/ws/axis2/modules/kernel/src/org/apache/axis2/context/externalize/SafeObjectInputStream.java>:159:
warning - Tag @see: missing '#': "SafeObjectOutputStream.writeMap()"
[WARNING] <https://builds.apache.org/job/axis2-1.6/ws/axis2/modules/kernel/src/org/apache/axis2/context/externalize/SafeObjectInputStream.java>:159:
warning - Tag @see: can't find SafeObjectOutputStream.writeMap() in org.apache.axis2.context.externalize.SafeObjectInputStream
[WARNING] <https://builds.apache.org/job/axis2-1.6/ws/axis2/modules/kernel/src/org/apache/axis2/context/externalize/SafeObjectInputStream.java>:239:
warning - Tag @see: missing '#': "SafeObjectInputStream.writeList()"
[WARNING] <https://builds.apache.org/job/axis2-1.6/ws/axis2/modules/kernel/src/org/apache/axis2/context/externalize/SafeObjectInputStream.java>:239:
warning - Tag @see: can't find SafeObjectInputStream.writeList() in org.apache.axis2.context.externalize.SafeObjectInputStream
[WARNING] <https://builds.apache.org/job/axis2-1.6/ws/axis2/modules/kernel/src/org/apache/axis2/context/externalize/SafeObjectInputStream.java>:251:
warning - Tag @see: missing '#': "SafeObjectInputStream.writeList()"
[WARNING] <https://builds.apache.org/job/axis2-1.6/ws/axis2/modules/kernel/src/org/apache/axis2/context/externalize/SafeObjectInputStream.java>:251:
warning - Tag @see: can't find SafeObjectInputStream.writeList() in org.apache.axis2.context.externalize.SafeObjectInputStream
[WARNING] <https://builds.apache.org/job/axis2-1.6/ws/axis2/modules/kernel/src/org/apache/axis2/context/externalize/SafeObjectInputStream.java>:172:
warning - Tag @see: missing '#': "SafeObjectOutputStream.writeMap()"
[WARNING] <https://builds.apache.org/job/axis2-1.6/ws/axis2/modules/kernel/src/org/apache/axis2/context/externalize/SafeObjectInputStream.java>:172:
warning - Tag @see: can't find SafeObjectOutputStream.writeMap() in org.apache.axis2.context.externalize.SafeObjectInputStream
[WARNING] <https://builds.apache.org/job/axis2-1.6/ws/axis2/modules/kernel/src/org/apache/axis2/context/externalize/SafeObjectOutputStream.java>:87:
warning - @return tag has no arguments.
[WARNING] <https://builds.apache.org/job/axis2-1.6/ws/axis2/modules/kernel/src/org/apache/axis2/context/externalize/SafeObjectOutputStream.java>:279:
warning - @return tag has no arguments.
[WARNING] <https://builds.apache.org/job/axis2-1.6/ws/axis2/modules/kernel/src/org/apache/axis2/context/externalize/SafeObjectOutputStream.java>:245:
warning - @return tag has no arguments.
[WARNING] <https://builds.apache.org/job/axis2-1.6/ws/axis2/modules/kernel/src/org/apache/axis2/context/externalize/SafeObjectOutputStream.java>:245:
warning - @param argument "ll" is not a parameter name.
[WARNING] <https://builds.apache.org/job/axis2-1.6/ws/axis2/modules/kernel/src/org/apache/axis2/context/externalize/SafeObjectOutputStream.java>:279:
warning - @param argument "ll" is not a parameter name.
[WARNING] <https://builds.apache.org/job/axis2-1.6/ws/axis2/modules/kernel/src/org/apache/axis2/context/externalize/SafeObjectOutputStream.java>:427:
warning - @returns is an unknown tag.
[WARNING] <https://builds.apache.org/job/axis2-1.6/ws/axis2/modules/kernel/src/org/apache/axis2/context/externalize/SafeObjectOutputStream.java>:504:
warning - @returns is an unknown tag.
[WARNING] <https://builds.apache.org/job/axis2-1.6/ws/axis2/modules/kernel/src/org/apache/axis2/context/externalize/SafeObjectOutputStream.java>:504:
warning - @param argument "obj1" is not a parameter name.
[WARNING] <https://builds.apache.org/job/axis2-1.6/ws/axis2/modules/kernel/src/org/apache/axis2/context/externalize/SafeObjectOutputStream.java>:504:
warning - @param argument "isSafe1" is not a parameter name.
[WARNING] <https://builds.apache.org/job/axis2-1.6/ws/axis2/modules/kernel/src/org/apache/axis2/context/externalize/SafeObjectOutputStream.java>:504:
warning - @param argument "obj2" is not a parameter name.
[WARNING] <https://builds.apache.org/job/axis2-1.6/ws/axis2/modules/kernel/src/org/apache/axis2/context/externalize/SafeObjectOutputStream.java>:504:
warning - @param argument "isSafe2" is not a parameter name.
[WARNING] <https://builds.apache.org/job/axis2-1.6/ws/axis2/modules/kernel/src/org/apache/axis2/context/externalize/SafeSerializable.java>:32:
warning - @See is an unknown tag -- same as a known tag except for case.
[WARNING] <https://builds.apache.org/job/axis2-1.6/ws/axis2/modules/kernel/src/org/apache/axis2/context/OperationContext.java>:278:
warning - Tag @link: reference not found: WSDLConstants
[WARNING] <https://builds.apache.org/job/axis2-1.6/ws/axis2/modules/kernel/src/org/apache/axis2/context/OperationContext.java>:353:
warning - @param argument "out" is not a parameter name.
[WARNING] <https://builds.apache.org/job/axis2-1.6/ws/axis2/modules/kernel/src/org/apache/axis2/context/OperationContext.java>:533:
warning - @param argument "in" is not a parameter name.
[WARNING] <https://builds.apache.org/job/axis2-1.6/ws/axis2/modules/kernel/src/org/apache/axis2/context/ServiceContext.java>:197:
warning - @return tag has no arguments.
[WARNING] <https://builds.apache.org/job/axis2-1.6/ws/axis2/modules/kernel/src/org/apache/axis2/context/ServiceContext.java>:305:
warning - @param argument "out" is not a parameter name.
[WARNING] <https://builds.apache.org/job/axis2-1.6/ws/axis2/modules/kernel/src/org/apache/axis2/context/ServiceContext.java>:370:
warning - @param argument "in" is not a parameter name.
[WARNING] <https://builds.apache.org/job/axis2-1.6/ws/axis2/modules/kernel/src/org/apache/axis2/context/ServiceGroupContext.java>:275:
warning - @param argument "out" is not a parameter name.
[WARNING] <https://builds.apache.org/job/axis2-1.6/ws/axis2/modules/kernel/src/org/apache/axis2/context/ServiceGroupContext.java>:341:
warning - @param argument "in" is not a parameter name.
[WARNING] <https://builds.apache.org/job/axis2-1.6/ws/axis2/modules/kernel/src/org/apache/axis2/context/SessionContext.java>:187:
warning - @param argument "out" is not a parameter name.
[WARNING] <https://builds.apache.org/job/axis2-1.6/ws/axis2/modules/kernel/src/org/apache/axis2/context/SessionContext.java>:242:
warning - @param argument "in" is not a parameter name.
[WARNING] <https://builds.apache.org/job/axis2-1.6/ws/axis2/modules/kernel/src/org/apache/axis2/util/JavaUtils.java>:97:
warning - @return tag has no arguments.
[WARNING] <https://builds.apache.org/job/axis2-1.6/ws/axis2/modules/kernel/src/org/apache/axis2/util/JavaUtils.java>:573:
warning - @return tag has no arguments.
[WARNING] <https://builds.apache.org/job/axis2-1.6/ws/axis2/modules/kernel/src/org/apache/axis2/util/MessageContextBuilder.java>:767:
warning - @return tag has no arguments.
[WARNING] <https://builds.apache.org/job/axis2-1.6/ws/axis2/modules/kernel/src/org/apache/axis2/util/MetaDataEntry.java>:259:
warning - @param argument "out" is not a parameter name.
[WARNING] <https://builds.apache.org/job/axis2-1.6/ws/axis2/modules/kernel/src/org/apache/axis2/util/MetaDataEntry.java>:296:
warning - @param argument "in" is not a parameter name.
[WARNING] <https://builds.apache.org/job/axis2-1.6/ws/axis2/modules/kernel/src/org/apache/axis2/util/MultipleEntryHashMap.java>:44:
warning - @return tag has no arguments.
[WARNING] <https://builds.apache.org/job/axis2-1.6/ws/axis2/modules/kernel/src/org/apache/axis2/util/ObjectStateUtils.java>:189:
warning - @param argument "in" is not a parameter name.
[WARNING] <https://builds.apache.org/job/axis2-1.6/ws/axis2/modules/kernel/src/org/apache/axis2/util/ObjectStateUtils.java>:205:
warning - @param argument "list" is not a parameter name.
[WARNING] <https://builds.apache.org/job/axis2-1.6/ws/axis2/modules/kernel/src/org/apache/axis2/util/ObjectStateUtils.java>:223:
warning - @param argument "in" is not a parameter name.
[WARNING] <https://builds.apache.org/job/axis2-1.6/ws/axis2/modules/kernel/src/org/apache/axis2/util/ObjectStateUtils.java>:313:
warning - @param argument "handlerClassName" is not a parameter name.
[WARNING] <https://builds.apache.org/job/axis2-1.6/ws/axis2/modules/kernel/src/org/apache/axis2/util/Utils.java>:93:
warning - Tag @see:illegal character: "58" in "org.apache.axis2.util.MessageContextBuilder:createOutMessageContext()"
[WARNING] <https://builds.apache.org/job/axis2-1.6/ws/axis2/modules/kernel/src/org/apache/axis2/util/Utils.java>:93:
warning - Tag @see: missing '#': "org.apache.axis2.util.MessageContextBuilder:createOutMessageContext()"
[WARNING] <https://builds.apache.org/job/axis2-1.6/ws/axis2/modules/kernel/src/org/apache/axis2/util/Utils.java>:93:
warning - Tag @see: can't find org.apache.axis2.util.MessageContextBuilder:createOutMessageContext()
in org.apache.axis2.util.Utils
[WARNING] <https://builds.apache.org/job/axis2-1.6/ws/axis2/modules/kernel/src/org/apache/axis2/util/Utils.java>:521:
warning - @return tag has no arguments.
[WARNING] <https://builds.apache.org/job/axis2-1.6/ws/axis2/modules/kernel/src/org/apache/axis2/util/Utils.java>:818:
warning - @return tag has no arguments.
[WARNING] <https://builds.apache.org/job/axis2-1.6/ws/axis2/modules/kernel/src/org/apache/axis2/util/XMLUtils.java>:523:
warning - @return tag has no arguments.
[WARNING] <https://builds.apache.org/job/axis2-1.6/ws/axis2/modules/kernel/src/org/apache/axis2/util/XMLUtils.java>:610:
warning - @return tag has no arguments.
[WARNING] <https://builds.apache.org/job/axis2-1.6/ws/axis2/modules/kernel/src/org/apache/axis2/jaxrs/JAXRSModel.java>:70:
warning - @return tag has no arguments.
[WARNING] <https://builds.apache.org/job/axis2-1.6/ws/axis2/modules/kernel/src/org/apache/axis2/jaxrs/JAXRSModel.java>:89:
warning - @return tag has no arguments.
[WARNING] <https://builds.apache.org/job/axis2-1.6/ws/axis2/modules/kernel/src/org/apache/axis2/jaxrs/JAXRSUtils.java>:48:
warning - @return tag has no arguments.
[WARNING] <https://builds.apache.org/job/axis2-1.6/ws/axis2/modules/kernel/src/org/apache/axis2/jaxrs/JAXRSUtils.java>:78:
warning - @return tag has no arguments.
[WARNING] <https://builds.apache.org/job/axis2-1.6/ws/axis2/modules/kernel/src/org/apache/axis2/deployment/util/Utils.java>:1842:
warning - @return tag has no arguments.
[WARNING] <https://builds.apache.org/job/axis2-1.6/ws/axis2/modules/kernel/src/org/apache/axis2/deployment/util/Utils.java>:1790:
warning - @return tag has no arguments.
[WARNING] <https://builds.apache.org/job/axis2-1.6/ws/axis2/modules/kernel/src/org/apache/axis2/deployment/util/Utils.java>:1816:
warning - @return tag has no arguments.
[WARNING] <https://builds.apache.org/job/axis2-1.6/ws/axis2/modules/kernel/src/org/apache/axis2/deployment/util/Utils.java>:1871:
warning - @return tag has no arguments.
[WARNING] <https://builds.apache.org/job/axis2-1.6/ws/axis2/modules/kernel/src/org/apache/axis2/classloader/JarFileClassLoader.java>:178:
warning - @inheritDoc used but internalfindResources(String) does not override or implement
any method.
[INFO] Building jar: <https://builds.apache.org/job/axis2-1.6/ws/axis2/modules/kernel/target/axis2-kernel-1.6.2-SNAPSHOT-javadoc.jar>
[INFO] [gpg:sign {execution: default}]
[INFO] [install:install {execution: default-install}]
[INFO] Installing <https://builds.apache.org/job/axis2-1.6/ws/axis2/modules/kernel/target/axis2-kernel-1.6.2-SNAPSHOT.jar>
to <https://builds.apache.org/job/axis2-1.6/ws/.repository/org/apache/axis2/axis2-kernel/1.6.2-SNAPSHOT/axis2-kernel-1.6.2-SNAPSHOT.jar>
[INFO] Installing <https://builds.apache.org/job/axis2-1.6/ws/axis2/modules/kernel/target/axis2-kernel-1.6.2-SNAPSHOT-sources.jar>
to <https://builds.apache.org/job/axis2-1.6/ws/.repository/org/apache/axis2/axis2-kernel/1.6.2-SNAPSHOT/axis2-kernel-1.6.2-SNAPSHOT-sources.jar>
[INFO] Installing <https://builds.apache.org/job/axis2-1.6/ws/axis2/modules/kernel/target/axis2-kernel-1.6.2-SNAPSHOT-javadoc.jar>
to <https://builds.apache.org/job/axis2-1.6/ws/.repository/org/apache/axis2/axis2-kernel/1.6.2-SNAPSHOT/axis2-kernel-1.6.2-SNAPSHOT-javadoc.jar>
[INFO] [deploy:deploy {execution: default-deploy}]
[INFO] Retrieving previous build number from apache.snapshots.https
[WARNING] *** CHECKSUM FAILED - Checksum failed on download: local = 'a13429a95601e0a9f0eea31284fbb67f9541e9bc';
remote = '34b4ed8614d5859ed02817eb24446846d6dc3a71' - RETRYING
[WARNING] *** CHECKSUM FAILED - Checksum failed on download: local = 'a13429a95601e0a9f0eea31284fbb67f9541e9bc';
remote = '34b4ed8614d5859ed02817eb24446846d6dc3a71' - IGNORING
Uploading: https://repository.apache.org/content/repositories/snapshots/org/apache/axis2/axis2-kernel/1.6.2-SNAPSHOT/axis2-kernel-1.6.2-20120409.163813-204.jar
1021K uploaded  (axis2-kernel-1.6.2-20120409.163813-204.jar)
[INFO] Uploading project information for axis2-kernel 1.6.2-20120409.163813-204
[INFO] Retrieving previous metadata from apache.snapshots.https
[INFO] Uploading repository metadata for: 'artifact org.apache.axis2:axis2-kernel'
[INFO] Retrieving previous metadata from apache.snapshots.https
[WARNING] *** CHECKSUM FAILED - Checksum failed on download: local = 'a13429a95601e0a9f0eea31284fbb67f9541e9bc';
remote = '34b4ed8614d5859ed02817eb24446846d6dc3a71' - RETRYING
[WARNING] *** CHECKSUM FAILED - Checksum failed on download: local = 'a13429a95601e0a9f0eea31284fbb67f9541e9bc';
remote = '34b4ed8614d5859ed02817eb24446846d6dc3a71' - IGNORING
[INFO] Uploading repository metadata for: 'snapshot org.apache.axis2:axis2-kernel:1.6.2-SNAPSHOT'
[INFO] Retrieving previous build number from apache.snapshots.https
Uploading: https://repository.apache.org/content/repositories/snapshots/org/apache/axis2/axis2-kernel/1.6.2-SNAPSHOT/axis2-kernel-1.6.2-20120409.163813-204-sources.jar
899K uploaded  (axis2-kernel-1.6.2-20120409.163813-204-sources.jar)
[INFO] Retrieving previous build number from apache.snapshots.https
Uploading: https://repository.apache.org/content/repositories/snapshots/org/apache/axis2/axis2-kernel/1.6.2-SNAPSHOT/axis2-kernel-1.6.2-20120409.163813-204-javadoc.jar
2598K uploaded  (axis2-kernel-1.6.2-20120409.163813-204-javadoc.jar)
[JENKINS] Archiving <https://builds.apache.org/job/axis2-1.6/ws/axis2/modules/kernel/pom.xml>
to /home/hudson/hudson/jobs/axis2-1.6/modules/org.apache.axis2$axis2-kernel/builds/2012-04-09_16-37-57/archive/org.apache.axis2/axis2-kernel/1.6.2-SNAPSHOT/axis2-kernel-1.6.2-SNAPSHOT.pom
[JENKINS] Archiving <https://builds.apache.org/job/axis2-1.6/ws/axis2/modules/kernel/target/axis2-kernel-1.6.2-SNAPSHOT.jar>
to /home/hudson/hudson/jobs/axis2-1.6/modules/org.apache.axis2$axis2-kernel/builds/2012-04-09_16-37-57/archive/org.apache.axis2/axis2-kernel/1.6.2-20120409.163813-204/axis2-kernel-1.6.2-20120409.163813-204.jar
[JENKINS] Archiving <https://builds.apache.org/job/axis2-1.6/ws/axis2/modules/kernel/target/axis2-kernel-1.6.2-SNAPSHOT-sources.jar>
to /home/hudson/hudson/jobs/axis2-1.6/modules/org.apache.axis2$axis2-kernel/builds/2012-04-09_16-37-57/archive/org.apache.axis2/axis2-kernel/1.6.2-20120409.163813-204/axis2-kernel-1.6.2-20120409.163813-204-sources.jar
[JENKINS] Archiving <https://builds.apache.org/job/axis2-1.6/ws/axis2/modules/kernel/target/axis2-kernel-1.6.2-SNAPSHOT-javadoc.jar>
to /home/hudson/hudson/jobs/axis2-1.6/modules/org.apache.axis2$axis2-kernel/builds/2012-04-09_16-37-57/archive/org.apache.axis2/axis2-kernel/1.6.2-20120409.163813-204/axis2-kernel-1.6.2-20120409.163813-204-javadoc.jar
[INFO] ------------------------------------------------------------------------
[INFO] Building Apache Axis2 - Data Binding
[INFO]    task-segment: [clean, deploy]
[INFO] ------------------------------------------------------------------------
[INFO] [clean:clean {execution: default-clean}]
[INFO] Deleting directory <https://builds.apache.org/job/axis2-1.6/ws/axis2/modules/adb/target>
[INFO] [remote-resources:process {execution: default}]
Downloading: http://repo1.maven.org/maven2/org/apache/ws/commons/axiom/axiom-dom/1.2.13/axiom-dom-1.2.13.pom
[WARNING] Unable to get resource 'org.apache.ws.commons.axiom:axiom-dom:pom:1.2.13' from repository
central (http://repo1.maven.org/maven2): Error transferring file: Connection timed out
Downloading: http://repo1.maven.org/maven2/org/apache/ws/commons/axiom/axiom-dom/1.2.13/axiom-dom-1.2.13.jar
[WARNING] Unable to get resource 'org.apache.ws.commons.axiom:axiom-dom:jar:1.2.13' from repository
central (http://repo1.maven.org/maven2): Error transferring file: Connection timed out
[JENKINS] Archiving <https://builds.apache.org/job/axis2-1.6/ws/axis2/modules/adb/pom.xml>
to /home/hudson/hudson/jobs/axis2-1.6/modules/org.apache.axis2$axis2-adb/builds/2012-04-09_16-37-57/archive/org.apache.axis2/axis2-adb/1.6.2-SNAPSHOT/axis2-adb-1.6.2-SNAPSHOT.pom
[INFO] ------------------------------------------------------------------------
[ERROR] BUILD ERROR
[INFO] ------------------------------------------------------------------------
[INFO] Failed to resolve artifact.

Missing:
----------
1) org.apache.ws.commons.axiom:axiom-dom:jar:1.2.13

  Try downloading the file manually from the project website.

  Then, install it using the command: 
      mvn install:install-file -DgroupId=org.apache.ws.commons.axiom -DartifactId=axiom-dom
-Dversion=1.2.13 -Dpackaging=jar -Dfile=/path/to/file

  Alternatively, if you host your own repository you can deploy the file there: 
      mvn deploy:deploy-file -DgroupId=org.apache.ws.commons.axiom -DartifactId=axiom-dom
-Dversion=1.2.13 -Dpackaging=jar -Dfile=/path/to/file -Durl=[url] -DrepositoryId=[id]

  Path to dependency: 
  	1) org.apache.axis2:axis2-adb:jar:1.6.2-SNAPSHOT
  	2) org.apache.ws.commons.axiom:axiom-dom:jar:1.2.13

----------
1 required artifact is missing.

for artifact: 
  org.apache.axis2:axis2-adb:jar:1.6.2-SNAPSHOT

from the specified remote repositories:
  central (http://repo1.maven.org/maven2),
  Nexus (http://repository.apache.org/snapshots)



[INFO] ------------------------------------------------------------------------
[INFO] For more information, run Maven with the -e switch
[INFO] ------------------------------------------------------------------------
[INFO] Total time: 1 minute 53 seconds
[INFO] Finished at: Mon Apr 09 16:39:57 GMT 2012
[INFO] Final Memory: 75M/427M
[INFO] ------------------------------------------------------------------------
Sending e-mails to: java-dev@axis.apache.org
channel stopped
[locks-and-latches] Releasing all the locks
[locks-and-latches] All the locks released

---------------------------------------------------------------------
To unsubscribe, e-mail: java-dev-unsubscribe@axis.apache.org
For additional commands, e-mail: java-dev-help@axis.apache.org


Mime
View raw message