axis-java-dev mailing list archives

Site index · List index
Message view « Date » · « Thread »
Top « Date » · « Thread »
From Apache Jenkins Server <jenk...@builds.apache.org>
Subject Build failed in Jenkins: Rampart #983
Date Fri, 22 Jun 2012 13:34:31 GMT
See <https://builds.apache.org/job/Rampart/983/changes>

Changes:

[sagara] AXIS2-5334 - required changes for r1352812.

------------------------------------------
[...truncated 174 lines...]
mojoStarted org.apache.maven.plugins:maven-remote-resources-plugin:1.1(default)
[INFO] 
[INFO] --- maven-remote-resources-plugin:1.1:process (default) @ rampart-policy ---
mojoSucceeded org.apache.maven.plugins:maven-remote-resources-plugin:1.1(default)
mojoStarted org.apache.maven.plugins:maven-resources-plugin:2.4(default-resources)
[INFO] 
[INFO] --- maven-resources-plugin:2.4:resources (default-resources) @ rampart-policy ---
[INFO] Using 'UTF-8' encoding to copy filtered resources.
[INFO] Copying 1 resource
[INFO] Copying 3 resources
mojoSucceeded org.apache.maven.plugins:maven-resources-plugin:2.4(default-resources)
mojoStarted org.apache.maven.plugins:maven-compiler-plugin:2.0(default-compile)
[INFO] 
[INFO] --- maven-compiler-plugin:2.0:compile (default-compile) @ rampart-policy ---
Compiling 89 source files to <https://builds.apache.org/job/Rampart/ws/trunk/modules/rampart-policy/target/classes>
mojoSucceeded org.apache.maven.plugins:maven-compiler-plugin:2.0(default-compile)
mojoStarted org.apache.maven.plugins:maven-resources-plugin:2.4(default-testResources)[INFO]
Using 'UTF-8' encoding to copy filtered resources.
[INFO] skip non existing resourceDirectory <https://builds.apache.org/job/Rampart/ws/trunk/modules/rampart-policy/src/test/resources>
[INFO] Copying 3 resources

[INFO] 
[INFO] --- maven-resources-plugin:2.4:testResources (default-testResources) @ rampart-policy
---
mojoSucceeded org.apache.maven.plugins:maven-resources-plugin:2.4(default-testResources)
mojoStarted org.apache.maven.plugins:maven-compiler-plugin:2.0(default-testCompile)[INFO]
No sources to compile

[INFO] 
[INFO] --- maven-compiler-plugin:2.0:testCompile (default-testCompile) @ rampart-policy ---
mojoSucceeded org.apache.maven.plugins:maven-compiler-plugin:2.0(default-testCompile)
mojoStarted org.apache.maven.plugins:maven-surefire-plugin:2.10(default-test)
[INFO] 
[INFO] --- maven-surefire-plugin:2.10:test (default-test) @ rampart-policy ---
[INFO] Surefire report directory: <https://builds.apache.org/job/Rampart/ws/trunk/modules/rampart-policy/target/surefire-reports>

-------------------------------------------------------
 T E S T S
-------------------------------------------------------
mojoSucceeded org.apache.maven.plugins:maven-surefire-plugin:2.10(default-test)
Results :

Tests run: 0, Failures: 0, Errors: 0, Skipped: 0


[JENKINS] Recording test results
mojoStarted org.apache.maven.plugins:maven-jar-plugin:2.3(default-jar)
[INFO] 
[INFO] --- maven-jar-plugin:2.3:jar (default-jar) @ rampart-policy ---
[INFO] Building jar: <https://builds.apache.org/job/Rampart/ws/trunk/modules/rampart-policy/target/rampart-policy-1.7.0-SNAPSHOT.jar>
mojoSucceeded org.apache.maven.plugins:maven-jar-plugin:2.3(default-jar)
mojoStarted org.apache.maven.plugins:maven-install-plugin:2.3(default-install)[INFO] Installing
<https://builds.apache.org/job/Rampart/ws/trunk/modules/rampart-policy/target/rampart-policy-1.7.0-SNAPSHOT.jar>
to <https://builds.apache.org/job/Rampart/ws/.repository/org/apache/rampart/rampart-policy/1.7.0-SNAPSHOT/rampart-policy-1.7.0-SNAPSHOT.jar>
[INFO] Installing <https://builds.apache.org/job/Rampart/ws/trunk/modules/rampart-policy/pom.xml>
to <https://builds.apache.org/job/Rampart/ws/.repository/org/apache/rampart/rampart-policy/1.7.0-SNAPSHOT/rampart-policy-1.7.0-SNAPSHOT.pom>

[INFO] 
[INFO] --- maven-install-plugin:2.3:install (default-install) @ rampart-policy ---
mojoSucceeded org.apache.maven.plugins:maven-install-plugin:2.3(default-install)
projectSucceeded org.apache.rampart:rampart-policy:1.7.0-SNAPSHOT
projectStarted org.apache.rampart:rampart-trust:1.7.0-SNAPSHOT
[INFO] Downloading: http://shibboleth.internet2.edu/downloads/maven2/org/apache/ws/commons/axiom/axiom-dom/1.2.14-SNAPSHOT/maven-metadata.xml
Downloading: http://repository.apache.org/snapshots/org/apache/ws/commons/axiom/axiom-dom/1.2.14-SNAPSHOT/maven-metadata.xml
                                                                        
[INFO] ------------------------------------------------------------------------
[INFO] Building Rampart - Trust 1.7.0-SNAPSHOT
[INFO] ------------------------------------------------------------------------
Downloaded: http://repository.apache.org/snapshots/org/apache/ws/commons/axiom/axiom-dom/1.2.14-SNAPSHOT/maven-metadata.xml
(2 KB at 11.5 KB/sec)
Downloading: http://shibboleth.internet2.edu/downloads/maven2/org/apache/ws/commons/axiom/axiom-dom/1.2.14-SNAPSHOT/axiom-dom-1.2.14-20120621.221048-194.pom
Downloading: http://repository.apache.org/snapshots/org/apache/ws/commons/axiom/axiom-dom/1.2.14-SNAPSHOT/axiom-dom-1.2.14-20120621.221048-194.pom
Downloaded: http://repository.apache.org/snapshots/org/apache/ws/commons/axiom/axiom-dom/1.2.14-SNAPSHOT/axiom-dom-1.2.14-20120621.221048-194.pom
(9 KB at 94.2 KB/sec)
Downloading: http://repository.apache.org/snapshots/org/apache/ws/commons/axiom/axiom-dom/1.2.14-SNAPSHOT/axiom-dom-1.2.14-20120621.221048-194.jar
Downloaded: http://repository.apache.org/snapshots/org/apache/ws/commons/axiom/axiom-dom/1.2.14-SNAPSHOT/axiom-dom-1.2.14-20120621.221048-194.jar
(198 KB at 652.8 KB/sec)
mojoStarted org.apache.maven.plugins:maven-clean-plugin:2.4.1(default-clean)[INFO] Deleting
<https://builds.apache.org/job/Rampart/ws/trunk/modules/rampart-trust/target>

[INFO] 
[INFO] --- maven-clean-plugin:2.4.1:clean (default-clean) @ rampart-trust ---
mojoSucceeded org.apache.maven.plugins:maven-clean-plugin:2.4.1(default-clean)
mojoStarted org.apache.maven.plugins:maven-remote-resources-plugin:1.1(default)
[INFO] 
[INFO] --- maven-remote-resources-plugin:1.1:process (default) @ rampart-trust ---
mojoSucceeded org.apache.maven.plugins:maven-remote-resources-plugin:1.1(default)
mojoStarted org.apache.maven.plugins:maven-resources-plugin:2.4(default-resources)[INFO] Using
'UTF-8' encoding to copy filtered resources.

[INFO] 
[INFO] --- maven-resources-plugin:2.4:resources (default-resources) @ rampart-trust ---
[INFO] Copying 1 resource
[INFO] Copying 3 resources
mojoSucceeded org.apache.maven.plugins:maven-resources-plugin:2.4(default-resources)
mojoStarted org.apache.maven.plugins:maven-compiler-plugin:2.0(default-compile)Compiling 39
source files to <https://builds.apache.org/job/Rampart/ws/trunk/modules/rampart-trust/target/classes>

[INFO] 
[INFO] --- maven-compiler-plugin:2.0:compile (default-compile) @ rampart-trust ---
mojoSucceeded org.apache.maven.plugins:maven-compiler-plugin:2.0(default-compile)
mojoStarted org.apache.maven.plugins:maven-resources-plugin:2.4(default-testResources)[INFO]
Using 'UTF-8' encoding to copy filtered resources.
[INFO] Copying 4 resources
[INFO] Copying 3 resources

[INFO] 
[INFO] --- maven-resources-plugin:2.4:testResources (default-testResources) @ rampart-trust
---
mojoSucceeded org.apache.maven.plugins:maven-resources-plugin:2.4(default-testResources)
mojoStarted org.apache.maven.plugins:maven-compiler-plugin:2.0(default-testCompile)Compiling
8 source files to <https://builds.apache.org/job/Rampart/ws/trunk/modules/rampart-trust/target/test-classes>

[INFO] 
[INFO] --- maven-compiler-plugin:2.0:testCompile (default-testCompile) @ rampart-trust ---
mojoSucceeded org.apache.maven.plugins:maven-compiler-plugin:2.0(default-testCompile)
[INFO] Surefire report directory: <https://builds.apache.org/job/Rampart/ws/trunk/modules/rampart-trust/target/surefire-reports>
mojoStarted org.apache.maven.plugins:maven-surefire-plugin:2.10(default-test)
-------------------------------------------------------
 T E S T S
-------------------------------------------------------

[INFO] 
[INFO] --- maven-surefire-plugin:2.10:test (default-test) @ rampart-trust ---
Running org.apache.rahas.test.util.AbstractTestCase
Tests run: 1, Failures: 0, Errors: 0, Skipped: 0, Time elapsed: 2.214 sec
Running org.apache.rahas.test.util.TestSAMLCallbackHandler
Tests run: 0, Failures: 0, Errors: 0, Skipped: 0, Time elapsed: 0.005 sec
Running org.apache.rahas.test.util.TestUtil
Tests run: 0, Failures: 0, Errors: 0, Skipped: 0, Time elapsed: 0 sec
Running org.apache.rahas.test.util.TestCallbackHandler
Tests run: 0, Failures: 0, Errors: 0, Skipped: 0, Time elapsed: 0.003 sec
Running org.apache.rahas.impl.util.CommonUtilTest
Tests run: 9, Failures: 0, Errors: 0, Skipped: 0, Time elapsed: 2.571 sec
Running org.apache.rahas.impl.util.SAMLUtilsTest
Tests run: 13, Failures: 0, Errors: 0, Skipped: 0, Time elapsed: 1.193 sec
Running org.apache.rahas.impl.SAML2TokenIssuerTest
Tests run: 4, Failures: 0, Errors: 0, Skipped: 0, Time elapsed: 0.444 sec

Results :

Tests run: 27, Failures: 0, Errors: 0, Skipped: 0

mojoSucceeded org.apache.maven.plugins:maven-surefire-plugin:2.10(default-test)
[JENKINS] Recording test results
mojoStarted org.apache.maven.plugins:maven-jar-plugin:2.3(default-jar)
[INFO] 
[INFO] --- maven-jar-plugin:2.3:jar (default-jar) @ rampart-trust ---
[INFO] Building jar: <https://builds.apache.org/job/Rampart/ws/trunk/modules/rampart-trust/target/rampart-trust-1.7.0-SNAPSHOT.jar>
mojoSucceeded org.apache.maven.plugins:maven-jar-plugin:2.3(default-jar)
mojoStarted org.apache.maven.plugins:maven-install-plugin:2.3(default-install)[INFO] Installing
<https://builds.apache.org/job/Rampart/ws/trunk/modules/rampart-trust/target/rampart-trust-1.7.0-SNAPSHOT.jar>
to <https://builds.apache.org/job/Rampart/ws/.repository/org/apache/rampart/rampart-trust/1.7.0-SNAPSHOT/rampart-trust-1.7.0-SNAPSHOT.jar>
[INFO] Installing <https://builds.apache.org/job/Rampart/ws/trunk/modules/rampart-trust/pom.xml>
to <https://builds.apache.org/job/Rampart/ws/.repository/org/apache/rampart/rampart-trust/1.7.0-SNAPSHOT/rampart-trust-1.7.0-SNAPSHOT.pom>

[INFO] 
[INFO] --- maven-install-plugin:2.3:install (default-install) @ rampart-trust ---
mojoSucceeded org.apache.maven.plugins:maven-install-plugin:2.3(default-install)
projectSucceeded org.apache.rampart:rampart-trust:1.7.0-SNAPSHOT
projectStarted org.apache.rampart:rampart-core:1.7.0-SNAPSHOT
[INFO]                                                                         
[INFO] ------------------------------------------------------------------------
[INFO] Building Rampart - Core 1.7.0-SNAPSHOT
[INFO] ------------------------------------------------------------------------
[INFO] Deleting <https://builds.apache.org/job/Rampart/ws/trunk/modules/rampart-core/target>
mojoStarted org.apache.maven.plugins:maven-clean-plugin:2.4.1(default-clean)
[INFO] 
[INFO] --- maven-clean-plugin:2.4.1:clean (default-clean) @ rampart-core ---
mojoSucceeded org.apache.maven.plugins:maven-clean-plugin:2.4.1(default-clean)
mojoStarted org.apache.maven.plugins:maven-remote-resources-plugin:1.1(default)
[INFO] 
[INFO] --- maven-remote-resources-plugin:1.1:process (default) @ rampart-core ---
mojoSucceeded org.apache.maven.plugins:maven-remote-resources-plugin:1.1(default)
mojoStarted org.apache.maven.plugins:maven-resources-plugin:2.4(default-resources)[INFO] Using
'UTF-8' encoding to copy filtered resources.

[INFO] 
[INFO] --- maven-resources-plugin:2.4:resources (default-resources) @ rampart-core ---
[INFO] Copying 2 resources
[INFO] Copying 3 resources
mojoSucceeded org.apache.maven.plugins:maven-resources-plugin:2.4(default-resources)
mojoStarted org.apache.maven.plugins:maven-compiler-plugin:2.0(default-compile)Compiling 49
source files to <https://builds.apache.org/job/Rampart/ws/trunk/modules/rampart-core/target/classes>

[INFO] 
[INFO] --- maven-compiler-plugin:2.0:compile (default-compile) @ rampart-core ---
mojoFailed org.apache.maven.plugins:maven-compiler-plugin:2.0(default-compile)
projectFailed org.apache.rampart:rampart-core:1.7.0-SNAPSHOT
sessionEnded
[INFO] ------------------------------------------------------------------------
[INFO] Reactor Summary:
[INFO] 
[INFO] Apache Rampart .................................... SUCCESS [26.895s]
[INFO] Rampart - Policy .................................. SUCCESS [7.710s]
[INFO] Rampart - Trust ................................... SUCCESS [19.908s]
[INFO] Rampart - Core .................................... FAILURE [3.536s]
[INFO] Rampart - Test Suite .............................. SKIPPED
[INFO] Rampart - Mar ..................................... SKIPPED
[INFO] Rampart - Trust-Mar ............................... SKIPPED
[INFO] Rampart - Integration ............................. SKIPPED
[INFO] Rampart - Samples ................................. SKIPPED
[INFO] Rampart - Documentation ........................... SKIPPED
[INFO] Rampart - Distribution ............................ SKIPPED
[INFO] ------------------------------------------------------------------------
[INFO] BUILD FAILURE
[INFO] ------------------------------------------------------------------------
[INFO] Total time: 1:00.826s
[INFO] Finished at: Fri Jun 22 13:34:19 UTC 2012
[INFO] Final Memory: 36M/213M
[INFO] ------------------------------------------------------------------------
Projects to build: [MavenProject: org.apache.rampart:rampart-project:1.7.0-SNAPSHOT @ <https://builds.apache.org/job/Rampart/ws/trunk/pom.xml,>
MavenProject: org.apache.rampart:rampart-policy:1.7.0-SNAPSHOT @ <https://builds.apache.org/job/Rampart/ws/trunk/modules/rampart-policy/pom.xml,>
MavenProject: org.apache.rampart:rampart-trust:1.7.0-SNAPSHOT @ <https://builds.apache.org/job/Rampart/ws/trunk/modules/rampart-trust/pom.xml,>
MavenProject: org.apache.rampart:rampart-core:1.7.0-SNAPSHOT @ <https://builds.apache.org/job/Rampart/ws/trunk/modules/rampart-core/pom.xml,>
MavenProject: org.apache.rampart:rampart-tests:1.7.0-SNAPSHOT @ <https://builds.apache.org/job/Rampart/ws/trunk/modules/rampart-tests/pom.xml,>
MavenProject: org.apache.rampart:rampart:1.7.0-SNAPSHOT @ <https://builds.apache.org/job/Rampart/ws/trunk/modules/rampart-mar/pom.xml,>
MavenProject: org.apache.rampart:rahas:1.7.0-SNAPSHOT @ <https://builds.apache.org/job/Rampart/ws/trunk/modules/rampart-trust-mar/pom.xml,>
MavenProject: org.apache.rampart:rampart-integration:1.7.0-SNAPSHOT @ <https://builds.apache.org/job/Rampart/ws/trunk/modules/rampart-integration/pom.xml,>
MavenProject: org.apache.rampart:rampart-sample:1.7.0-SNAPSHOT @ <https://builds.apache.org/job/Rampart/ws/trunk/modules/rampart-samples/pom.xml,>
MavenProject: org.apache.rampart:rampart-documentation:1.7.0-SNAPSHOT @ <https://builds.apache.org/job/Rampart/ws/trunk/modules/documentation/pom.xml,>
MavenProject: org.apache.rampart:rampart-dist:1.7.0-SNAPSHOT @ <https://builds.apache.org/job/Rampart/ws/trunk/modules/distribution/pom.xml]>
[JENKINS] Archiving <https://builds.apache.org/job/Rampart/ws/trunk/modules/rampart-core/pom.xml>
to /home/hudson/hudson/jobs/Rampart/modules/org.apache.rampart$rampart-core/builds/2012-06-22_13-33-05/archive/org.apache.rampart/rampart-core/1.7.0-SNAPSHOT/rampart-core-1.7.0-SNAPSHOT.pom
[JENKINS] Archiving <https://builds.apache.org/job/Rampart/ws/trunk/modules/rampart-tests/pom.xml>
to /home/hudson/hudson/jobs/Rampart/modules/org.apache.rampart$rampart-tests/builds/2012-06-22_13-33-05/archive/org.apache.rampart/rampart-tests/1.7.0-SNAPSHOT/rampart-tests-1.7.0-SNAPSHOT.pom
[JENKINS] Archiving <https://builds.apache.org/job/Rampart/ws/trunk/modules/documentation/pom.xml>
to /home/hudson/hudson/jobs/Rampart/modules/org.apache.rampart$rampart-documentation/builds/2012-06-22_13-33-05/archive/org.apache.rampart/rampart-documentation/1.7.0-SNAPSHOT/rampart-documentation-1.7.0-SNAPSHOT.pom
[JENKINS] Archiving <https://builds.apache.org/job/Rampart/ws/trunk/pom.xml> to /home/hudson/hudson/jobs/Rampart/modules/org.apache.rampart$rampart-project/builds/2012-06-22_13-33-04/archive/org.apache.rampart/rampart-project/1.7.0-SNAPSHOT/rampart-project-1.7.0-SNAPSHOT.pom
[JENKINS] Archiving <https://builds.apache.org/job/Rampart/ws/trunk/modules/rampart-trust-mar/pom.xml>
to /home/hudson/hudson/jobs/Rampart/modules/org.apache.rampart$rahas/builds/2012-06-22_13-33-05/archive/org.apache.rampart/rahas/1.7.0-SNAPSHOT/rahas-1.7.0-SNAPSHOT.pom
[JENKINS] Archiving <https://builds.apache.org/job/Rampart/ws/trunk/modules/rampart-integration/pom.xml>
to /home/hudson/hudson/jobs/Rampart/modules/org.apache.rampart$rampart-integration/builds/2012-06-22_13-33-05/archive/org.apache.rampart/rampart-integration/1.7.0-SNAPSHOT/rampart-integration-1.7.0-SNAPSHOT.pom
[JENKINS] Archiving <https://builds.apache.org/job/Rampart/ws/trunk/modules/rampart-samples/pom.xml>
to /home/hudson/hudson/jobs/Rampart/modules/org.apache.rampart$rampart-sample/builds/2012-06-22_13-33-05/archive/org.apache.rampart/rampart-sample/1.7.0-SNAPSHOT/rampart-sample-1.7.0-SNAPSHOT.pom
[JENKINS] Archiving <https://builds.apache.org/job/Rampart/ws/trunk/modules/rampart-mar/pom.xml>
to /home/hudson/hudson/jobs/Rampart/modules/org.apache.rampart$rampart/builds/2012-06-22_13-33-05/archive/org.apache.rampart/rampart/1.7.0-SNAPSHOT/rampart-1.7.0-SNAPSHOT.pom
[JENKINS] Archiving <https://builds.apache.org/job/Rampart/ws/trunk/modules/rampart-policy/pom.xml>
to /home/hudson/hudson/jobs/Rampart/modules/org.apache.rampart$rampart-policy/builds/2012-06-22_13-33-04/archive/org.apache.rampart/rampart-policy/1.7.0-SNAPSHOT/rampart-policy-1.7.0-SNAPSHOT.pom
[JENKINS] Archiving <https://builds.apache.org/job/Rampart/ws/trunk/modules/rampart-policy/target/rampart-policy-1.7.0-SNAPSHOT.jar>
to /home/hudson/hudson/jobs/Rampart/modules/org.apache.rampart$rampart-policy/builds/2012-06-22_13-33-04/archive/org.apache.rampart/rampart-policy/1.7.0-SNAPSHOT/rampart-policy-1.7.0-SNAPSHOT.jar
[JENKINS] Archiving <https://builds.apache.org/job/Rampart/ws/trunk/modules/rampart-trust/pom.xml>
to /home/hudson/hudson/jobs/Rampart/modules/org.apache.rampart$rampart-trust/builds/2012-06-22_13-33-05/archive/org.apache.rampart/rampart-trust/1.7.0-SNAPSHOT/rampart-trust-1.7.0-SNAPSHOT.pom
[JENKINS] Archiving <https://builds.apache.org/job/Rampart/ws/trunk/modules/rampart-trust/target/rampart-trust-1.7.0-SNAPSHOT.jar>
to /home/hudson/hudson/jobs/Rampart/modules/org.apache.rampart$rampart-trust/builds/2012-06-22_13-33-05/archive/org.apache.rampart/rampart-trust/1.7.0-SNAPSHOT/rampart-trust-1.7.0-SNAPSHOT.jar
[JENKINS] Archiving <https://builds.apache.org/job/Rampart/ws/trunk/modules/distribution/pom.xml>
to /home/hudson/hudson/jobs/Rampart/modules/org.apache.rampart$rampart-dist/builds/2012-06-22_13-33-05/archive/org.apache.rampart/rampart-dist/1.7.0-SNAPSHOT/rampart-dist-1.7.0-SNAPSHOT.pom
Waiting for Jenkins to finish collecting data
mavenExecutionResult exceptions not empty
message : Failed to execute goal org.apache.maven.plugins:maven-compiler-plugin:2.0:compile
(default-compile) on project rampart-core: Compilation failure
cause : Compilation failure
Stack trace : 
org.apache.maven.lifecycle.LifecycleExecutionException: Failed to execute goal org.apache.maven.plugins:maven-compiler-plugin:2.0:compile
(default-compile) on project rampart-core: Compilation failure
	at org.apache.maven.lifecycle.internal.MojoExecutor.execute(MojoExecutor.java:213)
	at org.apache.maven.lifecycle.internal.MojoExecutor.execute(MojoExecutor.java:153)
	at org.apache.maven.lifecycle.internal.MojoExecutor.execute(MojoExecutor.java:145)
	at org.apache.maven.lifecycle.internal.LifecycleModuleBuilder.buildProject(LifecycleModuleBuilder.java:84)
	at org.apache.maven.lifecycle.internal.LifecycleModuleBuilder.buildProject(LifecycleModuleBuilder.java:59)
	at org.apache.maven.lifecycle.internal.LifecycleStarter.singleThreadedBuild(LifecycleStarter.java:183)
	at org.apache.maven.lifecycle.internal.LifecycleStarter.execute(LifecycleStarter.java:161)
	at org.apache.maven.DefaultMaven.doExecute(DefaultMaven.java:319)
	at org.apache.maven.DefaultMaven.execute(DefaultMaven.java:156)
	at org.jvnet.hudson.maven3.launcher.Maven3Launcher.main(Maven3Launcher.java:79)
	at sun.reflect.NativeMethodAccessorImpl.invoke0(Native Method)
	at sun.reflect.NativeMethodAccessorImpl.invoke(NativeMethodAccessorImpl.java:39)
	at sun.reflect.DelegatingMethodAccessorImpl.invoke(DelegatingMethodAccessorImpl.java:25)
	at java.lang.reflect.Method.invoke(Method.java:597)
	at org.codehaus.plexus.classworlds.launcher.Launcher.launchStandard(Launcher.java:329)
	at org.codehaus.plexus.classworlds.launcher.Launcher.launch(Launcher.java:239)
	at org.jvnet.hudson.maven3.agent.Maven3Main.launch(Maven3Main.java:158)
	at hudson.maven.Maven3Builder.call(Maven3Builder.java:98)
	at hudson.maven.Maven3Builder.call(Maven3Builder.java:64)
	at hudson.remoting.UserRequest.perform(UserRequest.java:118)
	at hudson.remoting.UserRequest.perform(UserRequest.java:48)
	at hudson.remoting.Request$2.run(Request.java:287)
	at hudson.remoting.InterceptingExecutorService$1.call(InterceptingExecutorService.java:72)
	at java.util.concurrent.FutureTask$Sync.innerRun(FutureTask.java:303)
	at java.util.concurrent.FutureTask.run(FutureTask.java:138)
	at java.util.concurrent.ThreadPoolExecutor$Worker.runTask(ThreadPoolExecutor.java:886)
	at java.util.concurrent.ThreadPoolExecutor$Worker.run(ThreadPoolExecutor.java:908)
	at java.lang.Thread.run(Thread.java:662)
Caused by: org.apache.maven.plugin.CompilationFailureException: Compilation failure
	at org.apache.maven.plugin.AbstractCompilerMojo.execute(AbstractCompilerMojo.java:429)
	at org.apache.maven.plugin.CompilerMojo.execute(CompilerMojo.java:110)
	at org.apache.maven.plugin.DefaultBuildPluginManager.executeMojo(DefaultBuildPluginManager.java:101)
	at org.apache.maven.lifecycle.internal.MojoExecutor.execute(MojoExecutor.java:209)
	... 27 more
channel stopped
[locks-and-latches] Releasing all the locks
[locks-and-latches] All the locks released
Updating AXIS2-5334

---------------------------------------------------------------------
To unsubscribe, e-mail: java-dev-unsubscribe@axis.apache.org
For additional commands, e-mail: java-dev-help@axis.apache.org


Mime
View raw message