axis-java-dev mailing list archives

Site index · List index
Message view « Date » · « Thread »
Top « Date » · « Thread »
From Apache Jenkins Server <jenk...@builds.apache.org>
Subject Build failed in Jenkins: Axis2 » Apache Axis2 - JAXB-RI Data Binding #1589
Date Mon, 25 Jun 2012 01:25:36 GMT
See <https://builds.apache.org/job/Axis2/org.apache.axis2$axis2-jaxbri/1589/changes>

Changes:

[veithen] Avoid generating the same class (JAXBRIDataSource) over and over again.

[veithen] Ensure non zero test coverage for axis2-jaxbri.

[veithen] Make the generated sources known to Maven (and thereby to Eclipse).

[veithen] Converted axis2-jaxbri to standard Maven 2 layout.

------------------------------------------
[INFO] ------------------------------------------------------------------------
[INFO] Building Apache Axis2 - JAXB-RI Data Binding
[INFO]    task-segment: [clean, deploy]
[INFO] ------------------------------------------------------------------------
[INFO] [clean:clean {execution: default-clean}]
[INFO] Deleting directory <https://builds.apache.org/job/Axis2/org.apache.axis2$axis2-jaxbri/ws/target>
[INFO] [remote-resources:process {execution: default}]
[INFO] [resources:resources {execution: default-resources}]
[INFO] Using 'UTF-8' encoding to copy filtered resources.
[INFO] Copying 1 resource
[INFO] Copying 2 resources
[INFO] [compiler:compile {execution: default-compile}]
[INFO] Compiling 4 source files to <https://builds.apache.org/job/Axis2/org.apache.axis2$axis2-jaxbri/ws/target/classes>
[INFO] [antrun:run {execution: gen-ts}]
[INFO] Executing tasks
    [mkdir] Created dir: <https://builds.apache.org/job/Axis2/org.apache.axis2$axis2-jaxbri/ws/target/schema>
    [mkdir] Created dir: <https://builds.apache.org/job/Axis2/org.apache.axis2$axis2-jaxbri/ws/target/schema/src>
    [mkdir] Created dir: <https://builds.apache.org/job/Axis2/org.apache.axis2$axis2-jaxbri/ws/target/schema/classes>
     [echo] Generating JAX-B classes for DocLitBareService test
     [echo] Generating Service / Service Client for Test01 test
     [java] Retrieving document at 'src/test/wsdl/Test01.wsdl'.
     [java] Retrieving document at 'src/test/wsdl/Test01.wsdl'.
[INFO] Executed tasks
[INFO] [resources:copy-resources {execution: create-repo}]
[INFO] Using 'UTF-8' encoding to copy filtered resources.
[INFO] Copying 1 resource
[INFO] Copying 2 resources to services/Test01.aar/META-INF
[INFO] [resources:testResources {execution: default-testResources}]
[INFO] Using 'UTF-8' encoding to copy filtered resources.
[INFO] skip non existing resourceDirectory <https://builds.apache.org/job/Axis2/org.apache.axis2$axis2-jaxbri/ws/src/test/resources>
[INFO] Copying 2 resources
[INFO] [build-helper:add-test-source {execution: add-test-source}]
[INFO] Test Source directory: <https://builds.apache.org/job/Axis2/org.apache.axis2$axis2-jaxbri/ws/target/schema/src>
added.
[INFO] Test Source directory: <https://builds.apache.org/job/Axis2/org.apache.axis2$axis2-jaxbri/ws/target/gen/Test01/src>
added.
[INFO] [compiler:testCompile {execution: default-testCompile}]
[INFO] Compiling 91 source files to <https://builds.apache.org/job/Axis2/org.apache.axis2$axis2-jaxbri/ws/target/test-classes>
[INFO] -------------------------------------------------------------
[ERROR] COMPILATION ERROR : 
[INFO] -------------------------------------------------------------
[ERROR] <https://builds.apache.org/job/Axis2/org.apache.axis2$axis2-jaxbri/ws/src/test/java/org/apache/axis2/jaxbri/Test01Test.java>:[26,34]
cannot find symbol
symbol  : class UtilServer
location: package org.apache.axis2.testutils

[ERROR] <https://builds.apache.org/job/Axis2/org.apache.axis2$axis2-jaxbri/ws/src/test/java/org/apache/axis2/jaxbri/Test01Test.java>:[38,8]
cannot find symbol
symbol  : variable UtilServer
location: class org.apache.axis2.jaxbri.Test01Test

[ERROR] <https://builds.apache.org/job/Axis2/org.apache.axis2$axis2-jaxbri/ws/src/test/java/org/apache/axis2/jaxbri/Test01Test.java>:[39,46]
cannot find symbol
symbol  : variable UtilServer
location: class org.apache.axis2.jaxbri.Test01Test

[ERROR] <https://builds.apache.org/job/Axis2/org.apache.axis2$axis2-jaxbri/ws/src/test/java/org/apache/axis2/jaxbri/Test01Test.java>:[46,8]
cannot find symbol
symbol  : variable UtilServer
location: class org.apache.axis2.jaxbri.Test01Test

[ERROR] <https://builds.apache.org/job/Axis2/org.apache.axis2$axis2-jaxbri/ws/src/test/java/org/apache/axis2/jaxbri/Test01Test.java>:[51,37]
cannot find symbol
symbol  : variable UtilServer
location: class org.apache.axis2.jaxbri.Test01Test

[ERROR] <https://builds.apache.org/job/Axis2/org.apache.axis2$axis2-jaxbri/ws/src/test/java/org/apache/axis2/jaxbri/Test01Test.java>:[51,97]
cannot find symbol
symbol  : variable UtilServer
location: class org.apache.axis2.jaxbri.Test01Test

[INFO] 6 errors 
[INFO] -------------------------------------------------------------
[JENKINS] Archiving <https://builds.apache.org/job/Axis2/org.apache.axis2$axis2-jaxbri/ws/pom.xml>
to /home/hudson/hudson/jobs/Axis2/modules/org.apache.axis2$axis2-jaxbri/builds/2012-06-25_00-54-22/archive/org.apache.axis2/axis2-jaxbri/1.7.0-SNAPSHOT/axis2-jaxbri-1.7.0-SNAPSHOT.pom
[INFO] ------------------------------------------------------------------------
[ERROR] BUILD FAILURE
[INFO] ------------------------------------------------------------------------
[INFO] Compilation failure

<https://builds.apache.org/job/Axis2/org.apache.axis2$axis2-jaxbri/ws/src/test/java/org/apache/axis2/jaxbri/Test01Test.java>:[26,34]
cannot find symbol
symbol  : class UtilServer
location: package org.apache.axis2.testutils

<https://builds.apache.org/job/Axis2/org.apache.axis2$axis2-jaxbri/ws/src/test/java/org/apache/axis2/jaxbri/Test01Test.java>:[38,8]
cannot find symbol
symbol  : variable UtilServer
location: class org.apache.axis2.jaxbri.Test01Test

<https://builds.apache.org/job/Axis2/org.apache.axis2$axis2-jaxbri/ws/src/test/java/org/apache/axis2/jaxbri/Test01Test.java>:[39,46]
cannot find symbol
symbol  : variable UtilServer
location: class org.apache.axis2.jaxbri.Test01Test

<https://builds.apache.org/job/Axis2/org.apache.axis2$axis2-jaxbri/ws/src/test/java/org/apache/axis2/jaxbri/Test01Test.java>:[46,8]
cannot find symbol
symbol  : variable UtilServer
location: class org.apache.axis2.jaxbri.Test01Test

<https://builds.apache.org/job/Axis2/org.apache.axis2$axis2-jaxbri/ws/src/test/java/org/apache/axis2/jaxbri/Test01Test.java>:[51,37]
cannot find symbol
symbol  : variable UtilServer
location: class org.apache.axis2.jaxbri.Test01Test

<https://builds.apache.org/job/Axis2/org.apache.axis2$axis2-jaxbri/ws/src/test/java/org/apache/axis2/jaxbri/Test01Test.java>:[51,97]
cannot find symbol
symbol  : variable UtilServer
location: class org.apache.axis2.jaxbri.Test01Test


[INFO] ------------------------------------------------------------------------
[INFO] For more information, run Maven with the -e switch
[INFO] ------------------------------------------------------------------------
[INFO] Total time: 31 minutes 7 seconds
[INFO] Finished at: Mon Jun 25 01:25:35 GMT 2012
[INFO] Final Memory: 137M/247M
[INFO] ------------------------------------------------------------------------

---------------------------------------------------------------------
To unsubscribe, e-mail: java-dev-unsubscribe@axis.apache.org
For additional commands, e-mail: java-dev-help@axis.apache.org


Mime
View raw message