axis-java-dev mailing list archives

Site index · List index
Message view « Date » · « Thread »
Top « Date » · « Thread »
From Apache Jenkins Server <jenk...@builds.apache.org>
Subject Build failed in Jenkins: Axis2 #1589
Date Mon, 25 Jun 2012 01:26:15 GMT
See <https://builds.apache.org/job/Axis2/1589/changes>

Changes:

[veithen] Avoid generating the same class (JAXBRIDataSource) over and over again.

[veithen] Ensure non zero test coverage for axis2-jaxbri.

[veithen] Some unit test improvements.

[veithen] Make the generated sources known to Maven (and thereby to Eclipse).

[veithen] Converted axis2-jaxbri to standard Maven 2 layout.

[veithen] Don't lie. axis2-integration doesn't have any integration tests for axis2-jaxbri.

------------------------------------------
[...truncated 10759 lines...]
Generating <https://builds.apache.org/job/Axis2/ws/axis2/modules/tool/simple-server-maven-plugin/target/apidocs/org/apache/axis2/maven2/server//package-use.html...>
Generating <https://builds.apache.org/job/Axis2/ws/axis2/modules/tool/simple-server-maven-plugin/target/apidocs/org/apache/axis2/maven2/server/util//package-use.html...>
Building index for all the packages and classes...
Generating <https://builds.apache.org/job/Axis2/ws/axis2/modules/tool/simple-server-maven-plugin/target/apidocs/overview-tree.html...>
Generating <https://builds.apache.org/job/Axis2/ws/axis2/modules/tool/simple-server-maven-plugin/target/apidocs/index-all.html...>
Generating <https://builds.apache.org/job/Axis2/ws/axis2/modules/tool/simple-server-maven-plugin/target/apidocs/deprecated-list.html...>
Building index for all classes...
Generating <https://builds.apache.org/job/Axis2/ws/axis2/modules/tool/simple-server-maven-plugin/target/apidocs/allclasses-frame.html...>
Generating <https://builds.apache.org/job/Axis2/ws/axis2/modules/tool/simple-server-maven-plugin/target/apidocs/allclasses-noframe.html...>
Generating <https://builds.apache.org/job/Axis2/ws/axis2/modules/tool/simple-server-maven-plugin/target/apidocs/index.html...>
Generating <https://builds.apache.org/job/Axis2/ws/axis2/modules/tool/simple-server-maven-plugin/target/apidocs/overview-summary.html...>
Generating <https://builds.apache.org/job/Axis2/ws/axis2/modules/tool/simple-server-maven-plugin/target/apidocs/help-doc.html...>
Generating <https://builds.apache.org/job/Axis2/ws/axis2/modules/tool/simple-server-maven-plugin/target/apidocs/stylesheet.css...>
4 warnings
[WARNING] Javadoc Warnings
[WARNING] <https://builds.apache.org/job/Axis2/ws/axis2/modules/tool/simple-server-maven-plugin/src/main/java/org/apache/axis2/maven2/server/SimpleHttpServerMojo.java>:46:
warning - @goal is an unknown tag.
[WARNING] <https://builds.apache.org/job/Axis2/ws/axis2/modules/tool/simple-server-maven-plugin/src/main/java/org/apache/axis2/maven2/server/SimpleHttpServerMojo.java>:46:
warning - @execute is an unknown tag.
[WARNING] <https://builds.apache.org/job/Axis2/ws/axis2/modules/tool/simple-server-maven-plugin/src/main/java/org/apache/axis2/maven2/server/SimpleHttpServerMojo.java>:46:
warning - @requiresDependencyResolution is an unknown tag.
[WARNING] <https://builds.apache.org/job/Axis2/ws/axis2/modules/tool/simple-server-maven-plugin/src/main/java/org/apache/axis2/maven2/server/util/Axis2Server.java>:48:
warning - @param argument "log" is not a parameter name.
[INFO] Building jar: <https://builds.apache.org/job/Axis2/ws/axis2/modules/tool/simple-server-maven-plugin/target/simple-server-maven-plugin-1.7.0-SNAPSHOT-javadoc.jar>
[INFO] [gpg:sign {execution: default}]
[INFO] [install:install {execution: default-install}]
[INFO] Installing <https://builds.apache.org/job/Axis2/ws/axis2/modules/tool/simple-server-maven-plugin/target/simple-server-maven-plugin-1.7.0-SNAPSHOT.jar>
to <https://builds.apache.org/job/Axis2/ws/.repository/org/apache/axis2/simple-server-maven-plugin/1.7.0-SNAPSHOT/simple-server-maven-plugin-1.7.0-SNAPSHOT.jar>
[INFO] Installing <https://builds.apache.org/job/Axis2/ws/axis2/modules/tool/simple-server-maven-plugin/target/simple-server-maven-plugin-1.7.0-SNAPSHOT-sources.jar>
to <https://builds.apache.org/job/Axis2/ws/.repository/org/apache/axis2/simple-server-maven-plugin/1.7.0-SNAPSHOT/simple-server-maven-plugin-1.7.0-SNAPSHOT-sources.jar>
[INFO] Installing <https://builds.apache.org/job/Axis2/ws/axis2/modules/tool/simple-server-maven-plugin/target/simple-server-maven-plugin-1.7.0-SNAPSHOT-javadoc.jar>
to <https://builds.apache.org/job/Axis2/ws/.repository/org/apache/axis2/simple-server-maven-plugin/1.7.0-SNAPSHOT/simple-server-maven-plugin-1.7.0-SNAPSHOT-javadoc.jar>
[INFO] [deploy:deploy {execution: default-deploy}]
[INFO] Retrieving previous build number from apache.snapshots.https
Uploading: https://repository.apache.org/content/repositories/snapshots/org/apache/axis2/simple-server-maven-plugin/1.7.0-SNAPSHOT/simple-server-maven-plugin-1.7.0-20120625.005440-345.jar
19K uploaded  (simple-server-maven-plugin-1.7.0-20120625.005440-345.jar)
[INFO] Retrieving previous metadata from apache.snapshots.https
[INFO] Uploading repository metadata for: 'artifact org.apache.axis2:simple-server-maven-plugin'
[INFO] Retrieving previous metadata from apache.snapshots.https
[INFO] Uploading repository metadata for: 'snapshot org.apache.axis2:simple-server-maven-plugin:1.7.0-SNAPSHOT'
[INFO] Uploading project information for simple-server-maven-plugin 1.7.0-20120625.005440-345
[INFO] Retrieving previous metadata from apache.snapshots.https
[INFO] Uploading repository metadata for: 'org.apache.axis2'
[INFO] Retrieving previous build number from apache.snapshots.https
Uploading: https://repository.apache.org/content/repositories/snapshots/org/apache/axis2/simple-server-maven-plugin/1.7.0-SNAPSHOT/simple-server-maven-plugin-1.7.0-20120625.005440-345-sources.jar
13K uploaded  (simple-server-maven-plugin-1.7.0-20120625.005440-345-sources.jar)
[INFO] Retrieving previous build number from apache.snapshots.https
Uploading: https://repository.apache.org/content/repositories/snapshots/org/apache/axis2/simple-server-maven-plugin/1.7.0-SNAPSHOT/simple-server-maven-plugin-1.7.0-20120625.005440-345-javadoc.jar
51K uploaded  (simple-server-maven-plugin-1.7.0-20120625.005440-345-javadoc.jar)
[JENKINS] Archiving <https://builds.apache.org/job/Axis2/ws/axis2/modules/tool/simple-server-maven-plugin/pom.xml>
to /home/hudson/hudson/jobs/Axis2/modules/org.apache.axis2$simple-server-maven-plugin/builds/2012-06-25_00-54-21/archive/org.apache.axis2/simple-server-maven-plugin/1.7.0-SNAPSHOT/simple-server-maven-plugin-1.7.0-SNAPSHOT.pom
[JENKINS] Archiving <https://builds.apache.org/job/Axis2/ws/axis2/modules/tool/simple-server-maven-plugin/target/simple-server-maven-plugin-1.7.0-SNAPSHOT.jar>
to /home/hudson/hudson/jobs/Axis2/modules/org.apache.axis2$simple-server-maven-plugin/builds/2012-06-25_00-54-21/archive/org.apache.axis2/simple-server-maven-plugin/1.7.0-20120625.005440-345/simple-server-maven-plugin-1.7.0-20120625.005440-345.jar
[JENKINS] Archiving <https://builds.apache.org/job/Axis2/ws/axis2/modules/tool/simple-server-maven-plugin/target/simple-server-maven-plugin-1.7.0-SNAPSHOT-sources.jar>
to /home/hudson/hudson/jobs/Axis2/modules/org.apache.axis2$simple-server-maven-plugin/builds/2012-06-25_00-54-21/archive/org.apache.axis2/simple-server-maven-plugin/1.7.0-20120625.005440-345/simple-server-maven-plugin-1.7.0-20120625.005440-345-sources.jar
[JENKINS] Archiving <https://builds.apache.org/job/Axis2/ws/axis2/modules/tool/simple-server-maven-plugin/target/simple-server-maven-plugin-1.7.0-SNAPSHOT-javadoc.jar>
to /home/hudson/hudson/jobs/Axis2/modules/org.apache.axis2$simple-server-maven-plugin/builds/2012-06-25_00-54-21/archive/org.apache.axis2/simple-server-maven-plugin/1.7.0-20120625.005440-345/simple-server-maven-plugin-1.7.0-20120625.005440-345-javadoc.jar
[INFO] ------------------------------------------------------------------------
[INFO] Building Axis2 quickstart archetype
[INFO]    task-segment: [clean, deploy]
[INFO] ------------------------------------------------------------------------
[INFO] [clean:clean {execution: default-clean}]
[INFO] Deleting directory <https://builds.apache.org/job/Axis2/ws/axis2/modules/tool/archetype/quickstart/target>
[INFO] [remote-resources:process {execution: default}]
[INFO] [resources:resources {execution: default-resources}]
[INFO] Using 'UTF-8' encoding to copy filtered resources.
[INFO] Copying 5 resources
[INFO] Copying 3 resources
[INFO] [resources:testResources {execution: default-testResources}]
[INFO] Using 'UTF-8' encoding to copy filtered resources.
[INFO] skip non existing resourceDirectory <https://builds.apache.org/job/Axis2/ws/axis2/modules/tool/archetype/quickstart/src/test/resources>
[INFO] Copying 3 resources
[INFO] [archetype:jar {execution: default-jar}]
[INFO] Building archetype jar: <https://builds.apache.org/job/Axis2/ws/axis2/modules/tool/archetype/quickstart/target/quickstart-1.7.0-SNAPSHOT>
[INFO] [assembly:single {execution: source-release-assembly}]
[INFO] Skipping the assembly in this project because it's not the Execution Root
[INFO] Preparing source:jar
[WARNING] Removing: jar from forked lifecycle, to prevent recursive invocation.
[INFO] No goals needed for project - skipping
[INFO] [source:jar {execution: attach-sources}]
[INFO] Building jar: <https://builds.apache.org/job/Axis2/ws/axis2/modules/tool/archetype/quickstart/target/quickstart-1.7.0-SNAPSHOT-sources.jar>
[INFO] [javadoc:jar {execution: attach-javadocs}]
[INFO] Not executing Javadoc as the project is not a Java classpath-capable package
[INFO] [archetype:integration-test {execution: default-integration-test}]
[WARNING] No Archetype IT projects: root 'projects' directory not found.
[INFO] [gpg:sign {execution: default}]
[INFO] [install:install {execution: default-install}]
[INFO] Installing <https://builds.apache.org/job/Axis2/ws/axis2/modules/tool/archetype/quickstart/target/quickstart-1.7.0-SNAPSHOT.jar>
to <https://builds.apache.org/job/Axis2/ws/.repository/org/apache/axis2/archetype/quickstart/1.7.0-SNAPSHOT/quickstart-1.7.0-SNAPSHOT.jar>
[INFO] Installing <https://builds.apache.org/job/Axis2/ws/axis2/modules/tool/archetype/quickstart/target/quickstart-1.7.0-SNAPSHOT-sources.jar>
to <https://builds.apache.org/job/Axis2/ws/.repository/org/apache/axis2/archetype/quickstart/1.7.0-SNAPSHOT/quickstart-1.7.0-SNAPSHOT-sources.jar>
[INFO] [archetype:update-local-catalog {execution: default-update-local-catalog}]
[INFO] [deploy:deploy {execution: default-deploy}]
[INFO] Retrieving previous build number from apache.snapshots.https
Uploading: https://repository.apache.org/content/repositories/snapshots/org/apache/axis2/archetype/quickstart/1.7.0-SNAPSHOT/quickstart-1.7.0-20120625.005440-327.jar
8K uploaded  (quickstart-1.7.0-20120625.005440-327.jar)
[INFO] Retrieving previous metadata from apache.snapshots.https
[INFO] Uploading repository metadata for: 'artifact org.apache.axis2.archetype:quickstart'
[INFO] Retrieving previous metadata from apache.snapshots.https
[INFO] Uploading repository metadata for: 'snapshot org.apache.axis2.archetype:quickstart:1.7.0-SNAPSHOT'
[INFO] Uploading project information for quickstart 1.7.0-20120625.005440-327
[INFO] Retrieving previous build number from apache.snapshots.https
Uploading: https://repository.apache.org/content/repositories/snapshots/org/apache/axis2/archetype/quickstart/1.7.0-SNAPSHOT/quickstart-1.7.0-20120625.005440-327-sources.jar
10K uploaded  (quickstart-1.7.0-20120625.005440-327-sources.jar)
[JENKINS] Archiving <https://builds.apache.org/job/Axis2/ws/axis2/modules/tool/archetype/quickstart/pom.xml>
to /home/hudson/hudson/jobs/Axis2/modules/org.apache.axis2.archetype$quickstart/builds/2012-06-25_00-54-21/archive/org.apache.axis2.archetype/quickstart/1.7.0-SNAPSHOT/quickstart-1.7.0-SNAPSHOT.pom
[JENKINS] Archiving <https://builds.apache.org/job/Axis2/ws/axis2/modules/tool/archetype/quickstart/target/quickstart-1.7.0-SNAPSHOT.jar>
to /home/hudson/hudson/jobs/Axis2/modules/org.apache.axis2.archetype$quickstart/builds/2012-06-25_00-54-21/archive/org.apache.axis2.archetype/quickstart/1.7.0-20120625.005440-327/quickstart-1.7.0-20120625.005440-327.jar
[JENKINS] Archiving <https://builds.apache.org/job/Axis2/ws/axis2/modules/tool/archetype/quickstart/target/quickstart-1.7.0-SNAPSHOT-sources.jar>
to /home/hudson/hudson/jobs/Axis2/modules/org.apache.axis2.archetype$quickstart/builds/2012-06-25_00-54-21/archive/org.apache.axis2.archetype/quickstart/1.7.0-20120625.005440-327/quickstart-1.7.0-20120625.005440-327-sources.jar
[INFO] ------------------------------------------------------------------------
[INFO] Building Axis2 quickstart-web archetype
[INFO]    task-segment: [clean, deploy]
[INFO] ------------------------------------------------------------------------
[INFO] [clean:clean {execution: default-clean}]
[INFO] Deleting directory <https://builds.apache.org/job/Axis2/ws/axis2/modules/tool/archetype/quickstart-webapp/target>
[INFO] [remote-resources:process {execution: default}]
[INFO] [resources:resources {execution: default-resources}]
[INFO] Using 'UTF-8' encoding to copy filtered resources.
[INFO] Copying 7 resources
[INFO] Copying 3 resources
[INFO] [resources:testResources {execution: default-testResources}]
[INFO] Using 'UTF-8' encoding to copy filtered resources.
[INFO] skip non existing resourceDirectory <https://builds.apache.org/job/Axis2/ws/axis2/modules/tool/archetype/quickstart-webapp/src/test/resources>
[INFO] Copying 3 resources
[INFO] [archetype:jar {execution: default-jar}]
[INFO] Building archetype jar: <https://builds.apache.org/job/Axis2/ws/axis2/modules/tool/archetype/quickstart-webapp/target/quickstart-webapp-1.7.0-SNAPSHOT>
[INFO] [assembly:single {execution: source-release-assembly}]
[INFO] Skipping the assembly in this project because it's not the Execution Root
[INFO] Preparing source:jar
[WARNING] Removing: jar from forked lifecycle, to prevent recursive invocation.
[INFO] No goals needed for project - skipping
[INFO] [source:jar {execution: attach-sources}]
[INFO] Building jar: <https://builds.apache.org/job/Axis2/ws/axis2/modules/tool/archetype/quickstart-webapp/target/quickstart-webapp-1.7.0-SNAPSHOT-sources.jar>
[INFO] [javadoc:jar {execution: attach-javadocs}]
[INFO] Not executing Javadoc as the project is not a Java classpath-capable package
[INFO] [archetype:integration-test {execution: default-integration-test}]
[WARNING] No Archetype IT projects: root 'projects' directory not found.
[INFO] [gpg:sign {execution: default}]
[INFO] [install:install {execution: default-install}]
[INFO] Installing <https://builds.apache.org/job/Axis2/ws/axis2/modules/tool/archetype/quickstart-webapp/target/quickstart-webapp-1.7.0-SNAPSHOT.jar>
to <https://builds.apache.org/job/Axis2/ws/.repository/org/apache/axis2/archetype/quickstart-webapp/1.7.0-SNAPSHOT/quickstart-webapp-1.7.0-SNAPSHOT.jar>
[INFO] Installing <https://builds.apache.org/job/Axis2/ws/axis2/modules/tool/archetype/quickstart-webapp/target/quickstart-webapp-1.7.0-SNAPSHOT-sources.jar>
to <https://builds.apache.org/job/Axis2/ws/.repository/org/apache/axis2/archetype/quickstart-webapp/1.7.0-SNAPSHOT/quickstart-webapp-1.7.0-SNAPSHOT-sources.jar>
[INFO] [archetype:update-local-catalog {execution: default-update-local-catalog}]
[INFO] [deploy:deploy {execution: default-deploy}]
[INFO] Retrieving previous build number from apache.snapshots.https
Uploading: https://repository.apache.org/content/repositories/snapshots/org/apache/axis2/archetype/quickstart-webapp/1.7.0-SNAPSHOT/quickstart-webapp-1.7.0-20120625.005440-326.jar
10K uploaded  (quickstart-webapp-1.7.0-20120625.005440-326.jar)
[INFO] Retrieving previous metadata from apache.snapshots.https
[INFO] Uploading repository metadata for: 'artifact org.apache.axis2.archetype:quickstart-webapp'
[INFO] Retrieving previous metadata from apache.snapshots.https
[INFO] Uploading repository metadata for: 'snapshot org.apache.axis2.archetype:quickstart-webapp:1.7.0-SNAPSHOT'
[INFO] Uploading project information for quickstart-webapp 1.7.0-20120625.005440-326
[INFO] Retrieving previous build number from apache.snapshots.https
Uploading: https://repository.apache.org/content/repositories/snapshots/org/apache/axis2/archetype/quickstart-webapp/1.7.0-SNAPSHOT/quickstart-webapp-1.7.0-20120625.005440-326-sources.jar
12K uploaded  (quickstart-webapp-1.7.0-20120625.005440-326-sources.jar)
[JENKINS] Archiving <https://builds.apache.org/job/Axis2/ws/axis2/modules/tool/archetype/quickstart-webapp/pom.xml>
to /home/hudson/hudson/jobs/Axis2/modules/org.apache.axis2.archetype$quickstart-webapp/builds/2012-06-25_00-54-21/archive/org.apache.axis2.archetype/quickstart-webapp/1.7.0-SNAPSHOT/quickstart-webapp-1.7.0-SNAPSHOT.pom
[JENKINS] Archiving <https://builds.apache.org/job/Axis2/ws/axis2/modules/tool/archetype/quickstart-webapp/target/quickstart-webapp-1.7.0-SNAPSHOT.jar>
to /home/hudson/hudson/jobs/Axis2/modules/org.apache.axis2.archetype$quickstart-webapp/builds/2012-06-25_00-54-21/archive/org.apache.axis2.archetype/quickstart-webapp/1.7.0-20120625.005440-326/quickstart-webapp-1.7.0-20120625.005440-326.jar
[JENKINS] Archiving <https://builds.apache.org/job/Axis2/ws/axis2/modules/tool/archetype/quickstart-webapp/target/quickstart-webapp-1.7.0-SNAPSHOT-sources.jar>
to /home/hudson/hudson/jobs/Axis2/modules/org.apache.axis2.archetype$quickstart-webapp/builds/2012-06-25_00-54-21/archive/org.apache.axis2.archetype/quickstart-webapp/1.7.0-20120625.005440-326/quickstart-webapp-1.7.0-20120625.005440-326-sources.jar
[INFO] ------------------------------------------------------------------------
[INFO] Building Apache Axis2 - JAXB-RI Data Binding
[INFO]    task-segment: [clean, deploy]
[INFO] ------------------------------------------------------------------------
[INFO] [clean:clean {execution: default-clean}]
[INFO] Deleting directory <https://builds.apache.org/job/Axis2/ws/axis2/modules/jaxbri/target>
[INFO] [remote-resources:process {execution: default}]
[INFO] [resources:resources {execution: default-resources}]
[INFO] Using 'UTF-8' encoding to copy filtered resources.
[INFO] Copying 1 resource
[INFO] Copying 2 resources
[INFO] [compiler:compile {execution: default-compile}]
[INFO] Compiling 4 source files to <https://builds.apache.org/job/Axis2/ws/axis2/modules/jaxbri/target/classes>
[INFO] [antrun:run {execution: gen-ts}]
[INFO] Executing tasks
    [mkdir] Created dir: <https://builds.apache.org/job/Axis2/ws/axis2/modules/jaxbri/target/schema>
    [mkdir] Created dir: <https://builds.apache.org/job/Axis2/ws/axis2/modules/jaxbri/target/schema/src>
    [mkdir] Created dir: <https://builds.apache.org/job/Axis2/ws/axis2/modules/jaxbri/target/schema/classes>
     [echo] Generating JAX-B classes for DocLitBareService test
     [echo] Generating Service / Service Client for Test01 test
     [java] Retrieving document at 'src/test/wsdl/Test01.wsdl'.
     [java] Retrieving document at 'src/test/wsdl/Test01.wsdl'.
[INFO] Executed tasks
[INFO] [resources:copy-resources {execution: create-repo}]
[INFO] Using 'UTF-8' encoding to copy filtered resources.
[INFO] Copying 1 resource
[INFO] Copying 2 resources to services/Test01.aar/META-INF
[INFO] [resources:testResources {execution: default-testResources}]
[INFO] Using 'UTF-8' encoding to copy filtered resources.
[INFO] skip non existing resourceDirectory <https://builds.apache.org/job/Axis2/ws/axis2/modules/jaxbri/src/test/resources>
[INFO] Copying 2 resources
[INFO] [build-helper:add-test-source {execution: add-test-source}]
[INFO] Test Source directory: <https://builds.apache.org/job/Axis2/ws/axis2/modules/jaxbri/target/schema/src>
added.
[INFO] Test Source directory: <https://builds.apache.org/job/Axis2/ws/axis2/modules/jaxbri/target/gen/Test01/src>
added.
[INFO] [compiler:testCompile {execution: default-testCompile}]
[INFO] Compiling 91 source files to <https://builds.apache.org/job/Axis2/ws/axis2/modules/jaxbri/target/test-classes>
[INFO] -------------------------------------------------------------
[ERROR] COMPILATION ERROR : 
[INFO] -------------------------------------------------------------
[ERROR] <https://builds.apache.org/job/Axis2/ws/axis2/modules/jaxbri/src/test/java/org/apache/axis2/jaxbri/Test01Test.java>:[26,34]
cannot find symbol
symbol  : class UtilServer
location: package org.apache.axis2.testutils

[ERROR] <https://builds.apache.org/job/Axis2/ws/axis2/modules/jaxbri/src/test/java/org/apache/axis2/jaxbri/Test01Test.java>:[38,8]
cannot find symbol
symbol  : variable UtilServer
location: class org.apache.axis2.jaxbri.Test01Test

[ERROR] <https://builds.apache.org/job/Axis2/ws/axis2/modules/jaxbri/src/test/java/org/apache/axis2/jaxbri/Test01Test.java>:[39,46]
cannot find symbol
symbol  : variable UtilServer
location: class org.apache.axis2.jaxbri.Test01Test

[ERROR] <https://builds.apache.org/job/Axis2/ws/axis2/modules/jaxbri/src/test/java/org/apache/axis2/jaxbri/Test01Test.java>:[46,8]
cannot find symbol
symbol  : variable UtilServer
location: class org.apache.axis2.jaxbri.Test01Test

[ERROR] <https://builds.apache.org/job/Axis2/ws/axis2/modules/jaxbri/src/test/java/org/apache/axis2/jaxbri/Test01Test.java>:[51,37]
cannot find symbol
symbol  : variable UtilServer
location: class org.apache.axis2.jaxbri.Test01Test

[ERROR] <https://builds.apache.org/job/Axis2/ws/axis2/modules/jaxbri/src/test/java/org/apache/axis2/jaxbri/Test01Test.java>:[51,97]
cannot find symbol
symbol  : variable UtilServer
location: class org.apache.axis2.jaxbri.Test01Test

[INFO] 6 errors 
[INFO] -------------------------------------------------------------
[JENKINS] Archiving <https://builds.apache.org/job/Axis2/ws/axis2/modules/jaxbri/pom.xml>
to /home/hudson/hudson/jobs/Axis2/modules/org.apache.axis2$axis2-jaxbri/builds/2012-06-25_00-54-22/archive/org.apache.axis2/axis2-jaxbri/1.7.0-SNAPSHOT/axis2-jaxbri-1.7.0-SNAPSHOT.pom
[INFO] ------------------------------------------------------------------------
[ERROR] BUILD FAILURE
[INFO] ------------------------------------------------------------------------
[INFO] Compilation failure

<https://builds.apache.org/job/Axis2/ws/axis2/modules/jaxbri/src/test/java/org/apache/axis2/jaxbri/Test01Test.java>:[26,34]
cannot find symbol
symbol  : class UtilServer
location: package org.apache.axis2.testutils

<https://builds.apache.org/job/Axis2/ws/axis2/modules/jaxbri/src/test/java/org/apache/axis2/jaxbri/Test01Test.java>:[38,8]
cannot find symbol
symbol  : variable UtilServer
location: class org.apache.axis2.jaxbri.Test01Test

<https://builds.apache.org/job/Axis2/ws/axis2/modules/jaxbri/src/test/java/org/apache/axis2/jaxbri/Test01Test.java>:[39,46]
cannot find symbol
symbol  : variable UtilServer
location: class org.apache.axis2.jaxbri.Test01Test

<https://builds.apache.org/job/Axis2/ws/axis2/modules/jaxbri/src/test/java/org/apache/axis2/jaxbri/Test01Test.java>:[46,8]
cannot find symbol
symbol  : variable UtilServer
location: class org.apache.axis2.jaxbri.Test01Test

<https://builds.apache.org/job/Axis2/ws/axis2/modules/jaxbri/src/test/java/org/apache/axis2/jaxbri/Test01Test.java>:[51,37]
cannot find symbol
symbol  : variable UtilServer
location: class org.apache.axis2.jaxbri.Test01Test

<https://builds.apache.org/job/Axis2/ws/axis2/modules/jaxbri/src/test/java/org/apache/axis2/jaxbri/Test01Test.java>:[51,97]
cannot find symbol
symbol  : variable UtilServer
location: class org.apache.axis2.jaxbri.Test01Test


[INFO] ------------------------------------------------------------------------
[INFO] For more information, run Maven with the -e switch
[INFO] ------------------------------------------------------------------------
[INFO] Total time: 31 minutes 7 seconds
[INFO] Finished at: Mon Jun 25 01:25:35 GMT 2012
[INFO] Final Memory: 137M/247M
[INFO] ------------------------------------------------------------------------
Sending e-mails to: java-dev@axis.apache.org andreas.veithen@gmail.com
channel stopped
[locks-and-latches] Releasing all the locks
[locks-and-latches] All the locks released

---------------------------------------------------------------------
To unsubscribe, e-mail: java-dev-unsubscribe@axis.apache.org
For additional commands, e-mail: java-dev-help@axis.apache.org


Mime
View raw message