axis-java-dev mailing list archives

Site index · List index
Message view « Date » · « Thread »
Top « Date » · « Thread »
From Apache Jenkins Server <jenk...@builds.apache.org>
Subject Build failed in Jenkins: axis2-transports-trunk #877
Date Mon, 04 Jun 2012 02:34:50 GMT
See <https://builds.apache.org/job/axis2-transports-trunk/877/>

------------------------------------------
[...truncated 421 lines...]
INFO: Deploying module: addressing - <https://builds.apache.org/job/axis2-transports-trunk/ws/transports/modules/tcp/target/test-resources/samples/modules/addressing.mar>
Jun 4, 2012 2:34:35 AM org.apache.axis2.deployment.DeploymentEngine initializeDeployers
INFO: Can not instantiate org.apache.axis2.jaxws.framework.JAXWSServiceBuilderExtension, not
abale to use JAX-WS with ServiceDeployer
Jun 4, 2012 2:34:35 AM org.apache.axis2.transport.base.AbstractTransportSender init
INFO: TCP Sender started
Jun 4, 2012 2:34:35 AM org.apache.axis2.transport.base.AbstractTransportListener stop
INFO: TCP Listener Shutdown
Jun 4, 2012 2:34:35 AM org.apache.axis2.transport.tcp.TCPServer stopServer
INFO: TCP server stopped on port : 5555
<my:echoOMElementResponse xmlns:my="http://localhost/my"><my:myValue>Isaac Asimov,
The Foundation Trilogy</my:myValue></my:echoOMElementResponse>Server stopped .....<https://builds.apache.org/job/axis2-transports-trunk/ws/transports/modules/tcp/target/test-resources/samples>
Jun 4, 2012 2:34:35 AM org.apache.axis2.deployment.DeploymentEngine prepareRepository
INFO: No services directory was found under <https://builds.apache.org/job/axis2-transports-trunk/ws/transports/modules/tcp/target/test-resources/samples.>
Jun 4, 2012 2:34:35 AM org.apache.axis2.deployment.ModuleDeployer deploy
INFO: Deploying module: addressing - <https://builds.apache.org/job/axis2-transports-trunk/ws/transports/modules/tcp/target/test-resources/samples/modules/addressing.mar>
Jun 4, 2012 2:34:35 AM org.apache.axis2.deployment.DeploymentEngine initializeDeployers
INFO: Can not instantiate org.apache.axis2.jaxws.framework.JAXWSServiceBuilderExtension, not
abale to use JAX-WS with ServiceDeployer
Jun 4, 2012 2:34:35 AM org.apache.axis2.transport.base.AbstractTransportSender init
INFO: TCP Sender started
Jun 4, 2012 2:34:36 AM org.apache.axis2.transport.base.AbstractTransportListener start
INFO: TCP listener started
Jun 4, 2012 2:34:36 AM org.apache.axis2.transport.tcp.TCPServer startServer
INFO: TCP server started on port : 5555
Jun 4, 2012 2:34:36 AM org.apache.axis2.deployment.DeploymentEngine prepareRepository
INFO: No services directory was found under <https://builds.apache.org/job/axis2-transports-trunk/ws/transports/modules/tcp/target/test-resources/samples.>
Jun 4, 2012 2:34:36 AM org.apache.axis2.deployment.ModuleDeployer deploy
INFO: Deploying module: addressing - <https://builds.apache.org/job/axis2-transports-trunk/ws/transports/modules/tcp/target/test-resources/samples/modules/addressing.mar>
Jun 4, 2012 2:34:36 AM org.apache.axis2.deployment.DeploymentEngine initializeDeployers
INFO: Can not instantiate org.apache.axis2.jaxws.framework.JAXWSServiceBuilderExtension, not
abale to use JAX-WS with ServiceDeployer
Jun 4, 2012 2:34:36 AM org.apache.axis2.transport.base.AbstractTransportSender init
INFO: TCP Sender started
Jun 4, 2012 2:34:36 AM org.apache.axis2.transport.base.AbstractTransportListener start
INFO: TCP listener started
Jun 4, 2012 2:34:36 AM org.apache.axis2.transport.tcp.TCPServer startServer
INFO: TCP server started on port : 5556
Jun 4, 2012 2:34:37 AM org.apache.axis2.transport.base.AbstractTransportListener stop
INFO: TCP Listener Shutdown
Jun 4, 2012 2:34:37 AM org.apache.axis2.transport.tcp.TCPServer stopServer
INFO: TCP server stopped on port : 5555
Jun 4, 2012 2:34:37 AM org.apache.axis2.transport.base.AbstractTransportListener stop
INFO: TCP Listener Shutdown
Jun 4, 2012 2:34:37 AM org.apache.axis2.transport.tcp.TCPServer stopServer
INFO: TCP server stopped on port : 5556
Jun 4, 2012 2:34:37 AM org.apache.axis2.transport.base.AbstractTransportSender stop
INFO: TCP Sender Shutdown
<my:echoOMElementResponse xmlns:my="http://localhost/my"><my:myValue>Isaac Asimov,
The Foundation Trilogy</my:myValue></my:echoOMElementResponse>Server stopped .....<https://builds.apache.org/job/axis2-transports-trunk/ws/transports/modules/tcp/target/test-resources/samples>
Jun 4, 2012 2:34:37 AM org.apache.axis2.deployment.DeploymentEngine prepareRepository
INFO: No services directory was found under <https://builds.apache.org/job/axis2-transports-trunk/ws/transports/modules/tcp/target/test-resources/samples.>
Jun 4, 2012 2:34:37 AM org.apache.axis2.deployment.ModuleDeployer deploy
INFO: Deploying module: addressing - <https://builds.apache.org/job/axis2-transports-trunk/ws/transports/modules/tcp/target/test-resources/samples/modules/addressing.mar>
Jun 4, 2012 2:34:37 AM org.apache.axis2.deployment.DeploymentEngine initializeDeployers
INFO: Can not instantiate org.apache.axis2.jaxws.framework.JAXWSServiceBuilderExtension, not
abale to use JAX-WS with ServiceDeployer
Jun 4, 2012 2:34:37 AM org.apache.axis2.transport.base.AbstractTransportSender init
INFO: TCP Sender started
Jun 4, 2012 2:34:38 AM org.apache.axis2.transport.base.AbstractTransportListener start
INFO: TCP listener started
Jun 4, 2012 2:34:38 AM org.apache.axis2.transport.tcp.TCPServer startServer
INFO: TCP server started on port : 5555
Jun 4, 2012 2:34:38 AM org.apache.axis2.deployment.DeploymentEngine prepareRepository
INFO: No services directory was found under <https://builds.apache.org/job/axis2-transports-trunk/ws/transports/modules/tcp/target/test-resources/samples.>
Jun 4, 2012 2:34:38 AM org.apache.axis2.deployment.ModuleDeployer deploy
INFO: Deploying module: addressing - <https://builds.apache.org/job/axis2-transports-trunk/ws/transports/modules/tcp/target/test-resources/samples/modules/addressing.mar>
Jun 4, 2012 2:34:38 AM org.apache.axis2.deployment.DeploymentEngine initializeDeployers
INFO: Can not instantiate org.apache.axis2.jaxws.framework.JAXWSServiceBuilderExtension, not
abale to use JAX-WS with ServiceDeployer
Jun 4, 2012 2:34:38 AM org.apache.axis2.transport.base.AbstractTransportSender init
INFO: TCP Sender started
Jun 4, 2012 2:34:38 AM org.apache.axis2.transport.base.AbstractTransportListener stop
INFO: TCP Listener Shutdown
Jun 4, 2012 2:34:38 AM org.apache.axis2.transport.tcp.TCPServer stopServer
INFO: TCP server stopped on port : 5555
<soapenv:Body xmlns:soapenv="http://schemas.xmlsoap.org/soap/envelope/"><my:echoOMElementResponse
xmlns:my="http://localhost/my"><my:myValue>Isaac Asimov, The Foundation Trilogy</my:myValue></my:echoOMElementResponse></soapenv:Body>Server
stopped .....@SLTests run: 4, Failures: 0, Errors: 0, Skipped: 0, Time elapsed: 5.889 sec
Running org.apache.axis2.transport.tcp.TCPTwoChannelEchoRawXMLTest
<https://builds.apache.org/job/axis2-transports-trunk/ws/transports/modules/tcp/target/test-resources/samples>
Jun 4, 2012 2:34:38 AM org.apache.axis2.deployment.DeploymentEngine prepareRepository
INFO: No services directory was found under <https://builds.apache.org/job/axis2-transports-trunk/ws/transports/modules/tcp/target/test-resources/samples.>
Jun 4, 2012 2:34:38 AM org.apache.axis2.deployment.ModuleDeployer deploy
INFO: Deploying module: addressing - <https://builds.apache.org/job/axis2-transports-trunk/ws/transports/modules/tcp/target/test-resources/samples/modules/addressing.mar>
Jun 4, 2012 2:34:38 AM org.apache.axis2.deployment.DeploymentEngine initializeDeployers
INFO: Can not instantiate org.apache.axis2.jaxws.framework.JAXWSServiceBuilderExtension, not
abale to use JAX-WS with ServiceDeployer
Jun 4, 2012 2:34:38 AM org.apache.axis2.transport.base.AbstractTransportSender init
INFO: TCP Sender started
Jun 4, 2012 2:34:39 AM org.apache.axis2.transport.base.AbstractTransportListener start
INFO: TCP listener started
Jun 4, 2012 2:34:39 AM org.apache.axis2.transport.tcp.TCPServer startServer
INFO: TCP server started on port : 5555
Jun 4, 2012 2:34:39 AM org.apache.axis2.deployment.DeploymentEngine prepareRepository
INFO: No services directory was found under <https://builds.apache.org/job/axis2-transports-trunk/ws/transports/modules/tcp/target/test-resources/samples.>
Jun 4, 2012 2:34:39 AM org.apache.axis2.deployment.ModuleDeployer deploy
INFO: Deploying module: addressing - <https://builds.apache.org/job/axis2-transports-trunk/ws/transports/modules/tcp/target/test-resources/samples/modules/addressing.mar>
Jun 4, 2012 2:34:39 AM org.apache.axis2.deployment.DeploymentEngine initializeDeployers
INFO: Can not instantiate org.apache.axis2.jaxws.framework.JAXWSServiceBuilderExtension, not
abale to use JAX-WS with ServiceDeployer
Jun 4, 2012 2:34:39 AM org.apache.axis2.transport.base.AbstractTransportSender init
INFO: TCP Sender started
Jun 4, 2012 2:34:39 AM org.apache.axis2.transport.base.AbstractTransportListener start
INFO: TCP listener started
Jun 4, 2012 2:34:39 AM org.apache.axis2.transport.tcp.TCPServer startServer
INFO: TCP server started on port : 5556
Jun 4, 2012 2:34:40 AM org.apache.axis2.transport.base.AbstractTransportListener stop
INFO: TCP Listener Shutdown
Jun 4, 2012 2:34:40 AM org.apache.axis2.transport.tcp.TCPServer stopServer
INFO: TCP server stopped on port : 5555
Jun 4, 2012 2:34:40 AM org.apache.axis2.transport.base.AbstractTransportListener stop
INFO: TCP Listener Shutdown
Jun 4, 2012 2:34:40 AM org.apache.axis2.transport.tcp.TCPServer stopServer
INFO: TCP server stopped on port : 5556
Jun 4, 2012 2:34:40 AM org.apache.axis2.transport.base.AbstractTransportSender stop
INFO: TCP Sender Shutdown
<?xml version='1.0' encoding='utf-8'?><soapenv:Envelope xmlns:soapenv="http://schemas.xmlsoap.org/soap/envelope/"><soapenv:Header
xmlns:wsa="http://www.w3.org/2005/08/addressing"><wsa:To>tcp://67.195.138.60:5556/axis2/services/EchoXMLService</wsa:To><wsa:ReplyTo><wsa:Address>http://www.w3.org/2005/08/addressing/none</wsa:Address></wsa:ReplyTo><wsa:MessageID>urn:uuid:86385cb9-c2a2-4db3-910f-b44116daebf9</wsa:MessageID><wsa:Action>urn:echoOMElementResponse</wsa:Action><wsa:RelatesTo>urn:uuid:94b40783-c49a-4ba9-8308-1101560be64c</wsa:RelatesTo></soapenv:Header><soapenv:Body><my:echoOMElementResponse
xmlns:my="http://localhost/my"><my:myValue>Isaac Asimov, The Foundation Trilogy</my:myValue></my:echoOMElementResponse></soapenv:Body></soapenv:Envelope>Server
stopped .....@SLTests run: 1, Failures: 0, Errors: 0, Skipped: 0, Time elapsed: 2.057 sec

Results :

Tests run: 5, Failures: 0, Errors: 0, Skipped: 0

[JENKINS] Recording test results
[INFO] [bundle:bundle {execution: default-bundle}]
[INFO] Preparing source:jar
[WARNING] Removing: jar from forked lifecycle, to prevent recursive invocation.
[INFO] No goals needed for project - skipping
[INFO] [source:jar {execution: default}]
[INFO] Building jar: <https://builds.apache.org/job/axis2-transports-trunk/ws/transports/modules/tcp/target/axis2-transport-tcp-1.7.0-SNAPSHOT-sources.jar>
[INFO] [install:install {execution: default-install}]
[INFO] Installing <https://builds.apache.org/job/axis2-transports-trunk/ws/transports/modules/tcp/target/axis2-transport-tcp-1.7.0-SNAPSHOT.jar>
to <https://builds.apache.org/job/axis2-transports-trunk/ws/.repository/org/apache/axis2/axis2-transport-tcp/1.7.0-SNAPSHOT/axis2-transport-tcp-1.7.0-SNAPSHOT.jar>
[INFO] Installing <https://builds.apache.org/job/axis2-transports-trunk/ws/transports/modules/tcp/target/axis2-transport-tcp-1.7.0-SNAPSHOT-sources.jar>
to <https://builds.apache.org/job/axis2-transports-trunk/ws/.repository/org/apache/axis2/axis2-transport-tcp/1.7.0-SNAPSHOT/axis2-transport-tcp-1.7.0-SNAPSHOT-sources.jar>
[INFO] [bundle:install {execution: default-install}]
[INFO] Parsing <https://builds.apache.org/job/axis2-transports-trunk/ws/.repository/repository.xml>
[INFO] Installing org/apache/axis2/axis2-transport-tcp/1.7.0-SNAPSHOT/axis2-transport-tcp-1.7.0-SNAPSHOT.jar
[INFO] Writing OBR metadata
[INFO] [deploy:deploy {execution: default-deploy}]
[INFO] Retrieving previous build number from apache.snapshots.https
[WARNING] *** CHECKSUM FAILED - Checksum failed on download: local = 'fca310e99ea3445d9d71e7f296e2f331b2a2ffe0';
remote = 'c1be288f8db79c505bc896786d7a38f0ec880947' - RETRYING
[WARNING] *** CHECKSUM FAILED - Checksum failed on download: local = 'fca310e99ea3445d9d71e7f296e2f331b2a2ffe0';
remote = 'c1be288f8db79c505bc896786d7a38f0ec880947' - IGNORING
Uploading: https://repository.apache.org/content/repositories/snapshots/org/apache/axis2/axis2-transport-tcp/1.7.0-SNAPSHOT/axis2-transport-tcp-1.7.0-20120604.023319-414.jar
26K uploaded  (axis2-transport-tcp-1.7.0-20120604.023319-414.jar)
[INFO] Retrieving previous metadata from apache.snapshots.https
[WARNING] *** CHECKSUM FAILED - Checksum failed on download: local = 'fca310e99ea3445d9d71e7f296e2f331b2a2ffe0';
remote = 'c1be288f8db79c505bc896786d7a38f0ec880947' - RETRYING
[WARNING] *** CHECKSUM FAILED - Checksum failed on download: local = 'fca310e99ea3445d9d71e7f296e2f331b2a2ffe0';
remote = 'c1be288f8db79c505bc896786d7a38f0ec880947' - IGNORING
[INFO] Uploading repository metadata for: 'snapshot org.apache.axis2:axis2-transport-tcp:1.7.0-SNAPSHOT'
[INFO] Retrieving previous metadata from apache.snapshots.https
[INFO] Uploading repository metadata for: 'artifact org.apache.axis2:axis2-transport-tcp'
[INFO] Uploading project information for axis2-transport-tcp 1.7.0-20120604.023319-414
[INFO] Retrieving previous build number from apache.snapshots.https
Uploading: https://repository.apache.org/content/repositories/snapshots/org/apache/axis2/axis2-transport-tcp/1.7.0-SNAPSHOT/axis2-transport-tcp-1.7.0-20120604.023319-414-sources.jar
21K uploaded  (axis2-transport-tcp-1.7.0-20120604.023319-414-sources.jar)
[INFO] [bundle:deploy {execution: default-deploy}]
[INFO] Remote OBR update disabled (enable with -DremoteOBR)
[JENKINS] Archiving <https://builds.apache.org/job/axis2-transports-trunk/ws/transports/modules/tcp/pom.xml>
to /home/hudson/hudson/jobs/axis2-transports-trunk/modules/org.apache.axis2$axis2-transport-tcp/builds/2012-06-04_02-32-38/archive/org.apache.axis2/axis2-transport-tcp/1.7.0-SNAPSHOT/axis2-transport-tcp-1.7.0-SNAPSHOT.pom
[JENKINS] Archiving <https://builds.apache.org/job/axis2-transports-trunk/ws/transports/modules/tcp/target/axis2-transport-tcp-1.7.0-SNAPSHOT.jar>
to /home/hudson/hudson/jobs/axis2-transports-trunk/modules/org.apache.axis2$axis2-transport-tcp/builds/2012-06-04_02-32-38/archive/org.apache.axis2/axis2-transport-tcp/1.7.0-20120604.023319-414/axis2-transport-tcp-1.7.0-20120604.023319-414.jar
[JENKINS] Archiving <https://builds.apache.org/job/axis2-transports-trunk/ws/transports/modules/tcp/target/axis2-transport-tcp-1.7.0-SNAPSHOT-sources.jar>
to /home/hudson/hudson/jobs/axis2-transports-trunk/modules/org.apache.axis2$axis2-transport-tcp/builds/2012-06-04_02-32-38/archive/org.apache.axis2/axis2-transport-tcp/1.7.0-20120604.023319-414/axis2-transport-tcp-1.7.0-20120604.023319-414-sources.jar
[INFO] ------------------------------------------------------------------------
[INFO] Building Apache Axis2 - Transport - UDP
[INFO]    task-segment: [clean, deploy]
[INFO] ------------------------------------------------------------------------
[INFO] [clean:clean {execution: default-clean}]
[INFO] Deleting <https://builds.apache.org/job/axis2-transports-trunk/ws/transports/modules/udp/target>
[INFO] [remote-resources:process {execution: default}]
[INFO] [resources:resources {execution: default-resources}]
[INFO] Using 'UTF-8' encoding to copy filtered resources.
[INFO] skip non existing resourceDirectory <https://builds.apache.org/job/axis2-transports-trunk/ws/transports/modules/udp/src/main/resources>
[INFO] Copying 3 resources
[INFO] [compiler:compile {execution: default-compile}]
[INFO] Compiling 7 source files to <https://builds.apache.org/job/axis2-transports-trunk/ws/transports/modules/udp/target/classes>
[INFO] [resources:testResources {execution: default-testResources}]
[INFO] Using 'UTF-8' encoding to copy filtered resources.
[INFO] skip non existing resourceDirectory <https://builds.apache.org/job/axis2-transports-trunk/ws/transports/modules/udp/src/test/resources>
[INFO] Copying 3 resources
[INFO] [compiler:testCompile {execution: default-testCompile}]
[INFO] Compiling 4 source files to <https://builds.apache.org/job/axis2-transports-trunk/ws/transports/modules/udp/target/test-classes>
[INFO] [surefire:test {execution: default-test}]
[INFO] Surefire report directory: <https://builds.apache.org/job/axis2-transports-trunk/ws/transports/modules/udp/target/surefire-reports>

-------------------------------------------------------
 T E S T S
-------------------------------------------------------
Running org.apache.axis2.transport.udp.UDPTransportTest
log4j:WARN No appenders could be found for logger (org.apache.axis2.engine.Phase).
log4j:WARN Please initialize the log4j system properly.
Tests run: 6, Failures: 0, Errors: 0, Skipped: 0, Time elapsed: 1.083 sec
Running org.apache.axis2.transport.udp.UDPTest
Tests run: 1, Failures: 0, Errors: 0, Skipped: 0, Time elapsed: 0.086 sec

Results :

Tests run: 7, Failures: 0, Errors: 0, Skipped: 0

[JENKINS] Recording test resultsJun 4, 2012 2:34:48 AM hudson.remoting.SynchronousCommandTransport$ReaderThread
run
SEVERE: I/O error in channel channel
java.io.StreamCorruptedException

	at java.io.ObjectInputStream.readObject0(ObjectInputStream.java:1332)
	at java.io.ObjectInputStream.readObject(ObjectInputStream.java:348)
	at hudson.remoting.Command.readFrom(Command.java:90)
	at hudson.remoting.ClassicCommandTransport.read(ClassicCommandTransport.java:59)
	at hudson.remoting.SynchronousCommandTransport$ReaderThread.run(SynchronousCommandTransport.java:48)
channel stopped
[INFO] ------------------------------------------------------------------------
[ERROR] FATAL ERROR
[INFO] ------------------------------------------------------------------------
[INFO] null
[INFO] ------------------------------------------------------------------------
[INFO] Trace
java.lang.reflect.UndeclaredThrowableException
	at $Proxy2.isArchivingDisabled(Unknown Source)
	at hudson.maven.MavenBuildProxy$Filter.isArchivingDisabled(MavenBuildProxy.java:227)
	at hudson.maven.reporters.MavenArtifact.archive(MavenArtifact.java:223)
	at hudson.maven.reporters.MavenArtifactArchiver.postBuild(MavenArtifactArchiver.java:108)
	at hudson.maven.Maven2Builder.postModule(Maven2Builder.java:127)
	at hudson.maven.MavenBuilder$Adapter.fireLeaveModule(MavenBuilder.java:327)
	at hudson.maven.MavenBuilder$Adapter.postBuild(MavenBuilder.java:285)
	at org.apache.maven.lifecycle.LifecycleExecutorInterceptor.execute(LifecycleExecutorInterceptor.java:68)
	at org.apache.maven.DefaultMaven.doExecute(DefaultMaven.java:328)
	at org.apache.maven.DefaultMaven.execute(DefaultMaven.java:138)
	at org.apache.maven.cli.MavenCli.main(MavenCli.java:362)
	at sun.reflect.NativeMethodAccessorImpl.invoke0(Native Method)
	at sun.reflect.NativeMethodAccessorImpl.invoke(NativeMethodAccessorImpl.java:39)
	at sun.reflect.DelegatingMethodAccessorImpl.invoke(DelegatingMethodAccessorImpl.java:25)
	at java.lang.reflect.Method.invoke(Method.java:592)
	at org.codehaus.classworlds.Launcher.launchEnhanced(Launcher.java:315)
	at org.codehaus.classworlds.Launcher.launch(Launcher.java:255)
	at hudson.maven.agent.Main.launch(Main.java:185)
	at hudson.maven.MavenBuilder.call(MavenBuilder.java:151)
	at hudson.maven.Maven2Builder.call(Maven2Builder.java:77)
	at hudson.maven.Maven2Builder.call(Maven2Builder.java:53)
	at hudson.remoting.UserRequest.perform(UserRequest.java:118)
	at hudson.remoting.UserRequest.perform(UserRequest.java:48)
	at hudson.remoting.Request$2.run(Request.java:287)
	at hudson.remoting.InterceptingExecutorService$1.call(InterceptingExecutorService.java:72)
	at java.util.concurrent.FutureTask$Sync.innerRun(FutureTask.java:269)
	at java.util.concurrent.FutureTask.run(FutureTask.java:123)
	at java.util.concurrent.ThreadPoolExecutor$Worker.runTask(ThreadPoolExecutor.java:651)
	at java.util.concurrent.ThreadPoolExecutor$Worker.run(ThreadPoolExecutor.java:676)
	at java.lang.Thread.run(Thread.java:595)
Caused by: hudson.remoting.ChannelClosedException: channel is already closed
	at hudson.remoting.Channel.send(Channel.java:475)
	at hudson.remoting.Request.call(Request.java:110)
	at hudson.remoting.Channel.call(Channel.java:646)
	at hudson.remoting.RemoteInvocationHandler.invoke(RemoteInvocationHandler.java:158)
	... 30 more
Caused by: java.io.StreamCorruptedException
	at java.io.ObjectInputStream.readObject0(ObjectInputStream.java:1332)
	at java.io.ObjectInputStream.readObject(ObjectInputStream.java:348)
	at hudson.remoting.Command.readFrom(Command.java:90)
	at hudson.remoting.ClassicCommandTransport.read(ClassicCommandTransport.java:59)
	at hudson.remoting.SynchronousCommandTransport$ReaderThread.run(SynchronousCommandTransport.java:48)
[INFO] ------------------------------------------------------------------------
[INFO] Total time: 1 minute 46 seconds
[INFO] Finished at: Mon Jun 04 02:34:48 UTC 2012
[locks-and-latches] Releasing all the locks
[locks-and-latches] All the locks released
ERROR: Maven JVM terminated unexpectedly with exit code 0


---------------------------------------------------------------------
To unsubscribe, e-mail: java-dev-unsubscribe@axis.apache.org
For additional commands, e-mail: java-dev-help@axis.apache.org


Mime
View raw message