axis-java-dev mailing list archives

Site index · List index
Message view « Date » · « Thread »
Top « Date » · « Thread »
From Apache Jenkins Server <jenk...@builds.apache.org>
Subject Build failed in Jenkins: axis2-1.6 #302
Date Thu, 21 Jun 2012 07:04:35 GMT
See <https://builds.apache.org/job/axis2-1.6/302/changes>

Changes:

[sagara] AXIS2-5348 - Merged r1352413 to 1.6 branch.

[sagara] AXIS2-5349 - Merged r1352413 to 1.6 branch.

------------------------------------------
[...truncated 3362 lines...]
Generating <https://builds.apache.org/job/axis2-1.6/ws/axis2/modules/adb-codegen/target/apidocs/deprecated-list.html...>
Building index for all classes...
Generating <https://builds.apache.org/job/axis2-1.6/ws/axis2/modules/adb-codegen/target/apidocs/allclasses-frame.html...>
Generating <https://builds.apache.org/job/axis2-1.6/ws/axis2/modules/adb-codegen/target/apidocs/allclasses-noframe.html...>
Generating <https://builds.apache.org/job/axis2-1.6/ws/axis2/modules/adb-codegen/target/apidocs/index.html...>
Generating <https://builds.apache.org/job/axis2-1.6/ws/axis2/modules/adb-codegen/target/apidocs/overview-summary.html...>
Generating <https://builds.apache.org/job/axis2-1.6/ws/axis2/modules/adb-codegen/target/apidocs/help-doc.html...>
Generating <https://builds.apache.org/job/axis2-1.6/ws/axis2/modules/adb-codegen/target/apidocs/stylesheet.css...>
8 warnings
[WARNING] Javadoc Warnings
[WARNING] <https://builds.apache.org/job/axis2-1.6/ws/axis2/modules/adb-codegen/src/org/apache/axis2/schema/BeanWriterMetaInfoHolder.java>:298:
warning - @param argument "qName" is not a parameter name.
[WARNING] <https://builds.apache.org/job/axis2-1.6/ws/axis2/modules/adb-codegen/src/org/apache/axis2/schema/BeanWriterMetaInfoHolder.java>:298:
warning - @param argument "schemaName" is not a parameter name.
[WARNING] <https://builds.apache.org/job/axis2-1.6/ws/axis2/modules/adb-codegen/src/org/apache/axis2/schema/BeanWriterMetaInfoHolder.java>:298:
warning - @param argument "javaClassName" is not a parameter name.
[WARNING] <https://builds.apache.org/job/axis2-1.6/ws/axis2/modules/adb-codegen/src/org/apache/axis2/schema/writer/BeanWriter.java>:75:
warning - @param argument "complexType" is not a parameter name.
[WARNING] <https://builds.apache.org/job/axis2-1.6/ws/axis2/modules/adb-codegen/src/org/apache/axis2/schema/writer/BeanWriter.java>:75:
warning - @param argument "fullyQualifiedClassName" is not a parameter name.
[WARNING] <https://builds.apache.org/job/axis2-1.6/ws/axis2/modules/adb-codegen/src/org/apache/axis2/schema/writer/BeanWriter.java>:116:
warning - @param argument "mapperPackageName" is not a parameter name.
[WARNING] <https://builds.apache.org/job/axis2-1.6/ws/axis2/modules/adb-codegen/src/org/apache/axis2/schema/writer/BeanWriter.java>:133:
warning - @param argument "namespaceToUse" is not a parameter name.
[WARNING] <https://builds.apache.org/job/axis2-1.6/ws/axis2/modules/adb-codegen/src/org/apache/axis2/schema/writer/JavaBeanWriter.java>:256:
warning - @return tag has no arguments.
[INFO] Building jar: <https://builds.apache.org/job/axis2-1.6/ws/axis2/modules/adb-codegen/target/axis2-adb-codegen-1.6.3-SNAPSHOT-javadoc.jar>
[INFO] [gpg:sign {execution: default}]
[INFO] [install:install {execution: default-install}]
[INFO] Installing <https://builds.apache.org/job/axis2-1.6/ws/axis2/modules/adb-codegen/target/axis2-adb-codegen-1.6.3-SNAPSHOT.jar>
to <https://builds.apache.org/job/axis2-1.6/ws/.repository/org/apache/axis2/axis2-adb-codegen/1.6.3-SNAPSHOT/axis2-adb-codegen-1.6.3-SNAPSHOT.jar>
[INFO] Installing <https://builds.apache.org/job/axis2-1.6/ws/axis2/modules/adb-codegen/target/axis2-adb-codegen-1.6.3-SNAPSHOT-sources.jar>
to <https://builds.apache.org/job/axis2-1.6/ws/.repository/org/apache/axis2/axis2-adb-codegen/1.6.3-SNAPSHOT/axis2-adb-codegen-1.6.3-SNAPSHOT-sources.jar>
[INFO] Installing <https://builds.apache.org/job/axis2-1.6/ws/axis2/modules/adb-codegen/target/axis2-adb-codegen-1.6.3-SNAPSHOT-javadoc.jar>
to <https://builds.apache.org/job/axis2-1.6/ws/.repository/org/apache/axis2/axis2-adb-codegen/1.6.3-SNAPSHOT/axis2-adb-codegen-1.6.3-SNAPSHOT-javadoc.jar>
[INFO] [deploy:deploy {execution: default-deploy}]
[INFO] Retrieving previous build number from apache.snapshots.https
[WARNING] *** CHECKSUM FAILED - Checksum failed on download: local = 'b1d4b983eac626f29ebe1b029fec6cd001339f17';
remote = '4d1388d2bdce940ae9c07f144b74b8c881cc7b93' - RETRYING
[WARNING] *** CHECKSUM FAILED - Checksum failed on download: local = 'b1d4b983eac626f29ebe1b029fec6cd001339f17';
remote = '4d1388d2bdce940ae9c07f144b74b8c881cc7b93' - IGNORING
Uploading: https://repository.apache.org/content/repositories/snapshots/org/apache/axis2/axis2-adb-codegen/1.6.3-SNAPSHOT/axis2-adb-codegen-1.6.3-20120621.065843-12.jar
176K uploaded  (axis2-adb-codegen-1.6.3-20120621.065843-12.jar)
[INFO] Uploading project information for axis2-adb-codegen 1.6.3-20120621.065843-12
[INFO] Retrieving previous metadata from apache.snapshots.https
[INFO] Uploading repository metadata for: 'artifact org.apache.axis2:axis2-adb-codegen'
[INFO] Retrieving previous metadata from apache.snapshots.https
[WARNING] *** CHECKSUM FAILED - Checksum failed on download: local = 'b1d4b983eac626f29ebe1b029fec6cd001339f17';
remote = '4d1388d2bdce940ae9c07f144b74b8c881cc7b93' - RETRYING
[WARNING] *** CHECKSUM FAILED - Checksum failed on download: local = 'b1d4b983eac626f29ebe1b029fec6cd001339f17';
remote = '4d1388d2bdce940ae9c07f144b74b8c881cc7b93' - IGNORING
[INFO] Uploading repository metadata for: 'snapshot org.apache.axis2:axis2-adb-codegen:1.6.3-SNAPSHOT'
[INFO] Retrieving previous build number from apache.snapshots.https
Uploading: https://repository.apache.org/content/repositories/snapshots/org/apache/axis2/axis2-adb-codegen/1.6.3-SNAPSHOT/axis2-adb-codegen-1.6.3-20120621.065843-12-sources.jar
163K uploaded  (axis2-adb-codegen-1.6.3-20120621.065843-12-sources.jar)
[INFO] Retrieving previous build number from apache.snapshots.https
Uploading: https://repository.apache.org/content/repositories/snapshots/org/apache/axis2/axis2-adb-codegen/1.6.3-SNAPSHOT/axis2-adb-codegen-1.6.3-20120621.065843-12-javadoc.jar
162K uploaded  (axis2-adb-codegen-1.6.3-20120621.065843-12-javadoc.jar)
[JENKINS] Archiving <https://builds.apache.org/job/axis2-1.6/ws/axis2/modules/adb-codegen/pom.xml>
to /home/hudson/hudson/jobs/axis2-1.6/modules/org.apache.axis2$axis2-adb-codegen/builds/2012-06-21_06-57-57/archive/org.apache.axis2/axis2-adb-codegen/1.6.3-SNAPSHOT/axis2-adb-codegen-1.6.3-SNAPSHOT.pom
[JENKINS] Archiving <https://builds.apache.org/job/axis2-1.6/ws/axis2/modules/adb-codegen/target/axis2-adb-codegen-1.6.3-SNAPSHOT.jar>
to /home/hudson/hudson/jobs/axis2-1.6/modules/org.apache.axis2$axis2-adb-codegen/builds/2012-06-21_06-57-57/archive/org.apache.axis2/axis2-adb-codegen/1.6.3-20120621.065843-12/axis2-adb-codegen-1.6.3-20120621.065843-12.jar
[JENKINS] Archiving <https://builds.apache.org/job/axis2-1.6/ws/axis2/modules/adb-codegen/target/axis2-adb-codegen-1.6.3-SNAPSHOT-sources.jar>
to /home/hudson/hudson/jobs/axis2-1.6/modules/org.apache.axis2$axis2-adb-codegen/builds/2012-06-21_06-57-57/archive/org.apache.axis2/axis2-adb-codegen/1.6.3-20120621.065843-12/axis2-adb-codegen-1.6.3-20120621.065843-12-sources.jar
[JENKINS] Archiving <https://builds.apache.org/job/axis2-1.6/ws/axis2/modules/adb-codegen/target/axis2-adb-codegen-1.6.3-SNAPSHOT-javadoc.jar>
to /home/hudson/hudson/jobs/axis2-1.6/modules/org.apache.axis2$axis2-adb-codegen/builds/2012-06-21_06-57-57/archive/org.apache.axis2/axis2-adb-codegen/1.6.3-20120621.065843-12/axis2-adb-codegen-1.6.3-20120621.065843-12-javadoc.jar
[INFO] ------------------------------------------------------------------------
[INFO] Building Apache Axis2 - tool - MAR Maven Plugin
[INFO]    task-segment: [clean, deploy]
[INFO] ------------------------------------------------------------------------
[INFO] [clean:clean {execution: default-clean}]
[INFO] Deleting directory <https://builds.apache.org/job/axis2-1.6/ws/axis2/modules/tool/axis2-mar-maven-plugin/target>
[INFO] [plugin:descriptor {execution: default-descriptor}]
[INFO] Using 'UTF-8' encoding to read mojo metadata.
[INFO] Applying mojo extractor for language: java
[INFO] Mojo extractor for language: java found 3 mojo descriptors.
[INFO] Applying mojo extractor for language: bsh
[INFO] Mojo extractor for language: bsh found 0 mojo descriptors.
[INFO] [remote-resources:process {execution: default}]
[INFO] [resources:resources {execution: default-resources}]
[INFO] Using 'UTF-8' encoding to copy filtered resources.
[INFO] Copying 1 resource
[INFO] Copying 2 resources
[INFO] [compiler:compile {execution: default-compile}]
[INFO] Compiling 5 source files to <https://builds.apache.org/job/axis2-1.6/ws/axis2/modules/tool/axis2-mar-maven-plugin/target/classes>
[INFO] [resources:testResources {execution: default-testResources}]
[INFO] Using 'UTF-8' encoding to copy filtered resources.
[INFO] skip non existing resourceDirectory <https://builds.apache.org/job/axis2-1.6/ws/axis2/modules/tool/axis2-mar-maven-plugin/src/test/resources>
[INFO] Copying 2 resources
[INFO] [compiler:testCompile {execution: default-testCompile}]
[INFO] No sources to compile
[INFO] [surefire:test {execution: default-test}]
[INFO] Surefire report directory: <https://builds.apache.org/job/axis2-1.6/ws/axis2/modules/tool/axis2-mar-maven-plugin/target/surefire-reports>

-------------------------------------------------------
 T E S T S
-------------------------------------------------------
There are no tests to run.

Results :

Tests run: 0, Failures: 0, Errors: 0, Skipped: 0

[JENKINS] Recording test results
[INFO] [jar:jar {execution: default-jar}]
[INFO] Building jar: <https://builds.apache.org/job/axis2-1.6/ws/axis2/modules/tool/axis2-mar-maven-plugin/target/axis2-mar-maven-plugin-1.6.3-SNAPSHOT.jar>
[INFO] [plugin:addPluginArtifactMetadata {execution: default-addPluginArtifactMetadata}]
[INFO] [assembly:single {execution: source-release-assembly}]
[INFO] Skipping the assembly in this project because it's not the Execution Root
[INFO] Preparing source:jar
[WARNING] Removing: jar from forked lifecycle, to prevent recursive invocation.
[INFO] No goals needed for project - skipping
[INFO] [source:jar {execution: attach-sources}]
[INFO] Building jar: <https://builds.apache.org/job/axis2-1.6/ws/axis2/modules/tool/axis2-mar-maven-plugin/target/axis2-mar-maven-plugin-1.6.3-SNAPSHOT-sources.jar>
[INFO] [javadoc:jar {execution: attach-javadocs}]
Loading source files for package org.apache.axis2.maven2.mar...
Constructing Javadoc information...
Standard Doclet version 1.5.0_22
Building tree for all the packages and classes...
Generating <https://builds.apache.org/job/axis2-1.6/ws/axis2/modules/tool/axis2-mar-maven-plugin/target/apidocs/org/apache/axis2/maven2/mar//AbstractMarMojo.html...>
Generating <https://builds.apache.org/job/axis2-1.6/ws/axis2/modules/tool/axis2-mar-maven-plugin/target/apidocs/org/apache/axis2/maven2/mar//FileSet.html...>
Generating <https://builds.apache.org/job/axis2-1.6/ws/axis2/modules/tool/axis2-mar-maven-plugin/target/apidocs/org/apache/axis2/maven2/mar//MarExplodedMojo.html...>
Generating <https://builds.apache.org/job/axis2-1.6/ws/axis2/modules/tool/axis2-mar-maven-plugin/target/apidocs/org/apache/axis2/maven2/mar//MarInPlaceMojo.html...>
Generating <https://builds.apache.org/job/axis2-1.6/ws/axis2/modules/tool/axis2-mar-maven-plugin/target/apidocs/org/apache/axis2/maven2/mar//MarMojo.html...>
Generating <https://builds.apache.org/job/axis2-1.6/ws/axis2/modules/tool/axis2-mar-maven-plugin/target/apidocs/org/apache/axis2/maven2/mar//package-frame.html...>
Generating <https://builds.apache.org/job/axis2-1.6/ws/axis2/modules/tool/axis2-mar-maven-plugin/target/apidocs/org/apache/axis2/maven2/mar//package-summary.html...>
Generating <https://builds.apache.org/job/axis2-1.6/ws/axis2/modules/tool/axis2-mar-maven-plugin/target/apidocs/org/apache/axis2/maven2/mar//package-tree.html...>
Generating <https://builds.apache.org/job/axis2-1.6/ws/axis2/modules/tool/axis2-mar-maven-plugin/target/apidocs/constant-values.html...>
Generating <https://builds.apache.org/job/axis2-1.6/ws/axis2/modules/tool/axis2-mar-maven-plugin/target/apidocs/org/apache/axis2/maven2/mar/class-use//MarExplodedMojo.html...>
Generating <https://builds.apache.org/job/axis2-1.6/ws/axis2/modules/tool/axis2-mar-maven-plugin/target/apidocs/org/apache/axis2/maven2/mar/class-use//FileSet.html...>
Generating <https://builds.apache.org/job/axis2-1.6/ws/axis2/modules/tool/axis2-mar-maven-plugin/target/apidocs/org/apache/axis2/maven2/mar/class-use//AbstractMarMojo.html...>
Generating <https://builds.apache.org/job/axis2-1.6/ws/axis2/modules/tool/axis2-mar-maven-plugin/target/apidocs/org/apache/axis2/maven2/mar/class-use//MarInPlaceMojo.html...>
Generating <https://builds.apache.org/job/axis2-1.6/ws/axis2/modules/tool/axis2-mar-maven-plugin/target/apidocs/org/apache/axis2/maven2/mar/class-use//MarMojo.html...>
Generating <https://builds.apache.org/job/axis2-1.6/ws/axis2/modules/tool/axis2-mar-maven-plugin/target/apidocs/org/apache/axis2/maven2/mar//package-use.html...>
Building index for all the packages and classes...
Generating <https://builds.apache.org/job/axis2-1.6/ws/axis2/modules/tool/axis2-mar-maven-plugin/target/apidocs/overview-tree.html...>
Generating <https://builds.apache.org/job/axis2-1.6/ws/axis2/modules/tool/axis2-mar-maven-plugin/target/apidocs/index-all.html...>
Generating <https://builds.apache.org/job/axis2-1.6/ws/axis2/modules/tool/axis2-mar-maven-plugin/target/apidocs/deprecated-list.html...>
Building index for all classes...
Generating <https://builds.apache.org/job/axis2-1.6/ws/axis2/modules/tool/axis2-mar-maven-plugin/target/apidocs/allclasses-frame.html...>
Generating <https://builds.apache.org/job/axis2-1.6/ws/axis2/modules/tool/axis2-mar-maven-plugin/target/apidocs/allclasses-noframe.html...>
Generating <https://builds.apache.org/job/axis2-1.6/ws/axis2/modules/tool/axis2-mar-maven-plugin/target/apidocs/index.html...>
Generating <https://builds.apache.org/job/axis2-1.6/ws/axis2/modules/tool/axis2-mar-maven-plugin/target/apidocs/help-doc.html...>
Generating <https://builds.apache.org/job/axis2-1.6/ws/axis2/modules/tool/axis2-mar-maven-plugin/target/apidocs/stylesheet.css...>
16 warnings
[WARNING] Javadoc Warnings
[WARNING] <https://builds.apache.org/job/axis2-1.6/ws/axis2/modules/tool/axis2-mar-maven-plugin/src/main/java/org/apache/axis2/maven2/mar/AbstractMarMojo.java>:53:
warning - @parameter is an unknown tag.
[WARNING] <https://builds.apache.org/job/axis2-1.6/ws/axis2/modules/tool/axis2-mar-maven-plugin/src/main/java/org/apache/axis2/maven2/mar/AbstractMarMojo.java>:53:
warning - @required is an unknown tag.
[WARNING] <https://builds.apache.org/job/axis2-1.6/ws/axis2/modules/tool/axis2-mar-maven-plugin/src/main/java/org/apache/axis2/maven2/mar/AbstractMarMojo.java>:53:
warning - @readonly is an unknown tag.
[WARNING] <https://builds.apache.org/job/axis2-1.6/ws/axis2/modules/tool/axis2-mar-maven-plugin/src/main/java/org/apache/axis2/maven2/mar/AbstractMarMojo.java>:62:
warning - @parameter is an unknown tag.
[WARNING] <https://builds.apache.org/job/axis2-1.6/ws/axis2/modules/tool/axis2-mar-maven-plugin/src/main/java/org/apache/axis2/maven2/mar/AbstractMarMojo.java>:62:
warning - @required is an unknown tag.
[WARNING] <https://builds.apache.org/job/axis2-1.6/ws/axis2/modules/tool/axis2-mar-maven-plugin/src/main/java/org/apache/axis2/maven2/mar/AbstractMarMojo.java>:62:
warning - @readonly is an unknown tag.
[WARNING] <https://builds.apache.org/job/axis2-1.6/ws/axis2/modules/tool/axis2-mar-maven-plugin/src/main/java/org/apache/axis2/maven2/mar/AbstractMarMojo.java>:78:
warning - @parameter is an unknown tag.
[WARNING] <https://builds.apache.org/job/axis2-1.6/ws/axis2/modules/tool/axis2-mar-maven-plugin/src/main/java/org/apache/axis2/maven2/mar/AbstractMarMojo.java>:78:
warning - @required is an unknown tag.
[WARNING] <https://builds.apache.org/job/axis2-1.6/ws/axis2/modules/tool/axis2-mar-maven-plugin/src/main/java/org/apache/axis2/maven2/mar/MarExplodedMojo.java>:31:
warning - @goal is an unknown tag.
[WARNING] <https://builds.apache.org/job/axis2-1.6/ws/axis2/modules/tool/axis2-mar-maven-plugin/src/main/java/org/apache/axis2/maven2/mar/MarExplodedMojo.java>:31:
warning - @phase is an unknown tag.
[WARNING] <https://builds.apache.org/job/axis2-1.6/ws/axis2/modules/tool/axis2-mar-maven-plugin/src/main/java/org/apache/axis2/maven2/mar/MarExplodedMojo.java>:31:
warning - @requiresDependencyResolution is an unknown tag.
[WARNING] <https://builds.apache.org/job/axis2-1.6/ws/axis2/modules/tool/axis2-mar-maven-plugin/src/main/java/org/apache/axis2/maven2/mar/MarInPlaceMojo.java>:30:
warning - @goal is an unknown tag.
[WARNING] <https://builds.apache.org/job/axis2-1.6/ws/axis2/modules/tool/axis2-mar-maven-plugin/src/main/java/org/apache/axis2/maven2/mar/MarInPlaceMojo.java>:30:
warning - @requiresDependencyResolution is an unknown tag.
[WARNING] <https://builds.apache.org/job/axis2-1.6/ws/axis2/modules/tool/axis2-mar-maven-plugin/src/main/java/org/apache/axis2/maven2/mar/MarMojo.java>:42:
warning - @goal is an unknown tag.
[WARNING] <https://builds.apache.org/job/axis2-1.6/ws/axis2/modules/tool/axis2-mar-maven-plugin/src/main/java/org/apache/axis2/maven2/mar/MarMojo.java>:42:
warning - @phase is an unknown tag.
[WARNING] <https://builds.apache.org/job/axis2-1.6/ws/axis2/modules/tool/axis2-mar-maven-plugin/src/main/java/org/apache/axis2/maven2/mar/MarMojo.java>:42:
warning - @requiresDependencyResolution is an unknown tag.
[INFO] Building jar: <https://builds.apache.org/job/axis2-1.6/ws/axis2/modules/tool/axis2-mar-maven-plugin/target/axis2-mar-maven-plugin-1.6.3-SNAPSHOT-javadoc.jar>
[INFO] [gpg:sign {execution: default}]
[INFO] [install:install {execution: default-install}]
[INFO] Installing <https://builds.apache.org/job/axis2-1.6/ws/axis2/modules/tool/axis2-mar-maven-plugin/target/axis2-mar-maven-plugin-1.6.3-SNAPSHOT.jar>
to <https://builds.apache.org/job/axis2-1.6/ws/.repository/org/apache/axis2/axis2-mar-maven-plugin/1.6.3-SNAPSHOT/axis2-mar-maven-plugin-1.6.3-SNAPSHOT.jar>
[INFO] Installing <https://builds.apache.org/job/axis2-1.6/ws/axis2/modules/tool/axis2-mar-maven-plugin/target/axis2-mar-maven-plugin-1.6.3-SNAPSHOT-sources.jar>
to <https://builds.apache.org/job/axis2-1.6/ws/.repository/org/apache/axis2/axis2-mar-maven-plugin/1.6.3-SNAPSHOT/axis2-mar-maven-plugin-1.6.3-SNAPSHOT-sources.jar>
[INFO] Installing <https://builds.apache.org/job/axis2-1.6/ws/axis2/modules/tool/axis2-mar-maven-plugin/target/axis2-mar-maven-plugin-1.6.3-SNAPSHOT-javadoc.jar>
to <https://builds.apache.org/job/axis2-1.6/ws/.repository/org/apache/axis2/axis2-mar-maven-plugin/1.6.3-SNAPSHOT/axis2-mar-maven-plugin-1.6.3-SNAPSHOT-javadoc.jar>
[INFO] [deploy:deploy {execution: default-deploy}]
[INFO] Retrieving previous build number from apache.snapshots.https
[WARNING] *** CHECKSUM FAILED - Checksum failed on download: local = '382b82617892dee313f7a183f34df171f40af0e5';
remote = '577086a4522c1939048171a31a6b0adb9df429c0' - RETRYING
[WARNING] *** CHECKSUM FAILED - Checksum failed on download: local = '382b82617892dee313f7a183f34df171f40af0e5';
remote = '577086a4522c1939048171a31a6b0adb9df429c0' - IGNORING
Uploading: https://repository.apache.org/content/repositories/snapshots/org/apache/axis2/axis2-mar-maven-plugin/1.6.3-SNAPSHOT/axis2-mar-maven-plugin-1.6.3-20120621.065843-12.jar
17K uploaded  (axis2-mar-maven-plugin-1.6.3-20120621.065843-12.jar)
[INFO] Uploading project information for axis2-mar-maven-plugin 1.6.3-20120621.065843-12
[INFO] Retrieving previous metadata from apache.snapshots.https
[WARNING] *** CHECKSUM FAILED - Checksum failed on download: local = '382b82617892dee313f7a183f34df171f40af0e5';
remote = '577086a4522c1939048171a31a6b0adb9df429c0' - RETRYING
[WARNING] *** CHECKSUM FAILED - Checksum failed on download: local = '382b82617892dee313f7a183f34df171f40af0e5';
remote = '577086a4522c1939048171a31a6b0adb9df429c0' - IGNORING
[INFO] Uploading repository metadata for: 'snapshot org.apache.axis2:axis2-mar-maven-plugin:1.6.3-SNAPSHOT'
[INFO] Retrieving previous metadata from apache.snapshots.https
[INFO] Uploading repository metadata for: 'artifact org.apache.axis2:axis2-mar-maven-plugin'
[INFO] Retrieving previous metadata from apache.snapshots.https
[INFO] Uploading repository metadata for: 'org.apache.axis2'
[INFO] Retrieving previous build number from apache.snapshots.https
Uploading: https://repository.apache.org/content/repositories/snapshots/org/apache/axis2/axis2-mar-maven-plugin/1.6.3-SNAPSHOT/axis2-mar-maven-plugin-1.6.3-20120621.065843-12-sources.jar
14K uploaded  (axis2-mar-maven-plugin-1.6.3-20120621.065843-12-sources.jar)
[INFO] Retrieving previous build number from apache.snapshots.https
Uploading: https://repository.apache.org/content/repositories/snapshots/org/apache/axis2/axis2-mar-maven-plugin/1.6.3-SNAPSHOT/axis2-mar-maven-plugin-1.6.3-20120621.065843-12-javadoc.jar
43K uploaded  (axis2-mar-maven-plugin-1.6.3-20120621.065843-12-javadoc.jar)
[JENKINS] Archiving <https://builds.apache.org/job/axis2-1.6/ws/axis2/modules/tool/axis2-mar-maven-plugin/pom.xml>
to /home/hudson/hudson/jobs/axis2-1.6/modules/org.apache.axis2$axis2-mar-maven-plugin/builds/2012-06-21_06-57-58/archive/org.apache.axis2/axis2-mar-maven-plugin/1.6.3-SNAPSHOT/axis2-mar-maven-plugin-1.6.3-SNAPSHOT.pom
[JENKINS] Archiving <https://builds.apache.org/job/axis2-1.6/ws/axis2/modules/tool/axis2-mar-maven-plugin/target/axis2-mar-maven-plugin-1.6.3-SNAPSHOT.jar>
to /home/hudson/hudson/jobs/axis2-1.6/modules/org.apache.axis2$axis2-mar-maven-plugin/builds/2012-06-21_06-57-58/archive/org.apache.axis2/axis2-mar-maven-plugin/1.6.3-20120621.065843-12/axis2-mar-maven-plugin-1.6.3-20120621.065843-12.jar
[JENKINS] Archiving <https://builds.apache.org/job/axis2-1.6/ws/axis2/modules/tool/axis2-mar-maven-plugin/target/axis2-mar-maven-plugin-1.6.3-SNAPSHOT-sources.jar>
to /home/hudson/hudson/jobs/axis2-1.6/modules/org.apache.axis2$axis2-mar-maven-plugin/builds/2012-06-21_06-57-58/archive/org.apache.axis2/axis2-mar-maven-plugin/1.6.3-20120621.065843-12/axis2-mar-maven-plugin-1.6.3-20120621.065843-12-sources.jar
[JENKINS] Archiving <https://builds.apache.org/job/axis2-1.6/ws/axis2/modules/tool/axis2-mar-maven-plugin/target/axis2-mar-maven-plugin-1.6.3-SNAPSHOT-javadoc.jar>
to /home/hudson/hudson/jobs/axis2-1.6/modules/org.apache.axis2$axis2-mar-maven-plugin/builds/2012-06-21_06-57-58/archive/org.apache.axis2/axis2-mar-maven-plugin/1.6.3-20120621.065843-12/axis2-mar-maven-plugin-1.6.3-20120621.065843-12-javadoc.jar
[INFO] ------------------------------------------------------------------------
[INFO] Building Apache Axis2 - Addressing
[INFO]    task-segment: [clean, deploy]
[INFO] ------------------------------------------------------------------------
[INFO] [clean:clean {execution: default-clean}]
[INFO] Deleting directory <https://builds.apache.org/job/axis2-1.6/ws/axis2/modules/addressing/target>
[INFO] [remote-resources:process {execution: default}]
[INFO] [resources:resources {execution: default-resources}]
[INFO] Using 'UTF-8' encoding to copy filtered resources.
[INFO] skip non existing resourceDirectory <https://builds.apache.org/job/axis2-1.6/ws/axis2/modules/addressing/conf>
[INFO] Copying 1 resource
[INFO] Copying 2 resources
[INFO] [compiler:compile {execution: default-compile}]
[INFO] Compiling 5 source files to <https://builds.apache.org/job/axis2-1.6/ws/axis2/modules/addressing/target/classes>
[INFO] -------------------------------------------------------------
[ERROR] COMPILATION ERROR : 
[INFO] -------------------------------------------------------------
[ERROR] <https://builds.apache.org/job/axis2-1.6/ws/axis2/modules/addressing/src/org/apache/axis2/handlers/addressing/Addressing.java>:[79,0]
'class' or 'interface' expected

[ERROR] <https://builds.apache.org/job/axis2-1.6/ws/axis2/modules/addressing/src/org/apache/axis2/handlers/addressing/Addressing.java>:[81,0]
'class' or 'interface' expected

[ERROR] <https://builds.apache.org/job/axis2-1.6/ws/axis2/modules/addressing/src/org/apache/axis2/handlers/addressing/Addressing.java>:[82,0]
'class' or 'interface' expected

[ERROR] <https://builds.apache.org/job/axis2-1.6/ws/axis2/modules/addressing/src/org/apache/axis2/handlers/addressing/Addressing.java>:[83,0]
'class' or 'interface' expected

[ERROR] <https://builds.apache.org/job/axis2-1.6/ws/axis2/modules/addressing/src/org/apache/axis2/handlers/addressing/Addressing.java>:[84,0]
'class' or 'interface' expected

[ERROR] <https://builds.apache.org/job/axis2-1.6/ws/axis2/modules/addressing/src/org/apache/axis2/handlers/addressing/Addressing.java>:[85,0]
'class' or 'interface' expected

[ERROR] <https://builds.apache.org/job/axis2-1.6/ws/axis2/modules/addressing/src/org/apache/axis2/handlers/addressing/Addressing.java>:[86,0]
'class' or 'interface' expected

[ERROR] <https://builds.apache.org/job/axis2-1.6/ws/axis2/modules/addressing/src/org/apache/axis2/handlers/addressing/Addressing.java>:[87,0]
'class' or 'interface' expected

[ERROR] <https://builds.apache.org/job/axis2-1.6/ws/axis2/modules/addressing/src/org/apache/axis2/handlers/addressing/Addressing.java>:[88,0]
'class' or 'interface' expected

[INFO] 9 errors 
[INFO] -------------------------------------------------------------
[JENKINS] Archiving <https://builds.apache.org/job/axis2-1.6/ws/axis2/modules/addressing/pom.xml>
to /home/hudson/hudson/jobs/axis2-1.6/modules/org.apache.axis2$addressing/builds/2012-06-21_06-57-57/archive/org.apache.axis2/addressing/1.6.3-SNAPSHOT/addressing-1.6.3-SNAPSHOT.pom
[INFO] ------------------------------------------------------------------------
[ERROR] BUILD FAILURE
[INFO] ------------------------------------------------------------------------
[INFO] Compilation failure

<https://builds.apache.org/job/axis2-1.6/ws/axis2/modules/addressing/src/org/apache/axis2/handlers/addressing/Addressing.java>:[79,0]
'class' or 'interface' expected

<https://builds.apache.org/job/axis2-1.6/ws/axis2/modules/addressing/src/org/apache/axis2/handlers/addressing/Addressing.java>:[81,0]
'class' or 'interface' expected

<https://builds.apache.org/job/axis2-1.6/ws/axis2/modules/addressing/src/org/apache/axis2/handlers/addressing/Addressing.java>:[82,0]
'class' or 'interface' expected

<https://builds.apache.org/job/axis2-1.6/ws/axis2/modules/addressing/src/org/apache/axis2/handlers/addressing/Addressing.java>:[83,0]
'class' or 'interface' expected

<https://builds.apache.org/job/axis2-1.6/ws/axis2/modules/addressing/src/org/apache/axis2/handlers/addressing/Addressing.java>:[84,0]
'class' or 'interface' expected

<https://builds.apache.org/job/axis2-1.6/ws/axis2/modules/addressing/src/org/apache/axis2/handlers/addressing/Addressing.java>:[85,0]
'class' or 'interface' expected

<https://builds.apache.org/job/axis2-1.6/ws/axis2/modules/addressing/src/org/apache/axis2/handlers/addressing/Addressing.java>:[86,0]
'class' or 'interface' expected

<https://builds.apache.org/job/axis2-1.6/ws/axis2/modules/addressing/src/org/apache/axis2/handlers/addressing/Addressing.java>:[87,0]
'class' or 'interface' expected

<https://builds.apache.org/job/axis2-1.6/ws/axis2/modules/addressing/src/org/apache/axis2/handlers/addressing/Addressing.java>:[88,0]
'class' or 'interface' expected


[INFO] ------------------------------------------------------------------------
[INFO] For more information, run Maven with the -e switch
[INFO] ------------------------------------------------------------------------
[INFO] Total time: 4 minutes 34 seconds
[INFO] Finished at: Thu Jun 21 07:03:02 UTC 2012
[INFO] Final Memory: 79M/250M
[INFO] ------------------------------------------------------------------------
Sending e-mails to: java-dev@axis.apache.org sagara.gunathunga@gmail.com
channel stopped
[locks-and-latches] Releasing all the locks
[locks-and-latches] All the locks released
Updating AXIS2-5349
Updating AXIS2-5348

---------------------------------------------------------------------
To unsubscribe, e-mail: java-dev-unsubscribe@axis.apache.org
For additional commands, e-mail: java-dev-help@axis.apache.org


Mime
View raw message