axis-java-dev mailing list archives

Site index · List index
Message view « Date » · « Thread »
Top « Date » · « Thread »
From Apache Jenkins Server <jenk...@builds.apache.org>
Subject Build failed in Jenkins: Axis2 » Apache Axis2 - JSON #1632
Date Thu, 12 Jul 2012 02:45:25 GMT
See <https://builds.apache.org/job/Axis2/org.apache.axis2$axis2-json/1632/>

------------------------------------------
[INFO] ------------------------------------------------------------------------
[INFO] Building Apache Axis2 - JSON
[INFO]    task-segment: [clean, deploy]
[INFO] ------------------------------------------------------------------------
[INFO] [clean:clean {execution: default-clean}]
[INFO] [remote-resources:process {execution: default}]
Downloading: http://repo1.maven.org/maven2/org/codehaus/jettison/jettison/1.3/jettison-1.3.pom
4K downloaded  (jettison-1.3.pom)
Downloading: http://repo1.maven.org/maven2/org/codehaus/codehaus-parent/3/codehaus-parent-3.pom
4K downloaded  (codehaus-parent-3.pom)
Downloading: http://repo1.maven.org/maven2/com/google/code/gson/gson/2.1/gson-2.1.pom
10K downloaded  (gson-2.1.pom)
Downloading: http://repo1.maven.org/maven2/org/sonatype/oss/oss-parent/5/oss-parent-5.pom
3K downloaded  (oss-parent-5.pom)
Downloading: http://repo1.maven.org/maven2/org/codehaus/jettison/jettison/1.3/jettison-1.3.jar
Downloading: http://repo1.maven.org/maven2/com/google/code/gson/gson/2.1/gson-2.1.jar
70K downloaded  (jettison-1.3.jar)
175K downloaded  (gson-2.1.jar)
[INFO] [resources:resources {execution: default-resources}]
[INFO] Using 'UTF-8' encoding to copy filtered resources.
[INFO] skip non existing resourceDirectory <https://builds.apache.org/job/Axis2/org.apache.axis2$axis2-json/ws/src/main/resources>
[INFO] Copying 2 resources
[INFO] [compiler:compile {execution: default-compile}]
[INFO] Compiling 16 source files to <https://builds.apache.org/job/Axis2/org.apache.axis2$axis2-json/ws/target/classes>
[INFO] -------------------------------------------------------------
[ERROR] COMPILATION ERROR : 
[INFO] -------------------------------------------------------------
[ERROR] <https://builds.apache.org/job/Axis2/org.apache.axis2$axis2-json/ws/src/org/apache/axis2/json/impl/JsonBuilder.java>:[34,5]
method does not override a method from its superclass

[ERROR] <https://builds.apache.org/job/Axis2/org.apache.axis2$axis2-json/ws/src/org/apache/axis2/json/impl/JsonFormatter.java>:[44,5]
method does not override a method from its superclass

[ERROR] <https://builds.apache.org/job/Axis2/org.apache.axis2$axis2-json/ws/src/org/apache/axis2/json/impl/JsonFormatter.java>:[49,5]
method does not override a method from its superclass

[ERROR] <https://builds.apache.org/job/Axis2/org.apache.axis2$axis2-json/ws/src/org/apache/axis2/json/impl/JsonFormatter.java>:[78,5]
method does not override a method from its superclass

[ERROR] <https://builds.apache.org/job/Axis2/org.apache.axis2$axis2-json/ws/src/org/apache/axis2/json/impl/JsonFormatter.java>:[85,5]
method does not override a method from its superclass

[ERROR] <https://builds.apache.org/job/Axis2/org.apache.axis2$axis2-json/ws/src/org/apache/axis2/json/impl/JsonFormatter.java>:[90,5]
method does not override a method from its superclass

[INFO] 6 errors 
[INFO] -------------------------------------------------------------
[JENKINS] Archiving <https://builds.apache.org/job/Axis2/org.apache.axis2$axis2-json/ws/pom.xml>
to /home/hudson/hudson/jobs/Axis2/modules/org.apache.axis2$axis2-json/builds/2012-07-12_02-09-39/archive/org.apache.axis2/axis2-json/1.7.0-SNAPSHOT/axis2-json-1.7.0-SNAPSHOT.pom
[INFO] ------------------------------------------------------------------------
[ERROR] BUILD FAILURE
[INFO] ------------------------------------------------------------------------
[INFO] Compilation failure

<https://builds.apache.org/job/Axis2/org.apache.axis2$axis2-json/ws/src/org/apache/axis2/json/impl/JsonBuilder.java>:[34,5]
method does not override a method from its superclass

<https://builds.apache.org/job/Axis2/org.apache.axis2$axis2-json/ws/src/org/apache/axis2/json/impl/JsonFormatter.java>:[44,5]
method does not override a method from its superclass

<https://builds.apache.org/job/Axis2/org.apache.axis2$axis2-json/ws/src/org/apache/axis2/json/impl/JsonFormatter.java>:[49,5]
method does not override a method from its superclass

<https://builds.apache.org/job/Axis2/org.apache.axis2$axis2-json/ws/src/org/apache/axis2/json/impl/JsonFormatter.java>:[78,5]
method does not override a method from its superclass

<https://builds.apache.org/job/Axis2/org.apache.axis2$axis2-json/ws/src/org/apache/axis2/json/impl/JsonFormatter.java>:[85,5]
method does not override a method from its superclass

<https://builds.apache.org/job/Axis2/org.apache.axis2$axis2-json/ws/src/org/apache/axis2/json/impl/JsonFormatter.java>:[90,5]
method does not override a method from its superclass


[INFO] ------------------------------------------------------------------------
[INFO] For more information, run Maven with the -e switch
[INFO] ------------------------------------------------------------------------
[INFO] Total time: 35 minutes 14 seconds
[INFO] Finished at: Thu Jul 12 02:45:24 UTC 2012
[INFO] Final Memory: 84M/246M
[INFO] ------------------------------------------------------------------------
Maven failed with error.

---------------------------------------------------------------------
To unsubscribe, e-mail: java-dev-unsubscribe@axis.apache.org
For additional commands, e-mail: java-dev-help@axis.apache.org


Mime
View raw message