axis-java-dev mailing list archives

Site index · List index
Message view « Date » · « Thread »
Top « Date » · « Thread »
From Apache Jenkins Server <jenk...@builds.apache.org>
Subject Build failed in Jenkins: axis2-transports-trunk #961
Date Sun, 05 Aug 2012 10:58:05 GMT
See <https://builds.apache.org/job/axis2-transports-trunk/961/>

------------------------------------------
[...truncated 1842 lines...]
33K downloaded  (doxia-site-renderer-1.0-alpha-8.jar)
Downloading: http://repo1.maven.org/maven2/org/apache/maven/doxia/doxia-decoration-model/1.0-alpha-8/doxia-decoration-model-1.0-alpha-8.jar
39K downloaded  (doxia-decoration-model-1.0-alpha-8.jar)
[INFO] [dependency:copy {execution: copy}]
[INFO] Configured Artifact: org.apache.axis2:addressing:1.7.0-SNAPSHOT:mar
[INFO] Copying addressing-1.7.0-SNAPSHOT.mar to <https://builds.apache.org/job/axis2-transports-trunk/ws/transports/modules/testkit/target/generated-resources/org/apache/axis2/transport/repo/modules/addressing.mar>
[INFO] [resources:resources {execution: default-resources}]
[INFO] Using 'UTF-8' encoding to copy filtered resources.
[INFO] Copying 4 resources
[INFO] Copying 1 resource
[INFO] Copying 3 resources
[INFO] [compiler:compile {execution: default-compile}]
[INFO] Compiling 107 source files to <https://builds.apache.org/job/axis2-transports-trunk/ws/transports/modules/testkit/target/classes>
[INFO] [resources:testResources {execution: default-testResources}]
[INFO] Using 'UTF-8' encoding to copy filtered resources.
[INFO] skip non existing resourceDirectory <https://builds.apache.org/job/axis2-transports-trunk/ws/transports/modules/testkit/src/test/resources>
[INFO] Copying 3 resources
[INFO] [compiler:testCompile {execution: default-testCompile}]
[INFO] No sources to compile
[INFO] [surefire:test {execution: default-test}]
[INFO] Surefire report directory: <https://builds.apache.org/job/axis2-transports-trunk/ws/transports/modules/testkit/target/surefire-reports>

-------------------------------------------------------
 T E S T S
-------------------------------------------------------
There are no tests to run.

Results :

Tests run: 0, Failures: 0, Errors: 0, Skipped: 0

[JENKINS] Recording test resultsDownloading: http://repo1.maven.org/maven2/org/apache/maven/maven-archiver/2.4.1/maven-archiver-2.4.1.pom
3K downloaded  (maven-archiver-2.4.1.pom)

Downloading: http://repo1.maven.org/maven2/org/codehaus/plexus/plexus-archiver/1.0/plexus-archiver-1.0.pom
1K downloaded  (plexus-archiver-1.0.pom)
Downloading: http://repo1.maven.org/maven2/org/codehaus/plexus/plexus-components/1.1.17/plexus-components-1.1.17.pom
5K downloaded  (plexus-components-1.1.17.pom)
Downloading: http://repo1.maven.org/maven2/org/codehaus/plexus/plexus/2.0.5/plexus-2.0.5.pom
16K downloaded  (plexus-2.0.5.pom)
Downloading: http://repo1.maven.org/maven2/org/codehaus/plexus/plexus-io/1.0/plexus-io-1.0.pom
1K downloaded  (plexus-io-1.0.pom)
Downloading: http://repo1.maven.org/maven2/org/apache/maven/maven-archiver/2.4.1/maven-archiver-2.4.1.jar
Downloading: http://repo1.maven.org/maven2/org/codehaus/plexus/plexus-archiver/1.0/plexus-archiver-1.0.jar
173K downloaded  (plexus-archiver-1.0.jar)
Downloading: http://repo1.maven.org/maven2/org/codehaus/plexus/plexus-io/1.0/plexus-io-1.0.jar
49K downloaded  (plexus-io-1.0.jar)
19K downloaded  (maven-archiver-2.4.1.jar)
[INFO] [jar:jar {execution: default-jar}]
[INFO] Building jar: <https://builds.apache.org/job/axis2-transports-trunk/ws/transports/modules/testkit/target/axis2-transport-testkit-1.7.0-SNAPSHOT.jar>
[INFO] Preparing source:jar
[WARNING] Removing: jar from forked lifecycle, to prevent recursive invocation.
[INFO] No goals needed for project - skipping
[INFO] [source:jar {execution: default}]
[INFO] Building jar: <https://builds.apache.org/job/axis2-transports-trunk/ws/transports/modules/testkit/target/axis2-transport-testkit-1.7.0-SNAPSHOT-sources.jar>
[INFO] [install:install {execution: default-install}]
[INFO] Installing <https://builds.apache.org/job/axis2-transports-trunk/ws/transports/modules/testkit/target/axis2-transport-testkit-1.7.0-SNAPSHOT.jar>
to <https://builds.apache.org/job/axis2-transports-trunk/ws/.repository/org/apache/axis2/axis2-transport-testkit/1.7.0-SNAPSHOT/axis2-transport-testkit-1.7.0-SNAPSHOT.jar>
[INFO] Installing <https://builds.apache.org/job/axis2-transports-trunk/ws/transports/modules/testkit/target/axis2-transport-testkit-1.7.0-SNAPSHOT-sources.jar>
to <https://builds.apache.org/job/axis2-transports-trunk/ws/.repository/org/apache/axis2/axis2-transport-testkit/1.7.0-SNAPSHOT/axis2-transport-testkit-1.7.0-SNAPSHOT-sources.jar>
[INFO] [deploy:deploy {execution: default-deploy}]
[INFO] Retrieving previous build number from apache.snapshots.https
[WARNING] *** CHECKSUM FAILED - Checksum failed on download: local = 'a3c6bd602364bfd21444d0f4ef865fd802583853';
remote = 'a4218d37fac9587afa536c6b1d72b1dda3021cfc' - RETRYING
[WARNING] *** CHECKSUM FAILED - Checksum failed on download: local = 'a3c6bd602364bfd21444d0f4ef865fd802583853';
remote = 'a4218d37fac9587afa536c6b1d72b1dda3021cfc' - IGNORING
Uploading: https://repository.apache.org/content/repositories/snapshots/org/apache/axis2/axis2-transport-testkit/1.7.0-SNAPSHOT/axis2-transport-testkit-1.7.0-20120805.105642-500.jar
203K uploaded  (axis2-transport-testkit-1.7.0-20120805.105642-500.jar)
[INFO] Uploading project information for axis2-transport-testkit 1.7.0-20120805.105642-500
[INFO] Retrieving previous metadata from apache.snapshots.https
[WARNING] *** CHECKSUM FAILED - Checksum failed on download: local = 'a3c6bd602364bfd21444d0f4ef865fd802583853';
remote = 'a4218d37fac9587afa536c6b1d72b1dda3021cfc' - RETRYING
[WARNING] *** CHECKSUM FAILED - Checksum failed on download: local = 'a3c6bd602364bfd21444d0f4ef865fd802583853';
remote = 'a4218d37fac9587afa536c6b1d72b1dda3021cfc' - IGNORING
[INFO] Uploading repository metadata for: 'snapshot org.apache.axis2:axis2-transport-testkit:1.7.0-SNAPSHOT'
[INFO] Retrieving previous metadata from apache.snapshots.https
[INFO] Uploading repository metadata for: 'artifact org.apache.axis2:axis2-transport-testkit'
[INFO] Retrieving previous build number from apache.snapshots.https
Uploading: https://repository.apache.org/content/repositories/snapshots/org/apache/axis2/axis2-transport-testkit/1.7.0-SNAPSHOT/axis2-transport-testkit-1.7.0-20120805.105642-500-sources.jar
171K uploaded  (axis2-transport-testkit-1.7.0-20120805.105642-500-sources.jar)
[JENKINS] Archiving <https://builds.apache.org/job/axis2-transports-trunk/ws/transports/modules/testkit/pom.xml>
to /home/hudson/hudson/jobs/axis2-transports-trunk/modules/org.apache.axis2$axis2-transport-testkit/builds/2012-08-05_10-55-38/archive/org.apache.axis2/axis2-transport-testkit/1.7.0-SNAPSHOT/axis2-transport-testkit-1.7.0-SNAPSHOT.pom
[JENKINS] Archiving <https://builds.apache.org/job/axis2-transports-trunk/ws/transports/modules/testkit/target/axis2-transport-testkit-1.7.0-SNAPSHOT.jar>
to /home/hudson/hudson/jobs/axis2-transports-trunk/modules/org.apache.axis2$axis2-transport-testkit/builds/2012-08-05_10-55-38/archive/org.apache.axis2/axis2-transport-testkit/1.7.0-20120805.105642-500/axis2-transport-testkit-1.7.0-20120805.105642-500.jar
[JENKINS] Archiving <https://builds.apache.org/job/axis2-transports-trunk/ws/transports/modules/testkit/target/axis2-transport-testkit-1.7.0-SNAPSHOT-sources.jar>
to /home/hudson/hudson/jobs/axis2-transports-trunk/modules/org.apache.axis2$axis2-transport-testkit/builds/2012-08-05_10-55-38/archive/org.apache.axis2/axis2-transport-testkit/1.7.0-20120805.105642-500/axis2-transport-testkit-1.7.0-20120805.105642-500-sources.jar
[INFO] ------------------------------------------------------------------------
[INFO] Building Apache Axis2 - Transport - HTTP Tests
[INFO]    task-segment: [clean, deploy]
[INFO] ------------------------------------------------------------------------
Downloading: http://repo1.maven.org/maven2/org/apache/maven/plugins/maven-surefire-plugin/2.3/maven-surefire-plugin-2.3.pom
4K downloaded  (maven-surefire-plugin-2.3.pom)
Downloading: http://repo1.maven.org/maven2/org/apache/maven/surefire/surefire/2.3/surefire-2.3.pom
5K downloaded  (surefire-2.3.pom)
Downloading: http://repo1.maven.org/maven2/org/apache/maven/plugins/maven-surefire-plugin/2.3/maven-surefire-plugin-2.3.jar
14K downloaded  (maven-surefire-plugin-2.3.jar)
[INFO] [clean:clean {execution: default-clean}]
[INFO] [remote-resources:process {execution: default}]
[INFO] snapshot org.apache.axis2:axis2-transport-http:1.7.0-SNAPSHOT: checking for updates
from apache.snapshots
Downloading: http://repository.apache.org/snapshots/org/apache/axis2/axis2-transport-http/1.7.0-SNAPSHOT/axis2-transport-http-1.7.0-20120805.101959-956.pom

Downloading: http://repo1.maven.org/maven2/org/apache/httpcomponents/httpcore/4.0-beta1/httpcore-4.0-beta1.pom
4K downloaded  (httpcore-4.0-beta1.pom)
Downloading: http://repo1.maven.org/maven2/org/apache/httpcomponents/httpcomponents-core/4.0-beta1/httpcomponents-core-4.0-beta1.pom
5K downloaded  (httpcomponents-core-4.0-beta1.pom)
Downloading: http://repo1.maven.org/maven2/org/apache/httpcomponents/httpclient/4.2.1/httpclient-4.2.1.pom
5K downloaded  (httpclient-4.2.1.pom)
Downloading: http://repo1.maven.org/maven2/org/apache/httpcomponents/httpcomponents-client/4.2.1/httpcomponents-client-4.2.1.pom
14K downloaded  (httpcomponents-client-4.2.1.pom)
Downloading: http://files.couchbase.com/maven2//org/apache/httpcomponents/project/6/project-6.pom
[INFO] Unable to find resource 'org.apache.httpcomponents:project:pom:6' in repository spy
(http://files.couchbase.com/maven2/)
Downloading: http://repo1.maven.org/maven2/org/apache/httpcomponents/project/6/project-6.pom
23K downloaded  (project-6.pom)
Downloading: http://files.couchbase.com/maven2//commons-codec/commons-codec/1.6/commons-codec-1.6.pom
[INFO] Unable to find resource 'commons-codec:commons-codec:pom:1.6' in repository spy (http://files.couchbase.com/maven2/)
Downloading: http://repo1.maven.org/maven2/commons-codec/commons-codec/1.6/commons-codec-1.6.pom
10K downloaded  (commons-codec-1.6.pom)
Downloading: http://files.couchbase.com/maven2//org/apache/commons/commons-parent/22/commons-parent-22.pom
[INFO] Unable to find resource 'org.apache.commons:commons-parent:pom:22' in repository spy
(http://files.couchbase.com/maven2/)
Downloading: http://repo1.maven.org/maven2/org/apache/commons/commons-parent/22/commons-parent-22.pom
40K downloaded  (commons-parent-22.pom)
Downloading: http://repo1.maven.org/maven2/commons-httpclient/commons-httpclient/3.1/commons-httpclient-3.1.pom
7K downloaded  (commons-httpclient-3.1.pom)
Downloading: http://repo1.maven.org/maven2/commons-codec/commons-codec/1.2/commons-codec-1.2.pom
3K downloaded  (commons-codec-1.2.pom)
Downloading: http://repo1.maven.org/maven2/commons-httpclient/commons-httpclient/3.1/commons-httpclient-3.1.jar
Downloading: http://repo1.maven.org/maven2/org/apache/httpcomponents/httpcore/4.0-beta1/httpcore-4.0-beta1.jar
Downloading: http://files.couchbase.com/maven2//commons-codec/commons-codec/1.6/commons-codec-1.6.jar
Downloading: http://repository.apache.org/snapshots/org/apache/axis2/axis2-transport-http/1.7.0-SNAPSHOT/axis2-transport-http-1.7.0-20120805.101959-956.jar
297K downloaded  (commons-httpclient-3.1.jar)
164K downloaded  (httpcore-4.0-beta1.jar)
Downloading: http://repo1.maven.org/maven2/org/apache/httpcomponents/httpclient/4.2.1/httpclient-4.2.1.jar
[INFO] Unable to find resource 'commons-codec:commons-codec:jar:1.6' in repository spy (http://files.couchbase.com/maven2/)
Downloading: http://repo1.maven.org/maven2/commons-codec/commons-codec/1.6/commons-codec-1.6.jar
227K downloaded  (commons-codec-1.6.jar)
417K downloaded  (httpclient-4.2.1.jar)
193K downloaded  (axis2-transport-http-1.7.0-20120805.101959-956.jar)
[INFO] [resources:resources {execution: default-resources}]
[INFO] Using 'UTF-8' encoding to copy filtered resources.
[INFO] skip non existing resourceDirectory <https://builds.apache.org/job/axis2-transports-trunk/ws/transports/modules/http/conf>
[INFO] skip non existing resourceDirectory <https://builds.apache.org/job/axis2-transports-trunk/ws/transports/modules/http/src>
[INFO] Copying 3 resources
[INFO] [compiler:compile {execution: default-compile}]
[INFO] No sources to compile
[INFO] [resources:testResources {execution: default-testResources}]
[INFO] Using 'UTF-8' encoding to copy filtered resources.
[INFO] skip non existing resourceDirectory <https://builds.apache.org/job/axis2-transports-trunk/ws/transports/modules/http/src/test/resources>
[INFO] Copying 3 resources
[INFO] [compiler:testCompile {execution: default-testCompile}]
[INFO] Compiling 2 source files to <https://builds.apache.org/job/axis2-transports-trunk/ws/transports/modules/http/target/test-classes>
Downloading: http://repo1.maven.org/maven2/org/apache/maven/surefire/surefire-booter/2.3/surefire-booter-2.3.pom
1K downloaded  (surefire-booter-2.3.pom)
Downloading: http://repo1.maven.org/maven2/org/apache/maven/surefire/surefire-api/2.3/surefire-api-2.3.pom
887b downloaded  (surefire-api-2.3.pom)
Downloading: http://repo1.maven.org/maven2/org/apache/maven/surefire/surefire-booter/2.3/surefire-booter-2.3.jar
Downloading: http://repo1.maven.org/maven2/org/codehaus/plexus/plexus-utils/1.1/plexus-utils-1.1.jar
164K downloaded  (plexus-utils-1.1.jar)
28K downloaded  (surefire-booter-2.3.jar)
Downloading: http://repo1.maven.org/maven2/org/apache/maven/surefire/surefire-api/2.3/surefire-api-2.3.jar
49K downloaded  (surefire-api-2.3.jar)
[INFO] [surefire:test {execution: default-test}]
Downloading: http://repo1.maven.org/maven2/junit/junit/3.8.1/junit-3.8.1.jar
Downloading: http://repo1.maven.org/maven2/classworlds/classworlds/1.1-alpha-2/classworlds-1.1-alpha-2.jar
Downloading: http://repo1.maven.org/maven2/org/codehaus/plexus/plexus-container-default/1.0-alpha-8/plexus-container-default-1.0-alpha-8.jar
118K downloaded  (junit-3.8.1.jar)
36K downloaded  (classworlds-1.1-alpha-2.jar)
190K downloaded  (plexus-container-default-1.0-alpha-8.jar)
Downloading: http://repo1.maven.org/maven2/org/apache/maven/surefire/surefire-junit/2.3/surefire-junit-2.3.pom
583b downloaded  (surefire-junit-2.3.pom)
Downloading: http://repo1.maven.org/maven2/org/apache/maven/surefire/surefire-providers/2.3/surefire-providers-2.3.pom
1K downloaded  (surefire-providers-2.3.pom)
Downloading: http://repo1.maven.org/maven2/org/apache/maven/surefire/surefire-junit/2.3/surefire-junit-2.3.jar
10K downloaded  (surefire-junit-2.3.jar)
[INFO] Surefire report directory: <https://builds.apache.org/job/axis2-transports-trunk/ws/transports/modules/http/target/surefire-reports>

-------------------------------------------------------
 T E S T S
-------------------------------------------------------
Running org.apache.axis2.transport.http.SimpleHTTPServerTest
[SimpleHTTPServer] Stop called
[SimpleHTTPServer] Stop called
[SimpleHTTPServer] Stop called
[SimpleHTTPServer] Stop called
[SimpleHTTPServer] Stop called
Tests run: 65, Failures: 0, Errors: 0, Skipped: 0, Time elapsed: 20.139 sec

Results :

Tests run: 65, Failures: 0, Errors: 0, Skipped: 0

[JENKINS] Recording test results
Aug 5, 2012 10:58:03 AM hudson.remoting.SynchronousCommandTransport$ReaderThread run
SEVERE: I/O error in channel channel
java.io.StreamCorruptedException
	at java.io.ObjectInputStream.readObject0(ObjectInputStream.java:1332)
	at java.io.ObjectInputStream.readObject(ObjectInputStream.java:348)
	at hudson.remoting.Command.readFrom(Command.java:90)
	at hudson.remoting.ClassicCommandTransport.read(ClassicCommandTransport.java:59)
	at hudson.remoting.SynchronousCommandTransport$ReaderThread.run(SynchronousCommandTransport.java:48)
channel stopped
[INFO] ------------------------------------------------------------------------
[ERROR] FATAL ERROR
[INFO] ------------------------------------------------------------------------
[INFO] null
[INFO] ------------------------------------------------------------------------
[INFO] Trace
java.lang.reflect.UndeclaredThrowableException
	at $Proxy2.isArchivingDisabled(Unknown Source)
	at hudson.maven.MavenBuildProxy$Filter.isArchivingDisabled(MavenBuildProxy.java:227)
	at hudson.maven.reporters.MavenArtifact.archive(MavenArtifact.java:223)
	at hudson.maven.reporters.MavenArtifactArchiver.postBuild(MavenArtifactArchiver.java:108)
	at hudson.maven.Maven2Builder.postModule(Maven2Builder.java:127)
	at hudson.maven.MavenBuilder$Adapter.fireLeaveModule(MavenBuilder.java:327)
	at hudson.maven.MavenBuilder$Adapter.postBuild(MavenBuilder.java:285)
	at org.apache.maven.lifecycle.LifecycleExecutorInterceptor.execute(LifecycleExecutorInterceptor.java:68)
	at org.apache.maven.DefaultMaven.doExecute(DefaultMaven.java:328)
	at org.apache.maven.DefaultMaven.execute(DefaultMaven.java:138)
	at org.apache.maven.cli.MavenCli.main(MavenCli.java:362)
	at sun.reflect.NativeMethodAccessorImpl.invoke0(Native Method)
	at sun.reflect.NativeMethodAccessorImpl.invoke(NativeMethodAccessorImpl.java:39)
	at sun.reflect.DelegatingMethodAccessorImpl.invoke(DelegatingMethodAccessorImpl.java:25)
	at java.lang.reflect.Method.invoke(Method.java:592)
	at org.codehaus.classworlds.Launcher.launchEnhanced(Launcher.java:315)
	at org.codehaus.classworlds.Launcher.launch(Launcher.java:255)
	at hudson.maven.agent.Main.launch(Main.java:185)
	at hudson.maven.MavenBuilder.call(MavenBuilder.java:151)
	at hudson.maven.Maven2Builder.call(Maven2Builder.java:77)
	at hudson.maven.Maven2Builder.call(Maven2Builder.java:53)
	at hudson.remoting.UserRequest.perform(UserRequest.java:118)
	at hudson.remoting.UserRequest.perform(UserRequest.java:48)
	at hudson.remoting.Request$2.run(Request.java:326)
	at hudson.remoting.InterceptingExecutorService$1.call(InterceptingExecutorService.java:72)
	at java.util.concurrent.FutureTask$Sync.innerRun(FutureTask.java:269)
	at java.util.concurrent.FutureTask.run(FutureTask.java:123)
	at java.util.concurrent.ThreadPoolExecutor$Worker.runTask(ThreadPoolExecutor.java:651)
	at java.util.concurrent.ThreadPoolExecutor$Worker.run(ThreadPoolExecutor.java:676)
	at java.lang.Thread.run(Thread.java:595)
Caused by: hudson.remoting.ChannelClosedException: channel is already closed
	at hudson.remoting.Channel.send(Channel.java:492)
	at hudson.remoting.Request.call(Request.java:129)
	at hudson.remoting.Channel.call(Channel.java:663)
	at hudson.remoting.RemoteInvocationHandler.invoke(RemoteInvocationHandler.java:158)
	... 30 more
Caused by: java.io.StreamCorruptedException
	at java.io.ObjectInputStream.readObject0(ObjectInputStream.java:1332)
	at java.io.ObjectInputStream.readObject(ObjectInputStream.java:348)
	at hudson.remoting.Command.readFrom(Command.java:90)
	at hudson.remoting.ClassicCommandTransport.read(ClassicCommandTransport.java:59)
	at hudson.remoting.SynchronousCommandTransport$ReaderThread.run(SynchronousCommandTransport.java:48)
[INFO] ------------------------------------------------------------------------
[INFO] Total time: 1 minute 58 seconds
[INFO] Finished at: Sun Aug 05 10:58:03 UTC 2012
[INFO] Final Memory: 57M/307M
[INFO] ------------------------------------------------------------------------
[locks-and-latches] Releasing all the locks
[locks-and-latches] All the locks released
ERROR: Maven JVM terminated unexpectedly with exit code 0


---------------------------------------------------------------------
To unsubscribe, e-mail: java-dev-unsubscribe@axis.apache.org
For additional commands, e-mail: java-dev-help@axis.apache.org


Mime
View raw message