axis-java-dev mailing list archives

Site index · List index
Message view « Date » · « Thread »
Top « Date » · « Thread »
From Apache Jenkins Server <jenk...@builds.apache.org>
Subject Build failed in Jenkins: axis2-transports-trunk #1137
Date Fri, 16 Nov 2012 15:12:21 GMT
See <https://builds.apache.org/job/axis2-transports-trunk/1137/changes>

Changes:

[veithen] Upgraded to qpid 0.18 so that we can get rid of the incubator repository.

------------------------------------------
[...truncated 758 lines...]
[INFO] Retrieving previous build number from apache.snapshots.https
Uploading: https://repository.apache.org/content/repositories/snapshots/org/apache/axis2/axis2-transport-mail/1.7.0-SNAPSHOT/axis2-transport-mail-1.7.0-20121116.150832-647-sources.jar
29K uploaded  (axis2-transport-mail-1.7.0-20121116.150832-647-sources.jar)
[INFO] [bundle:deploy {execution: default-deploy}]
[INFO] Remote OBR update disabled (enable with -DremoteOBR)
[JENKINS] Archiving <https://builds.apache.org/job/axis2-transports-trunk/ws/transports/modules/mail/pom.xml>
to /home/hudson/hudson/jobs/axis2-transports-trunk/modules/org.apache.axis2$axis2-transport-mail/builds/2012-11-16_15-07-30/archive/org.apache.axis2/axis2-transport-mail/1.7.0-SNAPSHOT/axis2-transport-mail-1.7.0-SNAPSHOT.pom
[JENKINS] Archiving <https://builds.apache.org/job/axis2-transports-trunk/ws/transports/modules/mail/target/axis2-transport-mail-1.7.0-SNAPSHOT.jar>
to /home/hudson/hudson/jobs/axis2-transports-trunk/modules/org.apache.axis2$axis2-transport-mail/builds/2012-11-16_15-07-30/archive/org.apache.axis2/axis2-transport-mail/1.7.0-20121116.150832-647/axis2-transport-mail-1.7.0-20121116.150832-647.jar
[JENKINS] Archiving <https://builds.apache.org/job/axis2-transports-trunk/ws/transports/modules/mail/target/axis2-transport-mail-1.7.0-SNAPSHOT-sources.jar>
to /home/hudson/hudson/jobs/axis2-transports-trunk/modules/org.apache.axis2$axis2-transport-mail/builds/2012-11-16_15-07-30/archive/org.apache.axis2/axis2-transport-mail/1.7.0-20121116.150832-647/axis2-transport-mail-1.7.0-20121116.150832-647-sources.jar
[INFO] ------------------------------------------------------------------------
[INFO] Building Apache Axis2 - Transport - JMS
[INFO]    task-segment: [clean, deploy]
[INFO] ------------------------------------------------------------------------
[INFO] [clean:clean {execution: default-clean}]
[INFO] Deleting <https://builds.apache.org/job/axis2-transports-trunk/ws/transports/modules/jms/target>
[INFO] [remote-resources:process {execution: default}]
Downloading: http://repo1.maven.org/maven2/org/apache/qpid/qpid-broker/0.18/qpid-broker-0.18.pom
8K downloaded  (qpid-broker-0.18.pom)
Downloading: http://repo1.maven.org/maven2/org/apache/qpid/qpid-management-common/0.18/qpid-management-common-0.18.pom
871b downloaded  (qpid-management-common-0.18.pom)
Downloading: http://repo1.maven.org/maven2/org/apache/qpid/qpid-common/0.18/qpid-common-0.18.pom
1021b downloaded  (qpid-common-0.18.pom)
Downloading: http://repo1.maven.org/maven2/org/slf4j/slf4j-api/1.6.4/slf4j-api-1.6.4.pom
2K downloaded  (slf4j-api-1.6.4.pom)
Downloading: http://repo1.maven.org/maven2/org/slf4j/slf4j-parent/1.6.4/slf4j-parent-1.6.4.pom
11K downloaded  (slf4j-parent-1.6.4.pom)
Downloading: http://repo1.maven.org/maven2/org/apache/qpid/qpid-amqp-1-0-common/0.18/qpid-amqp-1-0-common-0.18.pom
867b downloaded  (qpid-amqp-1-0-common-0.18.pom)
Downloading: http://repo1.maven.org/maven2/commons-cli/commons-cli/1.2/commons-cli-1.2.pom
7K downloaded  (commons-cli-1.2.pom)
Downloading: http://repo1.maven.org/maven2/org/apache/commons/commons-parent/11/commons-parent-11.pom
24K downloaded  (commons-parent-11.pom)
Downloading: http://repo1.maven.org/maven2/log4j/log4j/1.2.16/log4j-1.2.16.pom
19K downloaded  (log4j-1.2.16.pom)
Downloading: http://repo1.maven.org/maven2/org/slf4j/slf4j-log4j12/1.6.4/slf4j-log4j12-1.6.4.pom
1K downloaded  (slf4j-log4j12-1.6.4.pom)
Downloading: http://repo1.maven.org/maven2/org/apache/felix/org.apache.felix.main/2.0.5/org.apache.felix.main-2.0.5.pom
9K downloaded  (org.apache.felix.main-2.0.5.pom)
Downloading: http://repo1.maven.org/maven2/org/apache/felix/felix-parent/1.2.0/felix-parent-1.2.0.pom
14K downloaded  (felix-parent-1.2.0.pom)
Downloading: http://repo1.maven.org/maven2/org/apache/derby/derby/10.8.2.2/derby-10.8.2.2.pom
2K downloaded  (derby-10.8.2.2.pom)
Downloading: http://repo1.maven.org/maven2/org/apache/derby/derby-project/10.8.2.2/derby-project-10.8.2.2.pom
6K downloaded  (derby-project-10.8.2.2.pom)
Downloading: http://repo1.maven.org/maven2/commons-beanutils/commons-beanutils-core/1.8.3/commons-beanutils-core-1.8.3.pom
1K downloaded  (commons-beanutils-core-1.8.3.pom)
Downloading: http://repo1.maven.org/maven2/commons-digester/commons-digester/1.8.1/commons-digester-1.8.1.pom
9K downloaded  (commons-digester-1.8.1.pom)
Downloading: http://repo1.maven.org/maven2/commons-collections/commons-collections/3.2.1/commons-collections-3.2.1.pom
12K downloaded  (commons-collections-3.2.1.pom)
Downloading: http://repo1.maven.org/maven2/commons-configuration/commons-configuration/1.8/commons-configuration-1.8.pom
19K downloaded  (commons-configuration-1.8.pom)
Downloading: http://repo1.maven.org/maven2/org/apache/commons/commons-parent/23/commons-parent-23.pom
43K downloaded  (commons-parent-23.pom)
Downloading: http://repo1.maven.org/maven2/org/codehaus/jackson/jackson-core-asl/1.9.0/jackson-core-asl-1.9.0.pom
1016b downloaded  (jackson-core-asl-1.9.0.pom)
Downloading: http://repo1.maven.org/maven2/org/codehaus/jackson/jackson-mapper-asl/1.9.0/jackson-mapper-asl-1.9.0.pom
1K downloaded  (jackson-mapper-asl-1.9.0.pom)
Downloading: http://repo1.maven.org/maven2/org/eclipse/jetty/jetty-server/7.6.3.v20120416/jetty-server-7.6.3.v20120416.pom
3K downloaded  (jetty-server-7.6.3.v20120416.pom)
Downloading: http://repo1.maven.org/maven2/org/eclipse/jetty/jetty-project/7.6.3.v20120416/jetty-project-7.6.3.v20120416.pom
25K downloaded  (jetty-project-7.6.3.v20120416.pom)
Downloading: http://repo1.maven.org/maven2/org/eclipse/jetty/jetty-parent/19/jetty-parent-19.pom
19K downloaded  (jetty-parent-19.pom)
Downloading: http://repo1.maven.org/maven2/org/eclipse/jetty/jetty-continuation/7.6.3.v20120416/jetty-continuation-7.6.3.v20120416.pom
2K downloaded  (jetty-continuation-7.6.3.v20120416.pom)
Downloading: http://repo1.maven.org/maven2/org/eclipse/jetty/jetty-security/7.6.3.v20120416/jetty-security-7.6.3.v20120416.pom
2K downloaded  (jetty-security-7.6.3.v20120416.pom)
Downloading: http://repo1.maven.org/maven2/org/eclipse/jetty/jetty-http/7.6.3.v20120416/jetty-http-7.6.3.v20120416.pom
2K downloaded  (jetty-http-7.6.3.v20120416.pom)
Downloading: http://repo1.maven.org/maven2/org/eclipse/jetty/jetty-io/7.6.3.v20120416/jetty-io-7.6.3.v20120416.pom
2K downloaded  (jetty-io-7.6.3.v20120416.pom)
Downloading: http://repo1.maven.org/maven2/org/eclipse/jetty/jetty-servlet/7.6.3.v20120416/jetty-servlet-7.6.3.v20120416.pom
2K downloaded  (jetty-servlet-7.6.3.v20120416.pom)
Downloading: http://repo1.maven.org/maven2/org/eclipse/jetty/jetty-util/7.6.3.v20120416/jetty-util-7.6.3.v20120416.pom
3K downloaded  (jetty-util-7.6.3.v20120416.pom)
Downloading: http://repo1.maven.org/maven2/org/apache/geronimo/specs/geronimo-servlet_2.5_spec/1.2/geronimo-servlet_2.5_spec-1.2.pom
2K downloaded  (geronimo-servlet_2.5_spec-1.2.pom)
Downloading: http://repo1.maven.org/maven2/org/apache/geronimo/specs/specs-parent/1.5/specs-parent-1.5.pom
5K downloaded  (specs-parent-1.5.pom)
Downloading: http://repo1.maven.org/maven2/org/apache/geronimo/genesis/config/project-config/1.4/project-config-1.4.pom
18K downloaded  (project-config-1.4.pom)
Downloading: http://people.apache.org/repo/m2-incubating-repository//org/apache/geronimo/genesis/config/config/1.4/config-1.4.pom
[INFO] Unable to find resource 'org.apache.geronimo.genesis.config:config:pom:1.4' in repository
apache-incubator (http://people.apache.org/repo/m2-incubating-repository/)
Downloading: http://repo1.maven.org/maven2/org/apache/geronimo/genesis/config/config/1.4/config-1.4.pom
3K downloaded  (config-1.4.pom)
Downloading: http://people.apache.org/repo/m2-incubating-repository//org/apache/geronimo/genesis/genesis/1.4/genesis-1.4.pom
[INFO] Unable to find resource 'org.apache.geronimo.genesis:genesis:pom:1.4' in repository
apache-incubator (http://people.apache.org/repo/m2-incubating-repository/)
Downloading: http://repo1.maven.org/maven2/org/apache/geronimo/genesis/genesis/1.4/genesis-1.4.pom
11K downloaded  (genesis-1.4.pom)
Downloading: http://repo1.maven.org/maven2/org/eclipse/jetty/jetty-websocket/7.6.3.v20120416/jetty-websocket-7.6.3.v20120416.pom
3K downloaded  (jetty-websocket-7.6.3.v20120416.pom)
Downloading: http://repo1.maven.org/maven2/org/apache/qpid/qpid-client/0.18/qpid-client-0.18.pom
1K downloaded  (qpid-client-0.18.pom)
Downloading: http://repo1.maven.org/maven2/commons-configuration/commons-configuration/1.8/commons-configuration-1.8.jar
Downloading: http://repo1.maven.org/maven2/org/apache/derby/derby/10.8.2.2/derby-10.8.2.2.jar
Downloading: http://repo1.maven.org/maven2/commons-digester/commons-digester/1.8.1/commons-digester-1.8.1.jar
Downloading: http://repo1.maven.org/maven2/commons-beanutils/commons-beanutils-core/1.8.3/commons-beanutils-core-1.8.3.jar
Downloading: http://repo1.maven.org/maven2/commons-cli/commons-cli/1.2/commons-cli-1.2.jar
40K downloaded  (commons-cli-1.2.jar)
Downloading: http://repo1.maven.org/maven2/org/apache/felix/org.apache.felix.main/2.0.5/org.apache.felix.main-2.0.5.jar
142K downloaded  (commons-digester-1.8.1.jar)
201K downloaded  (commons-beanutils-core-1.8.3.jar)
Downloading: http://repo1.maven.org/maven2/org/apache/qpid/qpid-broker/0.18/qpid-broker-0.18.jar
Downloading: http://repo1.maven.org/maven2/commons-collections/commons-collections/3.2.1/commons-collections-3.2.1.jar
561K downloaded  (commons-collections-3.2.1.jar)
Downloading: http://repo1.maven.org/maven2/org/codehaus/jackson/jackson-core-asl/1.9.0/jackson-core-asl-1.9.0.jar
382K downloaded  (org.apache.felix.main-2.0.5.jar)
222K downloaded  (jackson-core-asl-1.9.0.jar)
2608K downloaded  (derby-10.8.2.2.jar)
Downloading: http://repo1.maven.org/maven2/org/eclipse/jetty/jetty-server/7.6.3.v20120416/jetty-server-7.6.3.v20120416.jar
Downloading: http://repo1.maven.org/maven2/org/apache/geronimo/specs/geronimo-servlet_2.5_spec/1.2/geronimo-servlet_2.5_spec-1.2.jar
Downloading: http://repo1.maven.org/maven2/org/codehaus/jackson/jackson-mapper-asl/1.9.0/jackson-mapper-asl-1.9.0.jar
1877K downloaded  (qpid-broker-0.18.jar)
68K downloaded  (geronimo-servlet_2.5_spec-1.2.jar)
304K downloaded  (jetty-server-7.6.3.v20120416.jar)
Downloading: http://repo1.maven.org/maven2/org/eclipse/jetty/jetty-continuation/7.6.3.v20120416/jetty-continuation-7.6.3.v20120416.jar
746K downloaded  (jackson-mapper-asl-1.9.0.jar)
19K downloaded  (jetty-continuation-7.6.3.v20120416.jar)
Downloading: http://repo1.maven.org/maven2/org/apache/qpid/qpid-management-common/0.18/qpid-management-common-0.18.jar
Downloading: http://repo1.maven.org/maven2/org/eclipse/jetty/jetty-security/7.6.3.v20120416/jetty-security-7.6.3.v20120416.jar
81K downloaded  (jetty-security-7.6.3.v20120416.jar)
Downloading: http://repo1.maven.org/maven2/org/eclipse/jetty/jetty-http/7.6.3.v20120416/jetty-http-7.6.3.v20120416.jar
50K downloaded  (qpid-management-common-0.18.jar)
88K downloaded  (jetty-http-7.6.3.v20120416.jar)
Downloading: http://repo1.maven.org/maven2/org/eclipse/jetty/jetty-io/7.6.3.v20120416/jetty-io-7.6.3.v20120416.jar
94K downloaded  (jetty-io-7.6.3.v20120416.jar)
Downloading: http://repo1.maven.org/maven2/org/apache/qpid/qpid-common/0.18/qpid-common-0.18.jar
Downloading: http://repo1.maven.org/maven2/org/eclipse/jetty/jetty-servlet/7.6.3.v20120416/jetty-servlet-7.6.3.v20120416.jar
1329K downloaded  (qpid-common-0.18.jar)
85K downloaded  (jetty-servlet-7.6.3.v20120416.jar)
Downloading: http://repo1.maven.org/maven2/org/eclipse/jetty/jetty-util/7.6.3.v20120416/jetty-util-7.6.3.v20120416.jar
Downloading: http://repo1.maven.org/maven2/org/apache/qpid/qpid-amqp-1-0-common/0.18/qpid-amqp-1-0-common-0.18.jar
243K downloaded  (jetty-util-7.6.3.v20120416.jar)
Downloading: http://repo1.maven.org/maven2/org/eclipse/jetty/jetty-websocket/7.6.3.v20120416/jetty-websocket-7.6.3.v20120416.jar
117K downloaded  (jetty-websocket-7.6.3.v20120416.jar)
531K downloaded  (qpid-amqp-1-0-common-0.18.jar)
Downloading: http://repo1.maven.org/maven2/org/apache/qpid/qpid-client/0.18/qpid-client-0.18.jar
456K downloaded  (qpid-client-0.18.jar)
346K downloaded  (commons-configuration-1.8.jar)
[WARNING] org.apache.velocity.runtime.exception.ReferenceException: reference : template =
META-INF/DEPENDENCIES.vm [line 40,column 14] : $license.name is not a valid reference.
[INFO] [resources:resources {execution: default-resources}]
[INFO] Using 'UTF-8' encoding to copy filtered resources.
[INFO] skip non existing resourceDirectory <https://builds.apache.org/job/axis2-transports-trunk/ws/transports/modules/jms/src/main/resources>
[INFO] Copying 3 resources
[INFO] [compiler:compile {execution: default-compile}]
[INFO] Compiling 25 source files to <https://builds.apache.org/job/axis2-transports-trunk/ws/transports/modules/jms/target/classes>
[INFO] [dependency:copy {execution: copy}]
[INFO] Configured Artifact: org.aspectj:aspectjweaver:?:jar
[INFO] Copying aspectjweaver-1.6.1.jar to <https://builds.apache.org/job/axis2-transports-trunk/ws/transports/modules/jms/target/lib/aspectjweaver.jar>
[INFO] [resources:testResources {execution: default-testResources}]
[INFO] Using 'UTF-8' encoding to copy filtered resources.
[INFO] Copying 3 resources
[INFO] Copying 3 resources
[INFO] [compiler:testCompile {execution: default-testCompile}]
[INFO] Compiling 21 source files to <https://builds.apache.org/job/axis2-transports-trunk/ws/transports/modules/jms/target/test-classes>
[WARNING] DEPRECATED [systemProperties]: Use systemPropertyVariables instead.
[INFO] [surefire:test {execution: default-test}]
[INFO] Surefire report directory: <https://builds.apache.org/job/axis2-transports-trunk/ws/transports/modules/jms/target/surefire-reports>

-------------------------------------------------------
 T E S T S
-------------------------------------------------------
Running org.apache.axis2.transport.jms.JMSTransportTest
[AppClassLoader@1a5ab41] weaveinfo Join point 'method-call(void javax.jms.MessageProducer.send(javax.jms.Message))'
in Type 'org.apache.axis2.transport.jms.JMSClient' (JMSClient.java:72) advised by before advice
from 'org.apache.axis2.transport.jms.LogAspect' (LogAspect.java)
[Broker] BRK-1006 : Using configuration : <https://builds.apache.org/job/axis2-transports-trunk/ws/transports/modules/jms/src/test/conf/qpid/config.xml>
[Broker] BRK-1007 : Using logging configuration : <https://builds.apache.org/job/axis2-transports-trunk/ws/transports/modules/jms/src/test/conf/qpid/log4j.xml>
[Broker] BRK-1001 : Startup : Version: 0.18 Build: 1373004
[Broker] BRK-1010 : Platform : JVM : Sun Microsystems Inc. version: 1.5.0_22-b03 OS : Linux
version: 3.2.0-31-generic arch: i386
[Broker] BRK-1011 : Maximum Memory : 129,302,528 bytes
Tests run: 1, Failures: 0, Errors: 1, Skipped: 0, Time elapsed: 6.171 sec <<< FAILURE!
Running org.apache.axis2.transport.jms.ctype.ContentTypeRuleTest
Tests run: 2, Failures: 0, Errors: 0, Skipped: 0, Time elapsed: 0.238 sec

Results :

Tests in error: 
  org.apache.axis2.transport.testkit.ManagedTestSuite@fd0a62: java/util/concurrent/ConcurrentSkipListSet

Tests run: 3, Failures: 0, Errors: 1, Skipped: 0

[ERROR] There are test failures.

Please refer to <https://builds.apache.org/job/axis2-transports-trunk/ws/transports/modules/jms/target/surefire-reports>
for the individual test results.
[JENKINS] Recording test results
Nov 16, 2012 3:12:19 PM hudson.remoting.SynchronousCommandTransport$ReaderThread run
SEVERE: I/O error in channel channel
java.io.StreamCorruptedException
	at java.io.ObjectInputStream.readObject0(ObjectInputStream.java:1332)
	at java.io.ObjectInputStream.readObject(ObjectInputStream.java:348)
	at hudson.remoting.Command.readFrom(Command.java:90)
	at hudson.remoting.ClassicCommandTransport.read(ClassicCommandTransport.java:59)
	at hudson.remoting.SynchronousCommandTransport$ReaderThread.run(SynchronousCommandTransport.java:48)
channel stopped
[INFO] ------------------------------------------------------------------------
[ERROR] FATAL ERROR
[INFO] ------------------------------------------------------------------------
[INFO] null
[INFO] ------------------------------------------------------------------------
[INFO] Trace
java.lang.reflect.UndeclaredThrowableException
	at $Proxy2.isArchivingDisabled(Unknown Source)
	at hudson.maven.MavenBuildProxy$Filter.isArchivingDisabled(MavenBuildProxy.java:227)
	at hudson.maven.reporters.MavenArtifact.archive(MavenArtifact.java:223)
	at hudson.maven.reporters.MavenArtifactArchiver.postBuild(MavenArtifactArchiver.java:108)
	at hudson.maven.Maven2Builder.postModule(Maven2Builder.java:127)
	at hudson.maven.MavenBuilder$Adapter.fireLeaveModule(MavenBuilder.java:327)
	at hudson.maven.MavenBuilder$Adapter.postBuild(MavenBuilder.java:285)
	at org.apache.maven.lifecycle.LifecycleExecutorInterceptor.execute(LifecycleExecutorInterceptor.java:68)
	at org.apache.maven.DefaultMaven.doExecute(DefaultMaven.java:328)
	at org.apache.maven.DefaultMaven.execute(DefaultMaven.java:138)
	at org.apache.maven.cli.MavenCli.main(MavenCli.java:362)
	at sun.reflect.NativeMethodAccessorImpl.invoke0(Native Method)
	at sun.reflect.NativeMethodAccessorImpl.invoke(NativeMethodAccessorImpl.java:39)
	at sun.reflect.DelegatingMethodAccessorImpl.invoke(DelegatingMethodAccessorImpl.java:25)
	at java.lang.reflect.Method.invoke(Method.java:592)
	at org.codehaus.classworlds.Launcher.launchEnhanced(Launcher.java:315)
	at org.codehaus.classworlds.Launcher.launch(Launcher.java:255)
	at hudson.maven.agent.Main.launch(Main.java:185)
	at hudson.maven.MavenBuilder.call(MavenBuilder.java:151)
	at hudson.maven.Maven2Builder.call(Maven2Builder.java:77)
	at hudson.maven.Maven2Builder.call(Maven2Builder.java:53)
	at hudson.remoting.UserRequest.perform(UserRequest.java:118)
	at hudson.remoting.UserRequest.perform(UserRequest.java:48)
	at hudson.remoting.Request$2.run(Request.java:326)
	at hudson.remoting.InterceptingExecutorService$1.call(InterceptingExecutorService.java:72)
	at java.util.concurrent.FutureTask$Sync.innerRun(FutureTask.java:269)
	at java.util.concurrent.FutureTask.run(FutureTask.java:123)
	at java.util.concurrent.ThreadPoolExecutor$Worker.runTask(ThreadPoolExecutor.java:651)
	at java.util.concurrent.ThreadPoolExecutor$Worker.run(ThreadPoolExecutor.java:676)
	at java.lang.Thread.run(Thread.java:595)
Caused by: hudson.remoting.ChannelClosedException: channel is already closed
	at hudson.remoting.Channel.send(Channel.java:493)
	at hudson.remoting.Request.call(Request.java:129)
	at hudson.remoting.Channel.call(Channel.java:664)
	at hudson.remoting.RemoteInvocationHandler.invoke(RemoteInvocationHandler.java:158)
	... 30 more
Caused by: java.io.StreamCorruptedException
	at java.io.ObjectInputStream.readObject0(ObjectInputStream.java:1332)
	at java.io.ObjectInputStream.readObject(ObjectInputStream.java:348)
	at hudson.remoting.Command.readFrom(Command.java:90)
	at hudson.remoting.ClassicCommandTransport.read(ClassicCommandTransport.java:59)
	at hudson.remoting.SynchronousCommandTransport$ReaderThread.run(SynchronousCommandTransport.java:48)
[INFO] ------------------------------------------------------------------------
[INFO] Total time: 4 minutes 6 seconds
[INFO] Finished at: Fri Nov 16 15:12:19 UTC 2012
[locks-and-latches] Releasing all the locks
[locks-and-latches] All the locks released
ERROR: Maven JVM terminated unexpectedly with exit code 0


---------------------------------------------------------------------
To unsubscribe, e-mail: java-dev-unsubscribe@axis.apache.org
For additional commands, e-mail: java-dev-help@axis.apache.org


Mime
View raw message