axis-java-dev mailing list archives

Site index · List index
Message view « Date » · « Thread »
Top « Date » · « Thread »
From Apache Jenkins Server <jenk...@builds.apache.org>
Subject Build failed in Jenkins: Axis2 #1931
Date Wed, 14 Nov 2012 10:47:31 GMT
See <https://builds.apache.org/job/Axis2/1931/>

------------------------------------------
[...truncated 31 lines...]
[INFO]   Apache Axis2 - tool - Repository Maven Plugin
[INFO]   Apache Axis2 - Fast Infoset
[INFO]   Apache Axis2 - Clustering
[INFO]   Apache Axis2 - Scripting
[INFO]   Apache Axis2 - SAAJ
[INFO]   Apache Axis2 - Metadata
[INFO]   Apache Axis2 - JAXWS
[INFO]   Apache Axis2 - Test Utilities
[INFO]   Apache Axis2 - XMLBeans Data Binding
[INFO]   Apache Axis2 - tool - WSDL2Code Maven Plugin
[INFO]   Apache Axis2 - JAXWS Integration Tests
[INFO]   Apache Axis2 - MTOM Policy
[INFO]   Apache Axis2 - spring
[INFO]   Apache Axis2 - OSGi Integration
[INFO]   Apache Axis2 - Integration
[INFO]   Apache Axis2 - JiBX Data Binding
[INFO]   Apache Axis2 - JSON
[INFO]   Apache Axis2 - MEX
[INFO]   Apache Axis2 - MTOM Policy module
[INFO]   Apache Axis2 - Ping
[INFO]   Apache Axis2 - tool - AAR Maven Plugin
[INFO]   Apache Axis2 - Version Service
[INFO]   Apache Axis2 - SOAP Monitor Servlet
[INFO]   Apache Axis2 - SOAP Monitor Module
[INFO]   Apache Axis2 - tool - Ant Plugin
[INFO]   Apache Axis2 - tool - Eclipse Codegen Plugin
[INFO]   Apache Axis2 - tool - Eclipse service Plugin
[INFO]   Apache Axis2 - tool - Intellij IDEA Plugin
[INFO]   Apache Axis2 - tool - Java2WSDL Maven Plugin
[INFO]   Apache Axis2 Simple HTTP server Maven Plugin
[INFO]   Axis2 quickstart archetype
[INFO]   Axis2 quickstart-web archetype
[INFO]   Apache Axis2 - JAXB-RI Data Binding
[INFO]   Apache Axis2 - CORBA
[INFO]   Apache Axis2 - JAXWS (mar)
[INFO]   Apache Axis2 - Web Application module
[INFO]   Apache Axis2 - Distribution
[INFO]   Apache Axis2 - Root
[INFO] ------------------------------------------------------------------------
[INFO] Building Apache Axis2 - Parent
[INFO]    task-segment: [clean, deploy]
[INFO] ------------------------------------------------------------------------
[INFO] [clean:clean {execution: default-clean}]
[INFO] Deleting directory <https://builds.apache.org/job/Axis2/ws/axis2/modules/parent/target>
[INFO] [enforcer:enforce {execution: default}]
[INFO] Setting property: classpath.resource.loader.class => 'org.codehaus.plexus.velocity.ContextClassLoaderResourceLoader'.
[INFO] Setting property: velocimacro.messages.on => 'false'.
[INFO] Setting property: resource.loader => 'classpath'.
[INFO] Setting property: resource.manager.logwhenfound => 'false'.
[INFO] [remote-resources:process {execution: default}]
[INFO] [site:attach-descriptor {execution: default-attach-descriptor}]
[INFO] Unable to load parent project from a relative path: Could not find the model file '<https://builds.apache.org/job/Axis2/ws/axis2/modules/parent/../pom.xml'.>
for project unknown
[INFO] Parent project loaded from repository.
[INFO] [assembly:single {execution: source-release-assembly}]
[INFO] Skipping the assembly in this project because it's not the Execution Root
[INFO] Preparing source:jar
[WARNING] Removing: jar from forked lifecycle, to prevent recursive invocation.
[JENKINS] Archiving <https://builds.apache.org/job/Axis2/ws/axis2/modules/parent/pom.xml>
to /home/hudson/hudson/jobs/Axis2/modules/org.apache.axis2$axis2-parent/builds/2012-11-14_10-47-00/archive/org.apache.axis2/axis2-parent/1.7.0-SNAPSHOT/axis2-parent-1.7.0-SNAPSHOT.pom
[INFO] [enforcer:enforce {execution: default}]
[INFO] [source:jar {execution: attach-sources}]
[INFO] [javadoc:jar {execution: attach-javadocs}]
[INFO] Not executing Javadoc as the project is not a Java classpath-capable package
[INFO] [gpg:sign {execution: default}]
[INFO] [install:install {execution: default-install}]
[INFO] Installing <https://builds.apache.org/job/Axis2/ws/axis2/modules/parent/pom.xml>
to <https://builds.apache.org/job/Axis2/ws/.repository/org/apache/axis2/axis2-parent/1.7.0-SNAPSHOT/axis2-parent-1.7.0-SNAPSHOT.pom>
[INFO] [deploy:deploy {execution: default-deploy}]
[INFO] Retrieving previous build number from apache.snapshots.https
[WARNING] *** CHECKSUM FAILED - Checksum failed on download: local = 'b04492195455e4c551ce3ecaadc740f3f8ed2b4a';
remote = '669a9cdd758c01d2bb8ac391cf1b4f1157c20018' - RETRYING
[WARNING] *** CHECKSUM FAILED - Checksum failed on download: local = 'b04492195455e4c551ce3ecaadc740f3f8ed2b4a';
remote = '669a9cdd758c01d2bb8ac391cf1b4f1157c20018' - IGNORING
Uploading: https://repository.apache.org/content/repositories/snapshots/org/apache/axis2/axis2-parent/1.7.0-SNAPSHOT/axis2-parent-1.7.0-20121114.104717-1216.pom
50K uploaded  (axis2-parent-1.7.0-20121114.104717-1216.pom)
[INFO] Uploading site descriptor for axis2-parent 1.7.0-20121114.104717-1216 site.xml
[INFO] Retrieving previous metadata from apache.snapshots.https
[WARNING] *** CHECKSUM FAILED - Checksum failed on download: local = 'b04492195455e4c551ce3ecaadc740f3f8ed2b4a';
remote = '669a9cdd758c01d2bb8ac391cf1b4f1157c20018' - RETRYING
[WARNING] *** CHECKSUM FAILED - Checksum failed on download: local = 'b04492195455e4c551ce3ecaadc740f3f8ed2b4a';
remote = '669a9cdd758c01d2bb8ac391cf1b4f1157c20018' - IGNORING
[INFO] Uploading repository metadata for: 'snapshot org.apache.axis2:axis2-parent:1.7.0-SNAPSHOT'
[INFO] Retrieving previous metadata from apache.snapshots.https
[WARNING] *** CHECKSUM FAILED - Checksum failed on download: local = '90b85afb58dd84bf266c91fa4b7f9f4ef8900217';
remote = '138f215ff905bd1d711bc17b7643caca4e40f5d4' - RETRYING
[WARNING] *** CHECKSUM FAILED - Checksum failed on download: local = '90b85afb58dd84bf266c91fa4b7f9f4ef8900217';
remote = '138f215ff905bd1d711bc17b7643caca4e40f5d4' - IGNORING
[INFO] Uploading repository metadata for: 'artifact org.apache.axis2:axis2-parent'
[JENKINS] Archiving <https://builds.apache.org/job/Axis2/ws/.repository/org/apache/axis2/axis2-parent/1.7.0-SNAPSHOT/axis2-parent-1.7.0-SNAPSHOT.pom>
to /home/hudson/hudson/jobs/Axis2/modules/org.apache.axis2$axis2-parent/builds/2012-11-14_10-47-00/archive/org.apache.axis2/axis2-parent/1.7.0-20121114.104717-1216/axis2-parent-1.7.0-20121114.104717-1216.pom
[INFO] ------------------------------------------------------------------------
[INFO] Building Apache Axis2 - Resource bundle
[INFO]    task-segment: [clean, deploy]
[INFO] ------------------------------------------------------------------------
[INFO] [clean:clean {execution: default-clean}]
[INFO] Deleting directory <https://builds.apache.org/job/Axis2/ws/axis2/modules/resource-bundle/target>
[INFO] [enforcer:enforce {execution: default}]
[INFO] [remote-resources:bundle {execution: default}]
[INFO] [remote-resources:process {execution: default}]
[INFO] [resources:resources {execution: default-resources}]
[INFO] Using 'UTF-8' encoding to copy filtered resources.
[INFO] Copying 2 resources
[INFO] Copying 3 resources
[INFO] [compiler:compile {execution: default-compile}]
[INFO] No sources to compile
[INFO] [resources:testResources {execution: default-testResources}]
[INFO] Using 'UTF-8' encoding to copy filtered resources.
[INFO] skip non existing resourceDirectory <https://builds.apache.org/job/Axis2/ws/axis2/modules/resource-bundle/src/test/resources>
[INFO] Copying 3 resources
[INFO] [compiler:testCompile {execution: default-testCompile}]
[INFO] No sources to compile
[INFO] [surefire:test {execution: default-test}]
[INFO] Surefire report directory: <https://builds.apache.org/job/Axis2/ws/axis2/modules/resource-bundle/target/surefire-reports>

-------------------------------------------------------
 T E S T S
-------------------------------------------------------
There are no tests to run.

Results :

Tests run: 0, Failures: 0, Errors: 0, Skipped: 0

[JENKINS] Recording test results
[INFO] [jar:jar {execution: default-jar}]
[INFO] Building jar: <https://builds.apache.org/job/Axis2/ws/axis2/modules/resource-bundle/target/axis2-resource-bundle-1.7.0-SNAPSHOT.jar>
[INFO] [assembly:single {execution: source-release-assembly}]
[INFO] Skipping the assembly in this project because it's not the Execution Root
[INFO] Preparing source:jar
[WARNING] Removing: jar from forked lifecycle, to prevent recursive invocation.
[JENKINS] Archiving <https://builds.apache.org/job/Axis2/ws/axis2/modules/resource-bundle/pom.xml>
to /home/hudson/hudson/jobs/Axis2/modules/org.apache.axis2$axis2-resource-bundle/builds/2012-11-14_10-47-00/archive/org.apache.axis2/axis2-resource-bundle/1.7.0-SNAPSHOT/axis2-resource-bundle-1.7.0-SNAPSHOT.pom
[JENKINS] Archiving <https://builds.apache.org/job/Axis2/ws/axis2/modules/resource-bundle/target/axis2-resource-bundle-1.7.0-SNAPSHOT.jar>
to /home/hudson/hudson/jobs/Axis2/modules/org.apache.axis2$axis2-resource-bundle/builds/2012-11-14_10-47-00/archive/org.apache.axis2/axis2-resource-bundle/1.7.0-SNAPSHOT/axis2-resource-bundle-1.7.0-SNAPSHOT.jar
[INFO] [enforcer:enforce {execution: default}]
[INFO] [source:jar {execution: attach-sources}]
[INFO] Building jar: <https://builds.apache.org/job/Axis2/ws/axis2/modules/resource-bundle/target/axis2-resource-bundle-1.7.0-SNAPSHOT-sources.jar>
[INFO] [javadoc:jar {execution: attach-javadocs}]
[INFO] [gpg:sign {execution: default}]
[INFO] [install:install {execution: default-install}]
[INFO] Installing <https://builds.apache.org/job/Axis2/ws/axis2/modules/resource-bundle/target/axis2-resource-bundle-1.7.0-SNAPSHOT.jar>
to <https://builds.apache.org/job/Axis2/ws/.repository/org/apache/axis2/axis2-resource-bundle/1.7.0-SNAPSHOT/axis2-resource-bundle-1.7.0-SNAPSHOT.jar>
[INFO] Installing <https://builds.apache.org/job/Axis2/ws/axis2/modules/resource-bundle/target/axis2-resource-bundle-1.7.0-SNAPSHOT-sources.jar>
to <https://builds.apache.org/job/Axis2/ws/.repository/org/apache/axis2/axis2-resource-bundle/1.7.0-SNAPSHOT/axis2-resource-bundle-1.7.0-SNAPSHOT-sources.jar>
[INFO] [deploy:deploy {execution: default-deploy}]
[INFO] Retrieving previous build number from apache.snapshots.https
[WARNING] *** CHECKSUM FAILED - Checksum failed on download: local = '1a5eeaf5f2bff37714164f653e2924b480364108';
remote = '13393ab099d9efb723da5e9a66c1c702b5eb6851' - RETRYING
[WARNING] *** CHECKSUM FAILED - Checksum failed on download: local = '1a5eeaf5f2bff37714164f653e2924b480364108';
remote = '13393ab099d9efb723da5e9a66c1c702b5eb6851' - IGNORING
Uploading: https://repository.apache.org/content/repositories/snapshots/org/apache/axis2/axis2-resource-bundle/1.7.0-SNAPSHOT/axis2-resource-bundle-1.7.0-20121114.104717-1215.jar
12K uploaded  (axis2-resource-bundle-1.7.0-20121114.104717-1215.jar)
[INFO] Retrieving previous metadata from apache.snapshots.https
[WARNING] *** CHECKSUM FAILED - Checksum failed on download: local = '1a5eeaf5f2bff37714164f653e2924b480364108';
remote = '13393ab099d9efb723da5e9a66c1c702b5eb6851' - RETRYING
[WARNING] *** CHECKSUM FAILED - Checksum failed on download: local = '1a5eeaf5f2bff37714164f653e2924b480364108';
remote = '13393ab099d9efb723da5e9a66c1c702b5eb6851' - IGNORING
[INFO] Uploading repository metadata for: 'snapshot org.apache.axis2:axis2-resource-bundle:1.7.0-SNAPSHOT'
[INFO] Retrieving previous metadata from apache.snapshots.https
[WARNING] *** CHECKSUM FAILED - Checksum failed on download: local = '231bba211c4150531c02a474470b62c651fbcf94';
remote = 'fc94d5ecd3483e97928698b603a10aa974ae876d' - RETRYING
[WARNING] *** CHECKSUM FAILED - Checksum failed on download: local = '231bba211c4150531c02a474470b62c651fbcf94';
remote = 'fc94d5ecd3483e97928698b603a10aa974ae876d' - IGNORING
[INFO] Uploading repository metadata for: 'artifact org.apache.axis2:axis2-resource-bundle'
[INFO] Uploading project information for axis2-resource-bundle 1.7.0-20121114.104717-1215
[INFO] Retrieving previous build number from apache.snapshots.https
Uploading: https://repository.apache.org/content/repositories/snapshots/org/apache/axis2/axis2-resource-bundle/1.7.0-SNAPSHOT/axis2-resource-bundle-1.7.0-20121114.104717-1215-sources.jar
9K uploaded  (axis2-resource-bundle-1.7.0-20121114.104717-1215-sources.jar)
[JENKINS] Archiving <https://builds.apache.org/job/Axis2/ws/axis2/modules/resource-bundle/target/axis2-resource-bundle-1.7.0-SNAPSHOT.jar>
to /home/hudson/hudson/jobs/Axis2/modules/org.apache.axis2$axis2-resource-bundle/builds/2012-11-14_10-47-00/archive/org.apache.axis2/axis2-resource-bundle/1.7.0-20121114.104717-1215/axis2-resource-bundle-1.7.0-20121114.104717-1215.jar
[JENKINS] Archiving <https://builds.apache.org/job/Axis2/ws/axis2/modules/resource-bundle/target/axis2-resource-bundle-1.7.0-SNAPSHOT-sources.jar>
to /home/hudson/hudson/jobs/Axis2/modules/org.apache.axis2$axis2-resource-bundle/builds/2012-11-14_10-47-00/archive/org.apache.axis2/axis2-resource-bundle/1.7.0-20121114.104717-1215/axis2-resource-bundle-1.7.0-20121114.104717-1215-sources.jar
[INFO] ------------------------------------------------------------------------
[INFO] Building Apache Axis2 - Kernel
[INFO]    task-segment: [clean, deploy]
[INFO] ------------------------------------------------------------------------
[INFO] [clean:clean {execution: default-clean}]
[INFO] Deleting directory <https://builds.apache.org/job/Axis2/ws/axis2/modules/kernel/target>
[INFO] snapshot org.apache.ws.commons.axiom:axiom-api:1.2.14-SNAPSHOT: checking for updates
from apache.snapshots
Downloading: http://repository.apache.org/snapshots/org/apache/ws/commons/axiom/axiom-api/1.2.14-SNAPSHOT/axiom-api-1.2.14-20121114.102528-400.pom

[INFO] snapshot org.apache.ws.commons.axiom:axiom-parent:1.2.14-SNAPSHOT: checking for updates
from apache.snapshots
Downloading: http://repository.apache.org/snapshots/org/apache/ws/commons/axiom/axiom-parent/1.2.14-SNAPSHOT/axiom-parent-1.2.14-20121114.102247-405.pom

[INFO] snapshot org.apache.james:apache-mime4j-core:0.8-SNAPSHOT: checking for updates from
apache.snapshots
Downloading: http://repository.apache.org/snapshots/org/apache/james/apache-mime4j-core/0.8-SNAPSHOT/apache-mime4j-core-0.8-20121113.143553-431.pom

[INFO] snapshot org.apache.james:apache-mime4j-project:0.8-SNAPSHOT: checking for updates
from apache.snapshots
Downloading: http://repository.apache.org/snapshots/org/apache/james/apache-mime4j-project/0.8-SNAPSHOT/apache-mime4j-project-0.8-20121113.143234-460.pom

[INFO] snapshot org.apache.ws.commons.axiom:axiom-impl:1.2.14-SNAPSHOT: checking for updates
from apache.snapshots
Downloading: http://repository.apache.org/snapshots/org/apache/ws/commons/axiom/axiom-impl/1.2.14-SNAPSHOT/axiom-impl-1.2.14-20121114.103051-400.pom

[INFO] snapshot org.apache.ws.commons.schema:XmlSchema:1.4.8-SNAPSHOT: checking for updates
from apache.snapshots
Downloading: http://repository.apache.org/snapshots/org/apache/ws/commons/schema/XmlSchema/1.4.8-SNAPSHOT/XmlSchema-1.4.8-SNAPSHOT.pom

[INFO] snapshot org.apache.neethi:neethi:3.0.3-SNAPSHOT: checking for updates from apache.snapshots
Downloading: http://repository.apache.org/snapshots/org/apache/neethi/neethi/3.0.3-SNAPSHOT/neethi-3.0.3-20121114.104259-340.pom

[INFO] snapshot org.apache.woden:woden-core:1.0-SNAPSHOT: checking for updates from apache.snapshots
Downloading: http://repository.apache.org/snapshots/org/apache/woden/woden-core/1.0-SNAPSHOT/woden-core-1.0-20121114.104148-149.pom

[INFO] snapshot org.apache.woden:woden:1.0-SNAPSHOT: checking for updates from apache.snapshots
Downloading: http://repository.apache.org/snapshots/org/apache/woden/woden/1.0-SNAPSHOT/woden-1.0-20121114.104147-565.pom

Downloading: http://repository.apache.org/snapshots/org/apache/ws/commons/schema/XmlSchema/1.4.8-SNAPSHOT/XmlSchema-1.4.8-SNAPSHOT.jar
Downloading: http://repository.apache.org/snapshots/org/apache/woden/woden-core/1.0-SNAPSHOT/woden-core-1.0-20121114.104148-149.jar
Downloading: http://repository.apache.org/snapshots/org/apache/james/apache-mime4j-core/0.8-SNAPSHOT/apache-mime4j-core-0.8-20121113.143553-431.jar
Downloading: http://repository.apache.org/snapshots/org/apache/ws/commons/axiom/axiom-api/1.2.14-SNAPSHOT/axiom-api-1.2.14-20121114.102528-400.jar
Downloading: http://repository.apache.org/snapshots/org/apache/neethi/neethi/3.0.3-SNAPSHOT/neethi-3.0.3-20121114.104259-340.jar
69K downloaded  (neethi-3.0.3-20121114.104259-340.jar)
145K downloaded  (XmlSchema-1.4.8-SNAPSHOT.jar)
411K downloaded  (axiom-api-1.2.14-20121114.102528-400.jar)
93K downloaded  (apache-mime4j-core-0.8-20121113.143553-431.jar)
Downloading: http://repository.apache.org/snapshots/org/apache/ws/commons/axiom/axiom-impl/1.2.14-SNAPSHOT/axiom-impl-1.2.14-20121114.103051-400.jar
363K downloaded  (woden-core-1.0-20121114.104148-149.jar)
166K downloaded  (axiom-impl-1.2.14-20121114.103051-400.jar)
[INFO] [enforcer:enforce {execution: default}]
[INFO] [remote-resources:process {execution: default}]
[INFO] [resources:resources {execution: default-resources}]
[INFO] Using 'UTF-8' encoding to copy filtered resources.
[INFO] Copying 1 resource
[INFO] Copying 3 resources
[INFO] Copying 2 resources
[INFO] [antrun:run {execution: process-resources}]
[INFO] Executing tasks
     [copy] Copying 1 file to <https://builds.apache.org/job/Axis2/ws/axis2/modules/kernel/target/classes/org/apache/axis2/i18n>
[INFO] Executed tasks
[INFO] [compiler:compile {execution: default-compile}]
[INFO] Compiling 349 source files to <https://builds.apache.org/job/Axis2/ws/axis2/modules/kernel/target/classes>
[INFO] -------------------------------------------------------------
[ERROR] COMPILATION ERROR : 
[INFO] -------------------------------------------------------------
[ERROR] <https://builds.apache.org/job/Axis2/ws/axis2/modules/kernel/src/org/apache/axis2/util/XMLUtils.java>:[27,32]
cannot find symbol
symbol  : class Base64
location: package org.apache.axiom.om.util

[ERROR] <https://builds.apache.org/job/Axis2/ws/axis2/modules/kernel/src/org/apache/axis2/util/XMLUtils.java>:[476,15]
cannot find symbol
symbol  : variable Base64
location: class org.apache.axis2.util.XMLUtils

[INFO] 2 errors 
[INFO] -------------------------------------------------------------
[JENKINS] Archiving <https://builds.apache.org/job/Axis2/ws/axis2/modules/kernel/pom.xml>
to /home/hudson/hudson/jobs/Axis2/modules/org.apache.axis2$axis2-kernel/builds/2012-11-14_10-47-00/archive/org.apache.axis2/axis2-kernel/1.7.0-SNAPSHOT/axis2-kernel-1.7.0-SNAPSHOT.pom
[INFO] ------------------------------------------------------------------------
[ERROR] BUILD FAILURE
[INFO] ------------------------------------------------------------------------
[INFO] Compilation failure

<https://builds.apache.org/job/Axis2/ws/axis2/modules/kernel/src/org/apache/axis2/util/XMLUtils.java>:[27,32]
cannot find symbol
symbol  : class Base64
location: package org.apache.axiom.om.util

<https://builds.apache.org/job/Axis2/ws/axis2/modules/kernel/src/org/apache/axis2/util/XMLUtils.java>:[476,15]
cannot find symbol
symbol  : variable Base64
location: class org.apache.axis2.util.XMLUtils


[INFO] ------------------------------------------------------------------------
[INFO] For more information, run Maven with the -e switch
[INFO] ------------------------------------------------------------------------
[INFO] Total time: 22 seconds
[INFO] Finished at: Wed Nov 14 10:47:29 GMT 2012
[INFO] Final Memory: 65M/134M
[INFO] ------------------------------------------------------------------------
Waiting for Jenkins to finish collecting data
Sending e-mails to: java-dev@axis.apache.org
channel stopped
[locks-and-latches] Releasing all the locks
[locks-and-latches] All the locks released

---------------------------------------------------------------------
To unsubscribe, e-mail: java-dev-unsubscribe@axis.apache.org
For additional commands, e-mail: java-dev-help@axis.apache.org


Mime
View raw message