axis-java-dev mailing list archives

Site index · List index
Message view « Date » · « Thread »
Top « Date » · « Thread »
From Apache Jenkins Server <jenk...@builds.apache.org>
Subject Build failed in Jenkins: Axis2 #2421
Date Tue, 23 Jul 2013 02:54:37 GMT
See <https://builds.apache.org/job/Axis2/2421/>

------------------------------------------
[...truncated 2544 lines...]
[WARNING] <https://builds.apache.org/job/Axis2/ws/axis2/modules/tool/axis2-mar-maven-plugin/src/main/java/org/apache/axis2/maven2/mar/MarMojo.java>:42:
warning - @requiresDependencyResolution is an unknown tag.
[INFO] Building jar: <https://builds.apache.org/job/Axis2/ws/axis2/modules/tool/axis2-mar-maven-plugin/target/axis2-mar-maven-plugin-1.7.0-SNAPSHOT-javadoc.jar>
[INFO] [gpg:sign {execution: default}]
[INFO] [install:install {execution: default-install}]
[INFO] Installing <https://builds.apache.org/job/Axis2/ws/axis2/modules/tool/axis2-mar-maven-plugin/target/axis2-mar-maven-plugin-1.7.0-SNAPSHOT.jar>
to <https://builds.apache.org/job/Axis2/ws/.repository/org/apache/axis2/axis2-mar-maven-plugin/1.7.0-SNAPSHOT/axis2-mar-maven-plugin-1.7.0-SNAPSHOT.jar>
[INFO] Installing <https://builds.apache.org/job/Axis2/ws/axis2/modules/tool/axis2-mar-maven-plugin/target/axis2-mar-maven-plugin-1.7.0-SNAPSHOT-sources.jar>
to <https://builds.apache.org/job/Axis2/ws/.repository/org/apache/axis2/axis2-mar-maven-plugin/1.7.0-SNAPSHOT/axis2-mar-maven-plugin-1.7.0-SNAPSHOT-sources.jar>
[INFO] Installing <https://builds.apache.org/job/Axis2/ws/axis2/modules/tool/axis2-mar-maven-plugin/target/axis2-mar-maven-plugin-1.7.0-SNAPSHOT-javadoc.jar>
to <https://builds.apache.org/job/Axis2/ws/.repository/org/apache/axis2/axis2-mar-maven-plugin/1.7.0-SNAPSHOT/axis2-mar-maven-plugin-1.7.0-SNAPSHOT-javadoc.jar>
[INFO] [deploy:deploy {execution: default-deploy}]
[INFO] Retrieving previous build number from apache.snapshots.https
Uploading: https://repository.apache.org/content/repositories/snapshots/org/apache/axis2/axis2-mar-maven-plugin/1.7.0-SNAPSHOT/axis2-mar-maven-plugin-1.7.0-20130723.024407-1608.jar
17K uploaded  (axis2-mar-maven-plugin-1.7.0-20130723.024407-1608.jar)
[INFO] Retrieving previous metadata from apache.snapshots.https
[INFO] Uploading repository metadata for: 'snapshot org.apache.axis2:axis2-mar-maven-plugin:1.7.0-SNAPSHOT'
[INFO] Uploading project information for axis2-mar-maven-plugin 1.7.0-20130723.024407-1608
[INFO] Retrieving previous metadata from apache.snapshots.https
[INFO] Uploading repository metadata for: 'artifact org.apache.axis2:axis2-mar-maven-plugin'
[INFO] Retrieving previous metadata from apache.snapshots.https
[INFO] Uploading repository metadata for: 'org.apache.axis2'
[INFO] Retrieving previous build number from apache.snapshots.https
Uploading: https://repository.apache.org/content/repositories/snapshots/org/apache/axis2/axis2-mar-maven-plugin/1.7.0-SNAPSHOT/axis2-mar-maven-plugin-1.7.0-20130723.024407-1608-sources.jar
14K uploaded  (axis2-mar-maven-plugin-1.7.0-20130723.024407-1608-sources.jar)
[INFO] Retrieving previous build number from apache.snapshots.https
Uploading: https://repository.apache.org/content/repositories/snapshots/org/apache/axis2/axis2-mar-maven-plugin/1.7.0-SNAPSHOT/axis2-mar-maven-plugin-1.7.0-20130723.024407-1608-javadoc.jar
43K uploaded  (axis2-mar-maven-plugin-1.7.0-20130723.024407-1608-javadoc.jar)
[JENKINS] Archiving <https://builds.apache.org/job/Axis2/ws/axis2/modules/tool/axis2-mar-maven-plugin/target/axis2-mar-maven-plugin-1.7.0-SNAPSHOT.jar>
to /home/hudson/hudson/jobs/Axis2/modules/org.apache.axis2$axis2-mar-maven-plugin/builds/2013-07-23_02-43-12/archive/org.apache.axis2/axis2-mar-maven-plugin/1.7.0-20130723.024407-1608/axis2-mar-maven-plugin-1.7.0-20130723.024407-1608.jar
[JENKINS] Archiving <https://builds.apache.org/job/Axis2/ws/axis2/modules/tool/axis2-mar-maven-plugin/target/axis2-mar-maven-plugin-1.7.0-SNAPSHOT-sources.jar>
to /home/hudson/hudson/jobs/Axis2/modules/org.apache.axis2$axis2-mar-maven-plugin/builds/2013-07-23_02-43-12/archive/org.apache.axis2/axis2-mar-maven-plugin/1.7.0-20130723.024407-1608/axis2-mar-maven-plugin-1.7.0-20130723.024407-1608-sources.jar
[JENKINS] Archiving <https://builds.apache.org/job/Axis2/ws/axis2/modules/tool/axis2-mar-maven-plugin/target/axis2-mar-maven-plugin-1.7.0-SNAPSHOT-javadoc.jar>
to /home/hudson/hudson/jobs/Axis2/modules/org.apache.axis2$axis2-mar-maven-plugin/builds/2013-07-23_02-43-12/archive/org.apache.axis2/axis2-mar-maven-plugin/1.7.0-20130723.024407-1608/axis2-mar-maven-plugin-1.7.0-20130723.024407-1608-javadoc.jar
[INFO] ------------------------------------------------------------------------
[INFO] Building Apache Axis2 - Addressing
[INFO]    task-segment: [clean, deploy]
[INFO] ------------------------------------------------------------------------
[INFO] [clean:clean {execution: default-clean}]
[INFO] Deleting directory <https://builds.apache.org/job/Axis2/ws/axis2/modules/addressing/target>
[INFO] [enforcer:enforce {execution: default}]
[INFO] [remote-resources:process {execution: default}]
[INFO] [resources:resources {execution: default-resources}]
[INFO] Using 'UTF-8' encoding to copy filtered resources.
[INFO] skip non existing resourceDirectory <https://builds.apache.org/job/Axis2/ws/axis2/modules/addressing/conf>
[INFO] Copying 1 resource
[INFO] Copying 2 resources
[INFO] [compiler:compile {execution: default-compile}]
[INFO] Compiling 5 source files to <https://builds.apache.org/job/Axis2/ws/axis2/modules/addressing/target/classes>
[INFO] [resources:testResources {execution: default-testResources}]
[INFO] Using 'UTF-8' encoding to copy filtered resources.
[INFO] Copying 48 resources to ../test-resources
[INFO] Copying 2 resources
[INFO] [compiler:testCompile {execution: default-testCompile}]
[INFO] Compiling 7 source files to <https://builds.apache.org/job/Axis2/ws/axis2/modules/addressing/target/test-classes>
[INFO] [surefire:test {execution: default-test}]
[INFO] Surefire report directory: <https://builds.apache.org/job/Axis2/ws/axis2/modules/addressing/target/surefire-reports>

-------------------------------------------------------
 T E S T S
-------------------------------------------------------
Running org.apache.axis2.handlers.addressing.AddressingInFaultHandlerTest
Tests run: 4, Failures: 0, Errors: 0, Skipped: 0, Time elapsed: 0.412 sec
Running org.apache.axis2.handlers.addressing.AddressingOutHandlerTest
Tests run: 16, Failures: 0, Errors: 0, Skipped: 0, Time elapsed: 0.421 sec
Running org.apache.axis2.handlers.addressing.AddressingSubmissionInHandlerTest
Tests run: 15, Failures: 0, Errors: 0, Skipped: 0, Time elapsed: 0.036 sec
Running org.apache.axis2.handlers.addressing.AddressingValidationHandlerTest
Tests run: 5, Failures: 0, Errors: 0, Skipped: 0, Time elapsed: 0.027 sec
Running org.apache.axis2.handlers.addressing.AddressingFinalInHandlerTest
Tests run: 19, Failures: 0, Errors: 0, Skipped: 0, Time elapsed: 0.039 sec

Results :

Tests run: 59, Failures: 0, Errors: 0, Skipped: 0

[JENKINS] Recording test results
[INFO] [axis2-mar:mar {execution: default-mar}]
[INFO] Generating mar <https://builds.apache.org/job/Axis2/ws/axis2/modules/addressing/target/addressing-1.7.0-SNAPSHOT.mar>
[INFO] Building jar: <https://builds.apache.org/job/Axis2/ws/axis2/modules/addressing/target/addressing-1.7.0-SNAPSHOT.mar>
[INFO] [assembly:single {execution: source-release-assembly}]
[INFO] Skipping the assembly in this project because it's not the Execution Root
[INFO] Preparing source:jar
[WARNING] Removing: jar from forked lifecycle, to prevent recursive invocation.
[JENKINS] Archiving <https://builds.apache.org/job/Axis2/ws/axis2/modules/addressing/pom.xml>
to /home/hudson/hudson/jobs/Axis2/modules/org.apache.axis2$addressing/builds/2013-07-23_02-43-09/archive/org.apache.axis2/addressing/1.7.0-SNAPSHOT/addressing-1.7.0-SNAPSHOT.pom
[JENKINS] Archiving <https://builds.apache.org/job/Axis2/ws/axis2/modules/addressing/target/addressing-1.7.0-SNAPSHOT.mar>
to /home/hudson/hudson/jobs/Axis2/modules/org.apache.axis2$addressing/builds/2013-07-23_02-43-09/archive/org.apache.axis2/addressing/1.7.0-SNAPSHOT/addressing-1.7.0-SNAPSHOT.mar
[INFO] [enforcer:enforce {execution: default}]
[INFO] [source:jar {execution: attach-sources}]
[INFO] Building jar: <https://builds.apache.org/job/Axis2/ws/axis2/modules/addressing/target/addressing-1.7.0-SNAPSHOT-sources.jar>
[INFO] [javadoc:jar {execution: attach-javadocs}]
Loading source files for package org.apache.axis2.handlers.addressing...
Constructing Javadoc information...
Standard Doclet version 1.5.0_22
Building tree for all the packages and classes...
Generating <https://builds.apache.org/job/Axis2/ws/axis2/modules/addressing/target/apidocs/org/apache/axis2/handlers/addressing//Addressing.html...>
Generating <https://builds.apache.org/job/Axis2/ws/axis2/modules/addressing/target/apidocs/org/apache/axis2/handlers/addressing//AddressingInFaultHandler.html...>
Generating <https://builds.apache.org/job/Axis2/ws/axis2/modules/addressing/target/apidocs/org/apache/axis2/handlers/addressing//AddressingInHandler.html...>
Generating <https://builds.apache.org/job/Axis2/ws/axis2/modules/addressing/target/apidocs/org/apache/axis2/handlers/addressing//AddressingOutHandler.html...>
Generating <https://builds.apache.org/job/Axis2/ws/axis2/modules/addressing/target/apidocs/org/apache/axis2/handlers/addressing//AddressingValidationHandler.html...>
Generating <https://builds.apache.org/job/Axis2/ws/axis2/modules/addressing/target/apidocs/org/apache/axis2/handlers/addressing//package-frame.html...>
Generating <https://builds.apache.org/job/Axis2/ws/axis2/modules/addressing/target/apidocs/org/apache/axis2/handlers/addressing//package-summary.html...>
Generating <https://builds.apache.org/job/Axis2/ws/axis2/modules/addressing/target/apidocs/org/apache/axis2/handlers/addressing//package-tree.html...>
Generating <https://builds.apache.org/job/Axis2/ws/axis2/modules/addressing/target/apidocs/constant-values.html...>
Generating <https://builds.apache.org/job/Axis2/ws/axis2/modules/addressing/target/apidocs/org/apache/axis2/handlers/addressing/class-use//AddressingValidationHandler.html...>
Generating <https://builds.apache.org/job/Axis2/ws/axis2/modules/addressing/target/apidocs/org/apache/axis2/handlers/addressing/class-use//Addressing.html...>
Generating <https://builds.apache.org/job/Axis2/ws/axis2/modules/addressing/target/apidocs/org/apache/axis2/handlers/addressing/class-use//AddressingOutHandler.html...>
Generating <https://builds.apache.org/job/Axis2/ws/axis2/modules/addressing/target/apidocs/org/apache/axis2/handlers/addressing/class-use//AddressingInFaultHandler.html...>
Generating <https://builds.apache.org/job/Axis2/ws/axis2/modules/addressing/target/apidocs/org/apache/axis2/handlers/addressing/class-use//AddressingInHandler.html...>
Generating <https://builds.apache.org/job/Axis2/ws/axis2/modules/addressing/target/apidocs/org/apache/axis2/handlers/addressing//package-use.html...>
Building index for all the packages and classes...
Generating <https://builds.apache.org/job/Axis2/ws/axis2/modules/addressing/target/apidocs/overview-tree.html...>
Generating <https://builds.apache.org/job/Axis2/ws/axis2/modules/addressing/target/apidocs/index-all.html...>
Generating <https://builds.apache.org/job/Axis2/ws/axis2/modules/addressing/target/apidocs/deprecated-list.html...>
Building index for all classes...
Generating <https://builds.apache.org/job/Axis2/ws/axis2/modules/addressing/target/apidocs/allclasses-frame.html...>
Generating <https://builds.apache.org/job/Axis2/ws/axis2/modules/addressing/target/apidocs/allclasses-noframe.html...>
Generating <https://builds.apache.org/job/Axis2/ws/axis2/modules/addressing/target/apidocs/index.html...>
Generating <https://builds.apache.org/job/Axis2/ws/axis2/modules/addressing/target/apidocs/help-doc.html...>
Generating <https://builds.apache.org/job/Axis2/ws/axis2/modules/addressing/target/apidocs/stylesheet.css...>
[INFO] Building jar: <https://builds.apache.org/job/Axis2/ws/axis2/modules/addressing/target/addressing-1.7.0-SNAPSHOT-javadoc.jar>
[INFO] [jar:jar {execution: default}]
[INFO] Building jar: <https://builds.apache.org/job/Axis2/ws/axis2/modules/addressing/target/addressing-1.7.0-SNAPSHOT-classpath-module.jar>
[INFO] [gpg:sign {execution: default}]
[INFO] [install:install {execution: default-install}]
[INFO] Installing <https://builds.apache.org/job/Axis2/ws/axis2/modules/addressing/target/addressing-1.7.0-SNAPSHOT.mar>
to <https://builds.apache.org/job/Axis2/ws/.repository/org/apache/axis2/addressing/1.7.0-SNAPSHOT/addressing-1.7.0-SNAPSHOT.mar>
[INFO] Installing <https://builds.apache.org/job/Axis2/ws/axis2/modules/addressing/target/addressing-1.7.0-SNAPSHOT-sources.jar>
to <https://builds.apache.org/job/Axis2/ws/.repository/org/apache/axis2/addressing/1.7.0-SNAPSHOT/addressing-1.7.0-SNAPSHOT-sources.jar>
[INFO] Installing <https://builds.apache.org/job/Axis2/ws/axis2/modules/addressing/target/addressing-1.7.0-SNAPSHOT-javadoc.jar>
to <https://builds.apache.org/job/Axis2/ws/.repository/org/apache/axis2/addressing/1.7.0-SNAPSHOT/addressing-1.7.0-SNAPSHOT-javadoc.jar>
[INFO] Installing <https://builds.apache.org/job/Axis2/ws/axis2/modules/addressing/target/addressing-1.7.0-SNAPSHOT-classpath-module.jar>
to <https://builds.apache.org/job/Axis2/ws/.repository/org/apache/axis2/addressing/1.7.0-SNAPSHOT/addressing-1.7.0-SNAPSHOT-classpath-module.jar>
[INFO] [deploy:deploy {execution: default-deploy}]
[INFO] Retrieving previous build number from apache.snapshots.https
Uploading: https://repository.apache.org/content/repositories/snapshots/org/apache/axis2/addressing/1.7.0-SNAPSHOT/addressing-1.7.0-20130723.024407-1652.mar
30K uploaded  (addressing-1.7.0-20130723.024407-1652.mar)
[INFO] Retrieving previous metadata from apache.snapshots.https
[INFO] Uploading repository metadata for: 'snapshot org.apache.axis2:addressing:1.7.0-SNAPSHOT'
[INFO] Uploading project information for addressing 1.7.0-20130723.024407-1652
[INFO] Retrieving previous metadata from apache.snapshots.https
[INFO] Uploading repository metadata for: 'artifact org.apache.axis2:addressing'
[INFO] Retrieving previous build number from apache.snapshots.https
Uploading: https://repository.apache.org/content/repositories/snapshots/org/apache/axis2/addressing/1.7.0-SNAPSHOT/addressing-1.7.0-20130723.024407-1652-sources.jar
24K uploaded  (addressing-1.7.0-20130723.024407-1652-sources.jar)
[INFO] Retrieving previous build number from apache.snapshots.https
Uploading: https://repository.apache.org/content/repositories/snapshots/org/apache/axis2/addressing/1.7.0-SNAPSHOT/addressing-1.7.0-20130723.024407-1652-javadoc.jar
48K uploaded  (addressing-1.7.0-20130723.024407-1652-javadoc.jar)
[INFO] Retrieving previous build number from apache.snapshots.https
Uploading: https://repository.apache.org/content/repositories/snapshots/org/apache/axis2/addressing/1.7.0-SNAPSHOT/addressing-1.7.0-20130723.024407-1652-classpath-module.jar
30K uploaded  (addressing-1.7.0-20130723.024407-1652-classpath-module.jar)
[JENKINS] Archiving <https://builds.apache.org/job/Axis2/ws/axis2/modules/addressing/target/addressing-1.7.0-SNAPSHOT.mar>
to /home/hudson/hudson/jobs/Axis2/modules/org.apache.axis2$addressing/builds/2013-07-23_02-43-09/archive/org.apache.axis2/addressing/1.7.0-20130723.024407-1652/addressing-1.7.0-20130723.024407-1652.mar
[JENKINS] Archiving <https://builds.apache.org/job/Axis2/ws/axis2/modules/addressing/target/addressing-1.7.0-SNAPSHOT-sources.jar>
to /home/hudson/hudson/jobs/Axis2/modules/org.apache.axis2$addressing/builds/2013-07-23_02-43-09/archive/org.apache.axis2/addressing/1.7.0-20130723.024407-1652/addressing-1.7.0-20130723.024407-1652-sources.jar
[JENKINS] Archiving <https://builds.apache.org/job/Axis2/ws/axis2/modules/addressing/target/addressing-1.7.0-SNAPSHOT-javadoc.jar>
to /home/hudson/hudson/jobs/Axis2/modules/org.apache.axis2$addressing/builds/2013-07-23_02-43-09/archive/org.apache.axis2/addressing/1.7.0-20130723.024407-1652/addressing-1.7.0-20130723.024407-1652-javadoc.jar
[JENKINS] Archiving <https://builds.apache.org/job/Axis2/ws/axis2/modules/addressing/target/addressing-1.7.0-SNAPSHOT-classpath-module.jar>
to /home/hudson/hudson/jobs/Axis2/modules/org.apache.axis2$addressing/builds/2013-07-23_02-43-09/archive/org.apache.axis2/addressing/1.7.0-20130723.024407-1652/addressing-1.7.0-20130723.024407-1652-classpath-module.jar
[INFO] ------------------------------------------------------------------------
[INFO] Building Apache Axis2 - Transport - Base
[INFO]    task-segment: [clean, deploy]
[INFO] ------------------------------------------------------------------------
[INFO] [clean:clean {execution: default-clean}]
[INFO] Deleting directory <https://builds.apache.org/job/Axis2/ws/axis2/modules/transport/base/target>
[INFO] [enforcer:enforce {execution: default}]
[INFO] [remote-resources:process {execution: default}]
[WARNING] org.apache.velocity.runtime.exception.ReferenceException: reference : template =
META-INF/DEPENDENCIES.vm [line 40,column 14] : $license.name is not a valid reference.
[INFO] [resources:resources {execution: default-resources}]
[INFO] Using 'UTF-8' encoding to copy filtered resources.
[INFO] skip non existing resourceDirectory <https://builds.apache.org/job/Axis2/ws/axis2/modules/transport/base/src/main/resources>
[INFO] Copying 3 resources
[INFO] [compiler:compile {execution: default-compile}]
[INFO] Compiling 60 source files to <https://builds.apache.org/job/Axis2/ws/axis2/modules/transport/base/target/classes>
[INFO] [resources:testResources {execution: default-testResources}]
[INFO] Using 'UTF-8' encoding to copy filtered resources.
[INFO] skip non existing resourceDirectory <https://builds.apache.org/job/Axis2/ws/axis2/modules/transport/base/src/test/resources>
[INFO] Copying 3 resources
[INFO] [compiler:testCompile {execution: default-testCompile}]
[INFO] Compiling 3 source files to <https://builds.apache.org/job/Axis2/ws/axis2/modules/transport/base/target/test-classes>
[INFO] [surefire:test {execution: default-test}]
[INFO] Surefire report directory: <https://builds.apache.org/job/Axis2/ws/axis2/modules/transport/base/target/surefire-reports>

-------------------------------------------------------
 T E S T S
-------------------------------------------------------
Running org.apache.axis2.transport.base.threads.watermark.WaterMarkExecutorTest
Tests run: 2, Failures: 0, Errors: 0, Skipped: 0, Time elapsed: 2.114 sec
Running org.apache.axis2.format.ManagedDataSourceFactoryTest
Tests run: 1, Failures: 0, Errors: 0, Skipped: 0, Time elapsed: 0.031 sec
Running org.apache.axis2.format.PlainTextFormatterTest
Tests run: 4, Failures: 0, Errors: 0, Skipped: 0, Time elapsed: 0.134 sec

Results :

Tests run: 7, Failures: 0, Errors: 0, Skipped: 0

[JENKINS] Recording test results
Jul 23, 2013 2:47:22 AM hudson.remoting.SynchronousCommandTransport$ReaderThread run
SEVERE: I/O error in channel channel
java.io.StreamCorruptedException
	at java.io.ObjectInputStream.readObject0(ObjectInputStream.java:1332)
	at java.io.ObjectInputStream.readObject(ObjectInputStream.java:348)
	at hudson.remoting.Command.readFrom(Command.java:92)
	at hudson.remoting.ClassicCommandTransport.read(ClassicCommandTransport.java:59)
	at hudson.remoting.SynchronousCommandTransport$ReaderThread.run(SynchronousCommandTransport.java:48)
channel stopped
[INFO] ------------------------------------------------------------------------
[ERROR] FATAL ERROR
[INFO] ------------------------------------------------------------------------
[INFO] null
[INFO] ------------------------------------------------------------------------
[INFO] Trace
java.lang.reflect.UndeclaredThrowableException
	at $Proxy2.isArchivingDisabled(Unknown Source)
	at hudson.maven.MavenBuildProxy$Filter.isArchivingDisabled(MavenBuildProxy.java:227)
	at hudson.maven.reporters.MavenArtifact.archive(MavenArtifact.java:223)
	at hudson.maven.reporters.MavenArtifactArchiver.postBuild(MavenArtifactArchiver.java:108)
	at hudson.maven.Maven2Builder.postModule(Maven2Builder.java:129)
	at hudson.maven.MavenBuilder$Adapter.fireLeaveModule(MavenBuilder.java:354)
	at hudson.maven.MavenBuilder$Adapter.postBuild(MavenBuilder.java:308)
	at org.apache.maven.lifecycle.LifecycleExecutorInterceptor.execute(LifecycleExecutorInterceptor.java:68)
	at org.apache.maven.DefaultMaven.doExecute(DefaultMaven.java:328)
	at org.apache.maven.DefaultMaven.execute(DefaultMaven.java:138)
	at org.apache.maven.cli.MavenCli.main(MavenCli.java:362)
	at sun.reflect.NativeMethodAccessorImpl.invoke0(Native Method)
	at sun.reflect.NativeMethodAccessorImpl.invoke(NativeMethodAccessorImpl.java:39)
	at sun.reflect.DelegatingMethodAccessorImpl.invoke(DelegatingMethodAccessorImpl.java:25)
	at java.lang.reflect.Method.invoke(Method.java:592)
	at org.codehaus.classworlds.Launcher.launchEnhanced(Launcher.java:315)
	at org.codehaus.classworlds.Launcher.launch(Launcher.java:255)
	at hudson.maven.agent.Main.launch(Main.java:185)
	at hudson.maven.MavenBuilder.call(MavenBuilder.java:154)
	at hudson.maven.Maven2Builder.call(Maven2Builder.java:79)
	at hudson.maven.Maven2Builder.call(Maven2Builder.java:55)
	at hudson.remoting.UserRequest.perform(UserRequest.java:118)
	at hudson.remoting.UserRequest.perform(UserRequest.java:48)
	at hudson.remoting.Request$2.run(Request.java:326)
	at hudson.remoting.InterceptingExecutorService$1.call(InterceptingExecutorService.java:72)
	at java.util.concurrent.FutureTask$Sync.innerRun(FutureTask.java:269)
	at java.util.concurrent.FutureTask.run(FutureTask.java:123)
	at java.util.concurrent.ThreadPoolExecutor$Worker.runTask(ThreadPoolExecutor.java:651)
	at java.util.concurrent.ThreadPoolExecutor$Worker.run(ThreadPoolExecutor.java:676)
	at java.lang.Thread.run(Thread.java:595)
Caused by: hudson.remoting.ChannelClosedException: channel is already closed
	at hudson.remoting.Channel.send(Channel.java:494)
	at hudson.remoting.Request.call(Request.java:129)
	at hudson.remoting.Channel.call(Channel.java:672)
	at hudson.remoting.RemoteInvocationHandler.invoke(RemoteInvocationHandler.java:158)
	... 30 more
Caused by: java.io.StreamCorruptedException
	at java.io.ObjectInputStream.readObject0(ObjectInputStream.java:1332)
	at java.io.ObjectInputStream.readObject(ObjectInputStream.java:348)
	at hudson.remoting.Command.readFrom(Command.java:92)
	at hudson.remoting.ClassicCommandTransport.read(ClassicCommandTransport.java:59)
	at hudson.remoting.SynchronousCommandTransport$ReaderThread.run(SynchronousCommandTransport.java:48)
[INFO] ------------------------------------------------------------------------
[INFO] Total time: 3 minutes 36 seconds
[INFO] Finished at: Tue Jul 23 02:47:22 UTC 2013
[INFO] Final Memory: 85M/237M
[INFO] ------------------------------------------------------------------------
[locks-and-latches] Releasing all the locks
[locks-and-latches] All the locks released
ERROR: Maven JVM terminated unexpectedly with exit code 0


---------------------------------------------------------------------
To unsubscribe, e-mail: java-dev-unsubscribe@axis.apache.org
For additional commands, e-mail: java-dev-help@axis.apache.org


Mime
View raw message