axis-java-dev mailing list archives

Site index · List index
Message view « Date » · « Thread »
Top « Date » · « Thread »
From Apache Jenkins Server <jenk...@builds.apache.org>
Subject Build failed in Jenkins: Axis2 #2426
Date Sun, 04 Aug 2013 11:28:52 GMT
See <https://builds.apache.org/job/Axis2/2426/>

------------------------------------------
[...truncated 14772 lines...]
Downloading: http://repo1.maven.org/maven2/org/apache/tomcat/el-api/6.0.18/el-api-6.0.18.jar
27K downloaded  (el-api-6.0.18.jar)
Downloading: http://repository.codehaus.org/org/apache/tomcat/catalina/6.0.18/catalina-6.0.18.jar
Downloading: http://repository.codehaus.org/org/codehaus/groovy/maven/runtime/gmaven-runtime-support/1.0-rc-3/gmaven-runtime-support-1.0-rc-3.jar
[INFO] Unable to find resource 'org.apache.tomcat:catalina:jar:6.0.18' in repository codehaus.org
(http://repository.codehaus.org)
Downloading: http://repo1.maven.org/maven2/org/apache/tomcat/catalina/6.0.18/catalina-6.0.18.jar
1103K downloaded  (catalina-6.0.18.jar)
Downloading: http://repository.codehaus.org/org/apache/tomcat/annotations-api/6.0.18/annotations-api-6.0.18.jar
74K downloaded  (gmaven-runtime-support-1.0-rc-3.jar)
[INFO] Unable to find resource 'org.apache.tomcat:annotations-api:jar:6.0.18' in repository
codehaus.org (http://repository.codehaus.org)
Downloading: http://repo1.maven.org/maven2/org/apache/tomcat/annotations-api/6.0.18/annotations-api-6.0.18.jar
10K downloaded  (annotations-api-6.0.18.jar)
Downloading: http://repository.codehaus.org/org/apache/tomcat/jasper-jdt/6.0.18/jasper-jdt-6.0.18.jar
[INFO] Unable to find resource 'org.apache.tomcat:jasper-jdt:jar:6.0.18' in repository codehaus.org
(http://repository.codehaus.org)
Downloading: http://repo1.maven.org/maven2/org/apache/tomcat/jasper-jdt/6.0.18/jasper-jdt-6.0.18.jar
1362K downloaded  (jasper-jdt-6.0.18.jar)
Downloading: http://repository.codehaus.org/org/apache/tomcat/jasper-el/6.0.18/jasper-el-6.0.18.jar
2744K downloaded  (groovy-all-minimal-1.5.6.jar)
[INFO] Unable to find resource 'org.apache.tomcat:jasper-el:jar:6.0.18' in repository codehaus.org
(http://repository.codehaus.org)
Downloading: http://repo1.maven.org/maven2/org/apache/tomcat/jasper-el/6.0.18/jasper-el-6.0.18.jar
99K downloaded  (jasper-el-6.0.18.jar)
[INFO] [jspc:compile {execution: default}]
[WARNING] Compiled JSPs will not be added to the project and web.xml will not be modified,
either because includeInProject is set to false or because the project's packaging is not
'war'.
Created dir: <https://builds.apache.org/job/Axis2/ws/axis2/modules/webapp/target/jsp-source>
[INFO] Compiling JSP source files to <https://builds.apache.org/job/Axis2/ws/axis2/modules/webapp/target/jsp-source>
Aug 4, 2013 11:27:11 AM org.apache.jasper.JspC processFile
INFO: Built File: /axis2-web/errorModule.jsp
Aug 4, 2013 11:27:11 AM org.apache.jasper.JspC processFile
INFO: Built File: /axis2-web/index.jsp
Aug 4, 2013 11:27:11 AM org.apache.jasper.JspC processFile
INFO: Built File: /axis2-web/globalModules.jsp
Aug 4, 2013 11:27:11 AM org.apache.jasper.JspC processFile
INFO: Built File: /axis2-web/engagingtoanoperation.jsp
Aug 4, 2013 11:27:12 AM org.apache.jasper.JspC processFile
INFO: Built File: /axis2-web/InActivateService.jsp
Aug 4, 2013 11:27:12 AM org.apache.jasper.JspC processFile
INFO: Built File: /axis2-web/listGroupService.jsp
Aug 4, 2013 11:27:12 AM org.apache.jasper.JspC processFile
INFO: Built File: /axis2-web/ServiceParaEdit.jsp
Aug 4, 2013 11:27:12 AM org.apache.jasper.JspC processFile
INFO: Built File: /axis2-web/deleteService.jsp
Aug 4, 2013 11:27:12 AM org.apache.jasper.JspC processFile
INFO: Built File: /axis2-web/listFaultyService.jsp
Aug 4, 2013 11:27:12 AM org.apache.jasper.JspC processFile
INFO: Built File: /axis2-web/viewphases.jsp
Aug 4, 2013 11:27:12 AM org.apache.jasper.JspC processFile
INFO: Built File: /axis2-web/LeftFrame.jsp
Aug 4, 2013 11:27:12 AM org.apache.jasper.JspC processFile
INFO: Built File: /axis2-web/error.jsp
Aug 4, 2013 11:27:12 AM org.apache.jasper.JspC processFile
INFO: Built File: /axis2-web/ViewGlobalHandlers.jsp
Aug 4, 2013 11:27:12 AM org.apache.jasper.JspC processFile
INFO: Built File: /axis2-web/viewServiceGroupContext.jsp
Aug 4, 2013 11:27:12 AM org.apache.jasper.JspC processFile
INFO: Built File: /axis2-web/SelectService.jsp
Aug 4, 2013 11:27:12 AM org.apache.jasper.JspC processFile
INFO: Built File: /axis2-web/ListServiceGroup.jsp
Aug 4, 2013 11:27:12 AM org.apache.jasper.JspC processFile
INFO: Built File: /axis2-web/MainFrame.jsp
Aug 4, 2013 11:27:12 AM org.apache.jasper.JspC processFile
INFO: Built File: /axis2-web/Login.jsp
Aug 4, 2013 11:27:12 AM org.apache.jasper.JspC processFile
INFO: Built File: /axis2-web/admin.jsp
Aug 4, 2013 11:27:12 AM org.apache.jasper.JspC processFile
INFO: Built File: /axis2-web/ViewContexts.jsp
Aug 4, 2013 11:27:12 AM org.apache.jasper.JspC processFile
INFO: Built File: /axis2-web/HappyAxis.jsp
Aug 4, 2013 11:27:12 AM org.apache.jasper.JspC processFile
INFO: Built File: /axis2-web/listService.jsp
Aug 4, 2013 11:27:12 AM org.apache.jasper.JspC processFile
INFO: Built File: /axis2-web/EngageToServiceGroup.jsp
Aug 4, 2013 11:27:12 AM org.apache.jasper.JspC processFile
INFO: Built File: /axis2-web/upload.jsp
Aug 4, 2013 11:27:12 AM org.apache.jasper.JspC processFile
INFO: Built File: /axis2-web/TopFrame.jsp
Aug 4, 2013 11:27:13 AM org.apache.jasper.JspC processFile
INFO: Built File: /axis2-web/engagingtoaservice.jsp
Aug 4, 2013 11:27:13 AM org.apache.jasper.JspC processFile
INFO: Built File: /axis2-web/listSingleService.jsp
Aug 4, 2013 11:27:13 AM org.apache.jasper.JspC processFile
INFO: Built File: /axis2-web/ActivateService.jsp
Aug 4, 2013 11:27:13 AM org.apache.jasper.JspC processFile
INFO: Built File: /axis2-web/disengage.jsp
Aug 4, 2013 11:27:13 AM org.apache.jasper.JspC processFile
INFO: Built File: /axis2-web/listServices.jsp
Aug 4, 2013 11:27:13 AM org.apache.jasper.JspC processFile
INFO: Built File: /axis2-web/engagingglobally.jsp
Aug 4, 2013 11:27:13 AM org.apache.jasper.JspC processFile
INFO: Built File: /axis2-web/listModules.jsp
Aug 4, 2013 11:27:13 AM org.apache.jasper.JspC processFile
INFO: Built File: /axis2-web/ViewServiceHandlers.jsp
Aug 4, 2013 11:27:13 AM org.apache.jasper.JspC processFile
INFO: Built File: /axis2-web/viewServiceContext.jsp
Aug 4, 2013 11:27:13 AM org.apache.jasper.JspC processFile
INFO: Built File: /axis2-web/include/link-footer.jsp
Aug 4, 2013 11:27:13 AM org.apache.jasper.JspC processFile
INFO: Built File: /axis2-web/include/adminfooter.jsp
Aug 4, 2013 11:27:13 AM org.apache.jasper.JspC processFile
INFO: Built File: /axis2-web/include/adminheader.jsp
Aug 4, 2013 11:27:13 AM org.apache.jasper.JspC processFile
INFO: Built File: /axis2-web/include/httpbase.jsp
Aug 4, 2013 11:27:13 AM org.apache.jasper.JspC processFile
INFO: Built File: /axis2-web/Error/error404.jsp
Aug 4, 2013 11:27:13 AM org.apache.jasper.JspC processFile
INFO: Built File: /axis2-web/Error/error500.jsp
[INFO] Compiled completed in 0:00:02.250
Copying 40 files to <https://builds.apache.org/job/Axis2/ws/axis2/modules/webapp/target/classes>
[INFO] [antrun:run {execution: default}]
[INFO] Executing tasks
   [delete] Deleting directory <https://builds.apache.org/job/Axis2/ws/axis2/modules/webapp/target/classes/jsp>
[INFO] Executed tasks
[INFO] [resources:testResources {execution: default-testResources}]
[INFO] Using 'UTF-8' encoding to copy filtered resources.
[INFO] skip non existing resourceDirectory <https://builds.apache.org/job/Axis2/ws/axis2/modules/webapp/src/test/resources>
[INFO] Copying 2 resources
[INFO] [compiler:testCompile {execution: default-testCompile}]
[INFO] No sources to compile
[INFO] [surefire:test {execution: default-test}]
[JENKINS] Recording test results
Downloading: http://repo1.maven.org/maven2/org/codehaus/plexus/plexus-io/1.0-alpha-3/plexus-io-1.0-alpha-3.pom
1K downloaded  (plexus-io-1.0-alpha-3.pom)
Downloading: http://repo1.maven.org/maven2/com/thoughtworks/xstream/xstream/1.3.1/xstream-1.3.1.pom
11K downloaded  (xstream-1.3.1.pom)
Downloading: http://repo1.maven.org/maven2/com/thoughtworks/xstream/xstream-parent/1.3.1/xstream-parent-1.3.1.pom
13K downloaded  (xstream-parent-1.3.1.pom)
Downloading: http://repo1.maven.org/maven2/xpp3/xpp3_min/1.1.4c/xpp3_min-1.1.4c.pom
1K downloaded  (xpp3_min-1.1.4c.pom)
Downloading: http://repo1.maven.org/maven2/org/codehaus/plexus/plexus-utils/1.5.5/plexus-utils-1.5.5.jar
Downloading: http://repo1.maven.org/maven2/xpp3/xpp3_min/1.1.4c/xpp3_min-1.1.4c.jar
Downloading: http://repo1.maven.org/maven2/com/thoughtworks/xstream/xstream/1.3.1/xstream-1.3.1.jar
245K downloaded  (plexus-utils-1.5.5.jar)
Downloading: http://repo1.maven.org/maven2/org/codehaus/plexus/plexus-interpolation/1.6/plexus-interpolation-1.6.jar
24K downloaded  (xpp3_min-1.1.4c.jar)
49K downloaded  (plexus-interpolation-1.6.jar)
421K downloaded  (xstream-1.3.1.jar)
[INFO] [war:war {execution: default-war}]
[INFO] Packaging webapp
[INFO] Assembling webapp[axis2-webapp] in [<https://builds.apache.org/job/Axis2/ws/axis2/modules/webapp/target/axis2-1.7.0-SNAPSHOT]>
[INFO] Processing war project
[INFO] Copying webapp webResources[<https://builds.apache.org/job/Axis2/ws/axis2/modules/webapp/target/webResources]>
to[<https://builds.apache.org/job/Axis2/ws/axis2/modules/webapp/target/axis2-1.7.0-SNAPSHOT]>
[INFO] Copying webapp webResources[<https://builds.apache.org/job/Axis2/ws/axis2/modules/webapp/../../legal]>
to[<https://builds.apache.org/job/Axis2/ws/axis2/modules/webapp/target/axis2-1.7.0-SNAPSHOT]>
[INFO] Copying webapp resources[<https://builds.apache.org/job/Axis2/ws/axis2/modules/webapp/src/main/webapp]>
[INFO] Webapp assembled in [377 msecs]
[INFO] Building war: <https://builds.apache.org/job/Axis2/ws/axis2/modules/webapp/target/axis2.war>
[INFO] [assembly:single {execution: source-release-assembly}]
[INFO] Skipping the assembly in this project because it's not the Execution Root
[INFO] Preparing source:jar
[WARNING] Removing: jar from forked lifecycle, to prevent recursive invocation.
[JENKINS] Archiving <https://builds.apache.org/job/Axis2/ws/axis2/modules/webapp/pom.xml>
to /home/hudson/hudson/jobs/Axis2/modules/org.apache.axis2$axis2-webapp/builds/2013-08-04_10-54-05/archive/org.apache.axis2/axis2-webapp/1.7.0-SNAPSHOT/axis2-webapp-1.7.0-SNAPSHOT.pom
[JENKINS] Archiving <https://builds.apache.org/job/Axis2/ws/axis2/modules/webapp/target/axis2.war>
to /home/hudson/hudson/jobs/Axis2/modules/org.apache.axis2$axis2-webapp/builds/2013-08-04_10-54-05/archive/org.apache.axis2/axis2-webapp/1.7.0-SNAPSHOT/axis2-webapp-1.7.0-SNAPSHOT.war
[INFO] [enforcer:enforce {execution: default}]
ERROR: Could not find local repository for 2.2.1
[INFO] [source:jar {execution: attach-sources}]
[INFO] Building jar: <https://builds.apache.org/job/Axis2/ws/axis2/modules/webapp/target/axis2-1.7.0-SNAPSHOT-sources.jar>
[INFO] [javadoc:jar {execution: attach-javadocs}]
Loading source files for package org.apache.axis2.webapp...
Loading source files for package org.apache.axis2.transport.http...
Constructing Javadoc information...
Standard Doclet version 1.6.0_45
Building tree for all the packages and classes...
Generating <https://builds.apache.org/job/Axis2/ws/axis2/modules/webapp/target/apidocs/org/apache/axis2/webapp//AdminAgent.html...>
Generating <https://builds.apache.org/job/Axis2/ws/axis2/modules/webapp/target/apidocs/org/apache/axis2/webapp//AxisAdminServlet.html...>
Generating <https://builds.apache.org/job/Axis2/ws/axis2/modules/webapp/target/apidocs/org/apache/axis2/transport/http//AxisAdminServlet.html...>
Generating <https://builds.apache.org/job/Axis2/ws/axis2/modules/webapp/target/apidocs/overview-frame.html...>
Generating <https://builds.apache.org/job/Axis2/ws/axis2/modules/webapp/target/apidocs/org/apache/axis2/transport/http//package-frame.html...>
Generating <https://builds.apache.org/job/Axis2/ws/axis2/modules/webapp/target/apidocs/org/apache/axis2/transport/http//package-summary.html...>
Generating <https://builds.apache.org/job/Axis2/ws/axis2/modules/webapp/target/apidocs/org/apache/axis2/transport/http//package-tree.html...>
Generating <https://builds.apache.org/job/Axis2/ws/axis2/modules/webapp/target/apidocs/org/apache/axis2/webapp//package-frame.html...>
Generating <https://builds.apache.org/job/Axis2/ws/axis2/modules/webapp/target/apidocs/org/apache/axis2/webapp//package-summary.html...>
Generating <https://builds.apache.org/job/Axis2/ws/axis2/modules/webapp/target/apidocs/org/apache/axis2/webapp//package-tree.html...>
Generating <https://builds.apache.org/job/Axis2/ws/axis2/modules/webapp/target/apidocs/constant-values.html...>
Generating <https://builds.apache.org/job/Axis2/ws/axis2/modules/webapp/target/apidocs/serialized-form.html...>
Generating <https://builds.apache.org/job/Axis2/ws/axis2/modules/webapp/target/apidocs/org/apache/axis2/webapp//class-use/AdminAgent.html...>
Generating <https://builds.apache.org/job/Axis2/ws/axis2/modules/webapp/target/apidocs/org/apache/axis2/webapp//class-use/AxisAdminServlet.html...>
Generating <https://builds.apache.org/job/Axis2/ws/axis2/modules/webapp/target/apidocs/org/apache/axis2/transport/http//class-use/AxisAdminServlet.html...>
Generating <https://builds.apache.org/job/Axis2/ws/axis2/modules/webapp/target/apidocs/org/apache/axis2/transport/http//package-use.html...>
Generating <https://builds.apache.org/job/Axis2/ws/axis2/modules/webapp/target/apidocs/org/apache/axis2/webapp//package-use.html...>
Building index for all the packages and classes...
Generating <https://builds.apache.org/job/Axis2/ws/axis2/modules/webapp/target/apidocs/overview-tree.html...>
Generating <https://builds.apache.org/job/Axis2/ws/axis2/modules/webapp/target/apidocs/index-all.html...>
Generating <https://builds.apache.org/job/Axis2/ws/axis2/modules/webapp/target/apidocs/deprecated-list.html...>
Building index for all classes...
Generating <https://builds.apache.org/job/Axis2/ws/axis2/modules/webapp/target/apidocs/allclasses-frame.html...>
Generating <https://builds.apache.org/job/Axis2/ws/axis2/modules/webapp/target/apidocs/allclasses-noframe.html...>
Generating <https://builds.apache.org/job/Axis2/ws/axis2/modules/webapp/target/apidocs/index.html...>
Generating <https://builds.apache.org/job/Axis2/ws/axis2/modules/webapp/target/apidocs/overview-summary.html...>
Generating <https://builds.apache.org/job/Axis2/ws/axis2/modules/webapp/target/apidocs/help-doc.html...>
Generating <https://builds.apache.org/job/Axis2/ws/axis2/modules/webapp/target/apidocs/stylesheet.css...>
[INFO] Building jar: <https://builds.apache.org/job/Axis2/ws/axis2/modules/webapp/target/axis2-1.7.0-SNAPSHOT-javadoc.jar>
[INFO] [gpg:sign {execution: default}]
[INFO] [install:install {execution: default-install}]
[INFO] Installing <https://builds.apache.org/job/Axis2/ws/axis2/modules/webapp/target/axis2.war>
to <https://builds.apache.org/job/Axis2/ws/.repository/org/apache/axis2/axis2-webapp/1.7.0-SNAPSHOT/axis2-webapp-1.7.0-SNAPSHOT.war>
[INFO] Installing <https://builds.apache.org/job/Axis2/ws/axis2/modules/webapp/target/axis2-1.7.0-SNAPSHOT-sources.jar>
to <https://builds.apache.org/job/Axis2/ws/.repository/org/apache/axis2/axis2-webapp/1.7.0-SNAPSHOT/axis2-webapp-1.7.0-SNAPSHOT-sources.jar>
[INFO] Installing <https://builds.apache.org/job/Axis2/ws/axis2/modules/webapp/target/axis2-1.7.0-SNAPSHOT-javadoc.jar>
to <https://builds.apache.org/job/Axis2/ws/.repository/org/apache/axis2/axis2-webapp/1.7.0-SNAPSHOT/axis2-webapp-1.7.0-SNAPSHOT-javadoc.jar>
[INFO] [deploy:deploy {execution: default-deploy}]
[INFO] Retrieving previous build number from apache.snapshots.https
[WARNING] *** CHECKSUM FAILED - Checksum failed on download: local = 'd862c6fa77e8f4e1c79e2f25f2fb452c4e117123';
remote = '9638acdfc94b59659bda398489bc0d4cdd1d6dc7' - RETRYING
[WARNING] *** CHECKSUM FAILED - Checksum failed on download: local = 'd862c6fa77e8f4e1c79e2f25f2fb452c4e117123';
remote = '9638acdfc94b59659bda398489bc0d4cdd1d6dc7' - IGNORING
Uploading: https://repository.apache.org/content/repositories/snapshots/org/apache/axis2/axis2-webapp/1.7.0-SNAPSHOT/axis2-webapp-1.7.0-20130804.105448-1525.war
[JENKINS] Archiving <https://builds.apache.org/job/Axis2/ws/axis2/modules/webapp/target/axis2.war>
to /home/hudson/hudson/jobs/Axis2/modules/org.apache.axis2$axis2-webapp/builds/2013-08-04_10-54-05/archive/org.apache.axis2/axis2-webapp/1.7.0-20130804.105448-1525/axis2-webapp-1.7.0-20130804.105448-1525.war
[JENKINS] Archiving <https://builds.apache.org/job/Axis2/ws/axis2/modules/webapp/target/axis2-1.7.0-SNAPSHOT-sources.jar>
to /home/hudson/hudson/jobs/Axis2/modules/org.apache.axis2$axis2-webapp/builds/2013-08-04_10-54-05/archive/org.apache.axis2/axis2-webapp/1.7.0-20130804.105448-1525/axis2-webapp-1.7.0-20130804.105448-1525-sources.jar
[JENKINS] Archiving <https://builds.apache.org/job/Axis2/ws/axis2/modules/webapp/target/axis2-1.7.0-SNAPSHOT-javadoc.jar>
to /home/hudson/hudson/jobs/Axis2/modules/org.apache.axis2$axis2-webapp/builds/2013-08-04_10-54-05/archive/org.apache.axis2/axis2-webapp/1.7.0-20130804.105448-1525/axis2-webapp-1.7.0-20130804.105448-1525-javadoc.jar
[INFO] ------------------------------------------------------------------------
[ERROR] FATAL ERROR
[INFO] ------------------------------------------------------------------------
[INFO] Java heap space
[INFO] ------------------------------------------------------------------------
[INFO] Trace
java.lang.OutOfMemoryError: Java heap space
	at java.util.Arrays.copyOf(Arrays.java:2786)
	at java.io.ByteArrayOutputStream.write(ByteArrayOutputStream.java:94)
	at sun.net.www.http.PosterOutputStream.write(PosterOutputStream.java:61)
	at org.apache.maven.wagon.AbstractWagon.transfer(AbstractWagon.java:492)
	at org.apache.maven.wagon.AbstractWagon.transfer(AbstractWagon.java:457)
	at org.apache.maven.wagon.AbstractWagon.putTransfer(AbstractWagon.java:411)
	at org.apache.maven.wagon.AbstractWagon.transfer(AbstractWagon.java:392)
	at org.apache.maven.wagon.AbstractWagon.putTransfer(AbstractWagon.java:365)
	at org.apache.maven.wagon.StreamWagon.put(StreamWagon.java:163)
	at org.apache.maven.artifact.manager.DefaultWagonManager.putRemoteFile(DefaultWagonManager.java:317)
	at org.apache.maven.artifact.manager.DefaultWagonManager.putArtifact(DefaultWagonManager.java:227)
	at org.apache.maven.artifact.deployer.DefaultArtifactDeployer.deploy(DefaultArtifactDeployer.java:107)
	at org.apache.maven.plugin.deploy.DeployMojo.execute(DeployMojo.java:156)
	at org.apache.maven.plugin.DefaultPluginManager.executeMojo(DefaultPluginManager.java:490)
	at hudson.maven.agent.PluginManagerInterceptor.executeMojo(PluginManagerInterceptor.java:182)
	at org.apache.maven.lifecycle.DefaultLifecycleExecutor.executeGoals(DefaultLifecycleExecutor.java:694)
	at org.apache.maven.lifecycle.DefaultLifecycleExecutor.executeGoalWithLifecycle(DefaultLifecycleExecutor.java:556)
	at org.apache.maven.lifecycle.DefaultLifecycleExecutor.executeGoal(DefaultLifecycleExecutor.java:535)
	at org.apache.maven.lifecycle.DefaultLifecycleExecutor.executeGoalAndHandleFailures(DefaultLifecycleExecutor.java:387)
	at org.apache.maven.lifecycle.DefaultLifecycleExecutor.executeTaskSegments(DefaultLifecycleExecutor.java:348)
	at org.apache.maven.lifecycle.DefaultLifecycleExecutor.execute(DefaultLifecycleExecutor.java:180)
	at org.apache.maven.lifecycle.LifecycleExecutorInterceptor.execute(LifecycleExecutorInterceptor.java:65)
	at org.apache.maven.DefaultMaven.doExecute(DefaultMaven.java:328)
	at org.apache.maven.DefaultMaven.execute(DefaultMaven.java:138)
	at org.apache.maven.cli.MavenCli.main(MavenCli.java:362)
	at sun.reflect.NativeMethodAccessorImpl.invoke0(Native Method)
	at sun.reflect.NativeMethodAccessorImpl.invoke(NativeMethodAccessorImpl.java:39)
	at sun.reflect.DelegatingMethodAccessorImpl.invoke(DelegatingMethodAccessorImpl.java:25)
	at java.lang.reflect.Method.invoke(Method.java:597)
	at org.codehaus.classworlds.Launcher.launchEnhanced(Launcher.java:315)
	at org.codehaus.classworlds.Launcher.launch(Launcher.java:255)
	at hudson.maven.agent.Main.launch(Main.java:204)
[INFO] ------------------------------------------------------------------------
[INFO] Total time: 33 minutes 29 seconds
[INFO] Finished at: Sun Aug 04 11:27:39 UTC 2013
[INFO] Final Memory: 153M/217M
[INFO] ------------------------------------------------------------------------
channel stopped
[locks-and-latches] Releasing all the locks
[locks-and-latches] All the locks released

---------------------------------------------------------------------
To unsubscribe, e-mail: java-dev-unsubscribe@axis.apache.org
For additional commands, e-mail: java-dev-help@axis.apache.org


Mime
View raw message