axis-java-dev mailing list archives

Site index · List index
Message view « Date » · « Thread »
Top « Date » · « Thread »
From Apache Jenkins Server <jenk...@builds.apache.org>
Subject Build failed in Jenkins: axis-trunk #247
Date Wed, 05 Feb 2014 13:58:05 GMT
See <https://builds.apache.org/job/axis-trunk/247/>

------------------------------------------
[...truncated 4588 lines...]
[ERROR] public class TestDerivatedBeanSerializer extends TestCase {
[ERROR] <https://builds.apache.org/job/axis-trunk/ws/axis/axis-rt-core/src/test/java/test/utils/TestSrcContent.java>:[3,23]
package junit.framework does not exist
[ERROR] <https://builds.apache.org/job/axis-trunk/ws/axis/axis-rt-core/src/test/java/test/utils/TestSrcContent.java>:[37,36]
cannot find symbol
[ERROR] symbol: class TestCase
[ERROR] public class TestSrcContent extends TestCase {
[ERROR] <https://builds.apache.org/job/axis-trunk/ws/axis/axis-rt-core/src/test/java/test/utils/TestStringUtils.java>:[7,37]
cannot find symbol
[ERROR] symbol: class TestCase
[ERROR] public class TestStringUtils extends TestCase
[ERROR] <https://builds.apache.org/job/axis-trunk/ws/axis/axis-rt-core/src/test/java/test/outparams/TestOutParams.java>:[25,35]
cannot find symbol
[ERROR] symbol: class TestCase
[ERROR] public class TestOutParams extends TestCase {
[ERROR] <https://builds.apache.org/job/axis-trunk/ws/axis/axis-rt-core/src/test/java/test/types/TestName.java>:[25,30]
cannot find symbol
[ERROR] symbol: class TestCase
[ERROR] public class TestName extends TestCase {
[ERROR] <https://builds.apache.org/job/axis-trunk/ws/axis/axis-rt-core/src/test/java/test/encoding/TestAutoTypes.java>:[16,35]
cannot find symbol
[ERROR] symbol: class TestCase
[ERROR] public class TestAutoTypes extends TestCase {
[ERROR] <https://builds.apache.org/job/axis-trunk/ws/axis/axis-rt-core/src/test/java/test/encoding/TestOmittedValues.java>:[45,39]
cannot find symbol
[ERROR] symbol: class TestCase
[ERROR] public class TestOmittedValues extends TestCase {
[ERROR] <https://builds.apache.org/job/axis-trunk/ws/axis/axis-rt-core/src/test/java/test/encoding/TestAttributes.java>:[34,36]
cannot find symbol
[ERROR] symbol: class TestCase
[ERROR] public class TestAttributes extends TestCase {
[ERROR] <https://builds.apache.org/job/axis-trunk/ws/axis/axis-rt-core/src/test/java/test/wsdd/TestOptions.java>:[9,33]
cannot find symbol
[ERROR] symbol: class TestCase
[ERROR] public class TestOptions extends TestCase
[ERROR] <https://builds.apache.org/job/axis-trunk/ws/axis/axis-rt-core/src/test/java/test/wsdd/TestJAXRPCHandlerInfoChain.java>:[42,48]
cannot find symbol
[ERROR] symbol: class TestCase
[ERROR] public class TestJAXRPCHandlerInfoChain extends TestCase implements Handler {
[ERROR] <https://builds.apache.org/job/axis-trunk/ws/axis/axis-rt-core/src/test/java/test/encoding/TestArrayListConversions.java>:[20,46]
cannot find symbol
[ERROR] symbol: class TestCase
[ERROR] public class TestArrayListConversions extends TestCase {
[ERROR] <https://builds.apache.org/job/axis-trunk/ws/axis/axis-rt-core/src/test/java/test/encoding/TestRoundTrip.java>:[20,35]
cannot find symbol
[ERROR] symbol: class TestCase
[ERROR] public class TestRoundTrip extends TestCase {
[ERROR] <https://builds.apache.org/job/axis-trunk/ws/axis/axis-rt-core/src/test/java/test/utils/TestJavaUtils.java>:[17,35]
cannot find symbol
[ERROR] symbol: class TestCase
[ERROR] public class TestJavaUtils extends TestCase
[ERROR] <https://builds.apache.org/job/axis-trunk/ws/axis/axis-rt-core/src/test/java/test/types/TestYearMonth.java>:[25,35]
cannot find symbol
[ERROR] symbol: class TestCase
[ERROR] public class TestYearMonth extends TestCase {
[ERROR] <https://builds.apache.org/job/axis-trunk/ws/axis/axis-rt-core/src/test/java/test/types/TestDay.java>:[27,29]
cannot find symbol
[ERROR] symbol: class TestCase
[ERROR] public class TestDay extends TestCase {
[ERROR] <https://builds.apache.org/job/axis-trunk/ws/axis/axis-rt-core/src/test/java/test/types/TestPositiveInteger.java>:[25,41]
cannot find symbol
[ERROR] symbol: class TestCase
[ERROR] public class TestPositiveInteger extends TestCase {
[ERROR] <https://builds.apache.org/job/axis-trunk/ws/axis/axis-rt-core/src/test/java/test/encoding/TestString3.java>:[17,33]
cannot find symbol
[ERROR] symbol: class TestCase
[ERROR] public class TestString3 extends TestCase {
[ERROR] <https://builds.apache.org/job/axis-trunk/ws/axis/axis-rt-core/src/test/java/test/types/TestYear.java>:[25,30]
cannot find symbol
[ERROR] symbol: class TestCase
[ERROR] public class TestYear extends TestCase {
[ERROR] <https://builds.apache.org/job/axis-trunk/ws/axis/axis-rt-core/src/test/java/test/soap12/TestRPC.java>:[29,29]
cannot find symbol
[ERROR] symbol: class TestCase
[ERROR] public class TestRPC extends TestCase {
[ERROR] <https://builds.apache.org/job/axis-trunk/ws/axis/axis-rt-core/src/test/java/test/message/TestMUValues.java>:[22,34]
cannot find symbol
[ERROR] symbol: class TestCase
[ERROR] public class TestMUValues extends TestCase {
[ERROR] <https://builds.apache.org/job/axis-trunk/ws/axis/axis-rt-core/src/test/java/test/types/TestMonthDay.java>:[27,34]
cannot find symbol
[ERROR] symbol: class TestCase
[ERROR] public class TestMonthDay extends TestCase {
[ERROR] <https://builds.apache.org/job/axis-trunk/ws/axis/axis-rt-core/src/test/java/test/types/TestUnsignedInt.java>:[25,37]
cannot find symbol
[ERROR] symbol: class TestCase
[ERROR] public class TestUnsignedInt extends TestCase {
[ERROR] <https://builds.apache.org/job/axis-trunk/ws/axis/axis-rt-core/src/test/java/test/types/TestDuration.java>:[31,34]
cannot find symbol
[ERROR] symbol: class TestCase
[ERROR] public class TestDuration extends TestCase {
[ERROR] <https://builds.apache.org/job/axis-trunk/ws/axis/axis-rt-core/src/test/java/test/utils/TestOptions.java>:[8,33]
cannot find symbol
[ERROR] symbol: class TestCase
[ERROR] public class TestOptions extends TestCase
[ERROR] <https://builds.apache.org/job/axis-trunk/ws/axis/axis-rt-core/src/test/java/test/message/TestJavaSerialization.java>:[47,43]
cannot find symbol
[ERROR] symbol: class TestCase
[ERROR] public class TestJavaSerialization extends TestCase {
[ERROR] <https://builds.apache.org/job/axis-trunk/ws/axis/axis-rt-core/src/test/java/test/wsdd/TestAllowedMethods.java>:[19,40]
cannot find symbol
[ERROR] symbol: class TestCase
[ERROR] public class TestAllowedMethods extends TestCase {
[ERROR] <https://builds.apache.org/job/axis-trunk/ws/axis/axis-rt-core/src/test/java/test/outparams2/TestOutParams.java>:[23,35]
cannot find symbol
[ERROR] symbol: class TestCase
[ERROR] public class TestOutParams extends TestCase {
[ERROR] <https://builds.apache.org/job/axis-trunk/ws/axis/axis-rt-core/src/test/java/test/types/TestId.java>:[25,28]
cannot find symbol
[ERROR] symbol: class TestCase
[ERROR] public class TestId extends TestCase {
[ERROR] <https://builds.apache.org/job/axis-trunk/ws/axis/axis-rt-core/src/test/java/test/encoding/TestString2.java>:[18,33]
cannot find symbol
[ERROR] symbol: class TestCase
[ERROR] public class TestString2 extends TestCase {
[ERROR] <https://builds.apache.org/job/axis-trunk/ws/axis/axis-rt-core/src/test/java/test/wsdd/TestRoles.java>:[11,31]
cannot find symbol
[ERROR] symbol: class TestCase
[ERROR] public class TestRoles extends TestCase
[ERROR] <https://builds.apache.org/job/axis-trunk/ws/axis/axis-rt-core/src/test/java/test/types/TestNormalizedString.java>:[25,42]
cannot find symbol
[ERROR] symbol: class TestCase
[ERROR] public class TestNormalizedString extends TestCase {
[ERROR] <https://builds.apache.org/job/axis-trunk/ws/axis/axis-rt-core/src/test/java/test/typedesc/TestTypesNonBeanCompatible.java>:[32,48]
cannot find symbol
[ERROR] symbol: class TestCase
[ERROR] public class TestTypesNonBeanCompatible extends TestCase {
[ERROR] <https://builds.apache.org/job/axis-trunk/ws/axis/axis-rt-core/src/test/java/test/soap12/TestHrefs.java>:[20,31]
cannot find symbol
[ERROR] symbol: class TestCase
[ERROR] public class TestHrefs extends TestCase {
[ERROR] <https://builds.apache.org/job/axis-trunk/ws/axis/axis-rt-core/src/test/java/test/encoding/TestHrefs.java>:[20,31]
cannot find symbol
[ERROR] symbol: class TestCase
[ERROR] public class TestHrefs extends TestCase {
[ERROR] <https://builds.apache.org/job/axis-trunk/ws/axis/axis-rt-core/src/test/java/test/encoding/TestBody.java>:[21,30]
cannot find symbol
[ERROR] symbol: class TestCase
[ERROR] public class TestBody extends TestCase {
[ERROR] <https://builds.apache.org/job/axis-trunk/ws/axis/axis-rt-core/src/test/java/test/components/TestUUID.java>:[31,30]
cannot find symbol
[ERROR] symbol: class TestCase
[ERROR] public class TestUUID extends TestCase {
[ERROR] <https://builds.apache.org/job/axis-trunk/ws/axis/axis-rt-core/src/test/java/test/soap12/TestVersionMismatch.java>:[26,0]
package junit.framework does not exist
[ERROR] <https://builds.apache.org/job/axis-trunk/ws/axis/axis-rt-core/src/test/java/test/soap12/TestVersionMismatch.java>:[37,41]
cannot find symbol
[ERROR] symbol: class TestCase
[ERROR] public class TestVersionMismatch extends TestCase {
[ERROR] <https://builds.apache.org/job/axis-trunk/ws/axis/axis-rt-core/src/test/java/test/types/TestNonPositiveInteger.java>:[25,44]
cannot find symbol
[ERROR] symbol: class TestCase
[ERROR] public class TestNonPositiveInteger extends TestCase {
[ERROR] <https://builds.apache.org/job/axis-trunk/ws/axis/axis-rt-core/src/test/java/test/chains/TestSimpleChain.java>:[26,37]
cannot find symbol
[ERROR] symbol: class TestCase
[ERROR] public class TestSimpleChain extends TestCase
[ERROR] <https://builds.apache.org/job/axis-trunk/ws/axis/axis-rt-core/src/test/java/test/types/TestNegativeInteger.java>:[25,41]
cannot find symbol
[ERROR] symbol: class TestCase
[ERROR] public class TestNegativeInteger extends TestCase {
[ERROR] <https://builds.apache.org/job/axis-trunk/ws/axis/axis-rt-core/src/test/java/test/encoding/EncodingTest.java>:[14,34]
cannot find symbol
[ERROR] symbol: class TestCase
[ERROR] public class EncodingTest extends TestCase {
[ERROR] <https://builds.apache.org/job/axis-trunk/ws/axis/axis-rt-core/src/test/java/test/MSGDispatch/TestMessageService.java>:[45,40]
cannot find symbol
[ERROR] symbol: class TestCase
[ERROR] public class TestMessageService extends TestCase {
[ERROR] <https://builds.apache.org/job/axis-trunk/ws/axis/axis-rt-core/src/test/java/test/wsdd/TestGlobalConfiguration.java>:[9,45]
cannot find symbol
[ERROR] symbol: class TestCase
[ERROR] public class TestGlobalConfiguration extends TestCase
[ERROR] <https://builds.apache.org/job/axis-trunk/ws/axis/axis-rt-core/src/test/java/test/utils/bytecode/TestParamNameExtractor.java>:[18,44]
cannot find symbol
[ERROR] symbol: class TestCase
[ERROR] public class TestParamNameExtractor extends TestCase {
[ERROR] <https://builds.apache.org/job/axis-trunk/ws/axis/axis-rt-core/src/test/java/test/message/TestText.java>:[12,30]
cannot find symbol
[ERROR] symbol: class TestCase
[ERROR] public class TestText extends TestCase
[ERROR] <https://builds.apache.org/job/axis-trunk/ws/axis/axis-rt-core/src/test/java/test/saaj/TestEnvelope.java>:[26,23]
package junit.framework does not exist
[ERROR] <https://builds.apache.org/job/axis-trunk/ws/axis/axis-rt-core/src/test/java/test/types/TestURI.java>:[25,29]
cannot find symbol
[ERROR] symbol: class TestCase
[ERROR] public class TestURI extends TestCase {
[ERROR] <https://builds.apache.org/job/axis-trunk/ws/axis/axis-rt-core/src/test/java/test/concurrency/TestApplicationScope.java>:[40,42]
cannot find symbol
[ERROR] symbol: class TestCase
[ERROR] public class TestApplicationScope extends TestCase {
[ERROR] <https://builds.apache.org/job/axis-trunk/ws/axis/axis-rt-core/src/test/java/test/encoding/TestSer.java>:[31,29]
cannot find symbol
[ERROR] symbol: class TestCase
[ERROR] public class TestSer extends TestCase {
[ERROR] <https://builds.apache.org/job/axis-trunk/ws/axis/axis-rt-core/src/test/java/test/faults/FaultDecode.java>:[18,23]
package junit.framework does not exist
[ERROR] <https://builds.apache.org/job/axis-trunk/ws/axis/axis-rt-core/src/test/java/test/faults/FaultDecode.java>:[20,23]
package junit.framework does not exist
[ERROR] <https://builds.apache.org/job/axis-trunk/ws/axis/axis-rt-core/src/test/java/test/faults/FaultDecode.java>:[21,20]
package junit.textui does not exist
[ERROR] <https://builds.apache.org/job/axis-trunk/ws/axis/axis-rt-core/src/test/java/test/faults/FaultDecode.java>:[41,33]
cannot find symbol
[ERROR] symbol: class TestCase
[ERROR] public class FaultDecode extends TestCase {
[ERROR] <https://builds.apache.org/job/axis-trunk/ws/axis/axis-rt-core/src/test/java/test/faults/FaultDecode.java>:[51,18]
cannot find symbol
[ERROR] symbol  : class Test
[ERROR] location: class test.faults.FaultDecode
[ERROR] <https://builds.apache.org/job/axis-trunk/ws/axis/axis-rt-core/src/test/java/test/wsdd/TestScopeOption.java>:[9,37]
cannot find symbol
[ERROR] symbol: class TestCase
[ERROR] public class TestScopeOption extends TestCase
[ERROR] <https://builds.apache.org/job/axis-trunk/ws/axis/axis-rt-core/src/test/java/test/wsdd/TestAdminService.java>:[19,38]
cannot find symbol
[ERROR] symbol: class TestCase
[ERROR] public class TestAdminService extends TestCase
[ERROR] <https://builds.apache.org/job/axis-trunk/ws/axis/axis-rt-core/src/test/java/test/saaj/TestSOAPElement.java>:[26,37]
cannot find symbol
[ERROR] symbol: class TestCase
[ERROR] public class TestSOAPElement extends TestCase
[ERROR] <https://builds.apache.org/job/axis-trunk/ws/axis/axis-rt-core/src/test/java/test/servicedesc/TestServiceDesc.java>:[26,37]
cannot find symbol
[ERROR] symbol: class TestCase
[ERROR] public class TestServiceDesc extends TestCase {
[ERROR] <https://builds.apache.org/job/axis-trunk/ws/axis/axis-rt-core/src/test/java/test/message/TestSOAPHeader.java>:[39,36]
cannot find symbol
[ERROR] symbol: class TestCase
[ERROR] public class TestSOAPHeader extends TestCase {
[ERROR] <https://builds.apache.org/job/axis-trunk/ws/axis/axis-rt-core/src/test/java/test/providers/TestBasicProvider.java>:[46,39]
cannot find symbol
[ERROR] symbol: class TestCase
[ERROR] public class TestBasicProvider extends TestCase {
[ERROR] -> [Help 1]
[ERROR] 
[ERROR] To see the full stack trace of the errors, re-run Maven with the -e switch.
[ERROR] Re-run Maven using the -X switch to enable full debug logging.
[ERROR] 
[ERROR] For more information about the errors and possible solutions, please read the following
articles:
[ERROR] [Help 1] http://cwiki.apache.org/confluence/display/MAVEN/MojoFailureException
[ERROR] 
[ERROR] After correcting the problems, you can resume the build with the command
[ERROR]   mvn <goals> -rf :axis-rt-core
[JENKINS] Archiving <https://builds.apache.org/job/axis-trunk/ws/axis/axis-rt-databinding-xmlbeans/pom.xml>
to org.apache.axis/axis-rt-databinding-xmlbeans/1.4.1-SNAPSHOT/axis-rt-databinding-xmlbeans-1.4.1-SNAPSHOT.pom
[JENKINS] Archiving <https://builds.apache.org/job/axis-trunk/ws/axis/maven/nsmap/pom.xml>
to org.apache.axis/nsmap/1.4.1-SNAPSHOT/nsmap-1.4.1-SNAPSHOT.pom
[JENKINS] Archiving <https://builds.apache.org/job/axis-trunk/ws/axis/axis-jaxrpc/pom.xml>
to org.apache.axis/axis-jaxrpc/1.4.1-SNAPSHOT/axis-jaxrpc-1.4.1-SNAPSHOT.pom
[JENKINS] Archiving <https://builds.apache.org/job/axis-trunk/ws/axis/axis-jaxrpc/target/axis-jaxrpc-1.4.1-SNAPSHOT.jar>
to org.apache.axis/axis-jaxrpc/1.4.1-20140205.135737-239/axis-jaxrpc-1.4.1-20140205.135737-239.jar
[JENKINS] Archiving <https://builds.apache.org/job/axis-trunk/ws/axis/axis-jaxrpc/target/axis-jaxrpc-1.4.1-SNAPSHOT-sources.jar>
to org.apache.axis/axis-jaxrpc/1.4.1-20140205.135737-239/axis-jaxrpc-1.4.1-20140205.135737-239-sources.jar
[JENKINS] Archiving <https://builds.apache.org/job/axis-trunk/ws/axis/axis-jaxrpc/target/axis-jaxrpc-1.4.1-SNAPSHOT-javadoc.jar>
to org.apache.axis/axis-jaxrpc/1.4.1-20140205.135737-239/axis-jaxrpc-1.4.1-20140205.135737-239-javadoc.jar
[JENKINS] Archiving <https://builds.apache.org/job/axis-trunk/ws/axis/tests/pom.xml>
to org.apache.axis/tests/1.4.1-SNAPSHOT/tests-1.4.1-SNAPSHOT.pom
[JENKINS] Archiving <https://builds.apache.org/job/axis-trunk/ws/axis/jetty-daemon/pom.xml>
to org.apache.axis/jetty-daemon/1.4.1-SNAPSHOT/jetty-daemon-1.4.1-SNAPSHOT.pom
[JENKINS] Archiving <https://builds.apache.org/job/axis-trunk/ws/axis/samples/message-sample/pom.xml>
to org.apache.axis/message-sample/1.4.1-SNAPSHOT/message-sample-1.4.1-SNAPSHOT.pom
[JENKINS] Archiving <https://builds.apache.org/job/axis-trunk/ws/axis/samples/mtomstub-sample/pom.xml>
to org.apache.axis/mtomstub-sample/1.4.1-SNAPSHOT/mtomstub-sample-1.4.1-SNAPSHOT.pom
[JENKINS] Archiving <https://builds.apache.org/job/axis-trunk/ws/axis/samples/misc-sample/pom.xml>
to org.apache.axis/misc-sample/1.4.1-SNAPSHOT/misc-sample-1.4.1-SNAPSHOT.pom
[JENKINS] Archiving <https://builds.apache.org/job/axis-trunk/ws/axis/axis-standalone-server/pom.xml>
to org.apache.axis/axis-standalone-server/1.4.1-SNAPSHOT/axis-standalone-server-1.4.1-SNAPSHOT.pom
[JENKINS] Archiving <https://builds.apache.org/job/axis-trunk/ws/axis/samples/addr-sample/pom.xml>
to org.apache.axis/addr-sample/1.4.1-SNAPSHOT/addr-sample-1.4.1-SNAPSHOT.pom
[JENKINS] Archiving <https://builds.apache.org/job/axis-trunk/ws/axis/samples/handler-sample/pom.xml>
to org.apache.axis/handler-sample/1.4.1-SNAPSHOT/handler-sample-1.4.1-SNAPSHOT.pom
[JENKINS] Archiving <https://builds.apache.org/job/axis-trunk/ws/axis/tcpmon/pom.xml>
to org.apache.axis/tcpmon/1.4.1-SNAPSHOT/tcpmon-1.4.1-SNAPSHOT.pom
[JENKINS] Archiving <https://builds.apache.org/job/axis-trunk/ws/axis/samples/attachments-sample/pom.xml>
to org.apache.axis/attachments-sample/1.4.1-SNAPSHOT/attachments-sample-1.4.1-SNAPSHOT.pom
[JENKINS] Archiving <https://builds.apache.org/job/axis-trunk/ws/axis/samples/jms-sample/pom.xml>
to org.apache.axis/jms-sample/1.4.1-SNAPSHOT/jms-sample-1.4.1-SNAPSHOT.pom
[JENKINS] Archiving <https://builds.apache.org/job/axis-trunk/ws/axis/samples/pom.xml>
to org.apache.axis/samples/1.4.1-SNAPSHOT/samples-1.4.1-SNAPSHOT.pom
[JENKINS] Archiving <https://builds.apache.org/job/axis-trunk/ws/axis/maven/maven-wsdl2java-plugin/pom.xml>
to org.apache.axis/maven-wsdl2java-plugin/1.4.1-SNAPSHOT/maven-wsdl2java-plugin-1.4.1-SNAPSHOT.pom
[JENKINS] Archiving <https://builds.apache.org/job/axis-trunk/ws/axis/axis-rt-management/pom.xml>
to org.apache.axis/axis-rt-management/1.4.1-SNAPSHOT/axis-rt-management-1.4.1-SNAPSHOT.pom
[JENKINS] Archiving <https://builds.apache.org/job/axis-trunk/ws/axis/apidocs/pom.xml>
to org.apache.axis/apidocs/1.4.1-SNAPSHOT/apidocs-1.4.1-SNAPSHOT.pom
[JENKINS] Archiving <https://builds.apache.org/job/axis-trunk/ws/axis/axis-rt-databinding-castor/pom.xml>
to org.apache.axis/axis-rt-databinding-castor/1.4.1-SNAPSHOT/axis-rt-databinding-castor-1.4.1-SNAPSHOT.pom
[JENKINS] Archiving <https://builds.apache.org/job/axis-trunk/ws/axis/distribution/pom.xml>
to org.apache.axis/distribution/1.4.1-SNAPSHOT/distribution-1.4.1-SNAPSHOT.pom
[JENKINS] Archiving <https://builds.apache.org/job/axis-trunk/ws/axis/soapmonitor-client/pom.xml>
to org.apache.axis/soapmonitor-client/1.4.1-SNAPSHOT/soapmonitor-client-1.4.1-SNAPSHOT.pom
[JENKINS] Archiving <https://builds.apache.org/job/axis-trunk/ws/axis/axis-model/pom.xml>
to org.apache.axis/axis-model/1.4.1-SNAPSHOT/axis-model-1.4.1-SNAPSHOT.pom
[JENKINS] Archiving <https://builds.apache.org/job/axis-trunk/ws/axis/samples/echo-sample/pom.xml>
to org.apache.axis/echo-sample/1.4.1-SNAPSHOT/echo-sample-1.4.1-SNAPSHOT.pom
[JENKINS] Archiving <https://builds.apache.org/job/axis-trunk/ws/axis/axis-rt-provider-bsf/pom.xml>
to org.apache.axis/axis-rt-provider-bsf/1.4.1-SNAPSHOT/axis-rt-provider-bsf-1.4.1-SNAPSHOT.pom
[JENKINS] Archiving <https://builds.apache.org/job/axis-trunk/ws/axis/samples/jaxm-sample/pom.xml>
to org.apache.axis/jaxm-sample/1.4.1-SNAPSHOT/jaxm-sample-1.4.1-SNAPSHOT.pom
[JENKINS] Archiving <https://builds.apache.org/job/axis-trunk/ws/axis/tests/spring-compat-tests/pom.xml>
to org.apache.axis/spring-compat-tests/1.4.1-SNAPSHOT/spring-compat-tests-1.4.1-SNAPSHOT.pom
[JENKINS] Archiving <https://builds.apache.org/job/axis-trunk/ws/axis/axis-war/pom.xml>
to org.apache.axis/axis-war/1.4.1-SNAPSHOT/axis-war-1.4.1-SNAPSHOT.pom
[JENKINS] Archiving <https://builds.apache.org/job/axis-trunk/ws/axis/maven/maven-axis-server-plugin/pom.xml>
to org.apache.axis/maven-axis-server-plugin/1.4.1-SNAPSHOT/maven-axis-server-plugin-1.4.1-SNAPSHOT.pom
[JENKINS] Archiving <https://builds.apache.org/job/axis-trunk/ws/axis/axis-rt-soapmonitor/pom.xml>
to org.apache.axis/axis-rt-soapmonitor/1.4.1-SNAPSHOT/axis-rt-soapmonitor-1.4.1-SNAPSHOT.pom
[JENKINS] Archiving <https://builds.apache.org/job/axis-trunk/ws/axis/samples/transport-sample/pom.xml>
to org.apache.axis/transport-sample/1.4.1-SNAPSHOT/transport-sample-1.4.1-SNAPSHOT.pom
[JENKINS] Archiving <https://builds.apache.org/job/axis-trunk/ws/axis/samples/proxy-sample/pom.xml>
to org.apache.axis/proxy-sample/1.4.1-SNAPSHOT/proxy-sample-1.4.1-SNAPSHOT.pom
[JENKINS] Archiving <https://builds.apache.org/job/axis-trunk/ws/axis/daemon-launcher/pom.xml>
to org.apache.axis/daemon-launcher/1.4.1-SNAPSHOT/daemon-launcher-1.4.1-SNAPSHOT.pom
[JENKINS] Archiving <https://builds.apache.org/job/axis-trunk/ws/axis/axis-rt-transport-http-hc3/pom.xml>
to org.apache.axis/axis-rt-transport-http-hc3/1.4.1-SNAPSHOT/axis-rt-transport-http-hc3-1.4.1-SNAPSHOT.pom
[JENKINS] Archiving <https://builds.apache.org/job/axis-trunk/ws/axis/axis-rt-core/pom.xml>
to org.apache.axis/axis-rt-core/1.4.1-SNAPSHOT/axis-rt-core-1.4.1-SNAPSHOT.pom
[JENKINS] Archiving <https://builds.apache.org/job/axis-trunk/ws/axis/axis-testutils/pom.xml>
to org.apache.axis/axis-testutils/1.4.1-SNAPSHOT/axis-testutils-1.4.1-SNAPSHOT.pom
[JENKINS] Archiving <https://builds.apache.org/job/axis-trunk/ws/axis/samples/stock-sample/pom.xml>
to org.apache.axis/stock-sample/1.4.1-SNAPSHOT/stock-sample-1.4.1-SNAPSHOT.pom
[JENKINS] Archiving <https://builds.apache.org/job/axis-trunk/ws/axis/samples/faults-sample/pom.xml>
to org.apache.axis/faults-sample/1.4.1-SNAPSHOT/faults-sample-1.4.1-SNAPSHOT.pom
[JENKINS] Archiving <https://builds.apache.org/job/axis-trunk/ws/axis/soapmonitor-applet/pom.xml>
to org.apache.axis/soapmonitor-applet/1.4.1-SNAPSHOT/soapmonitor-applet-1.4.1-SNAPSHOT.pom
[JENKINS] Archiving <https://builds.apache.org/job/axis-trunk/ws/axis/pom.xml> to org.apache.axis/axis-project/1.4.1-SNAPSHOT/axis-project-1.4.1-SNAPSHOT.pom
[JENKINS] Archiving <https://builds.apache.org/job/axis-trunk/ws/axis/target/axis-project-1.4.1-SNAPSHOT-source-release.zip>
to org.apache.axis/axis-project/1.4.1-20140205.135719-241/axis-project-1.4.1-20140205.135719-241-source-release.zip
[JENKINS] Archiving <https://builds.apache.org/job/axis-trunk/ws/axis/axis-codegen/pom.xml>
to org.apache.axis/axis-codegen/1.4.1-SNAPSHOT/axis-codegen-1.4.1-SNAPSHOT.pom
[JENKINS] Archiving <https://builds.apache.org/job/axis-trunk/ws/axis/samples/bidbuy-sample/pom.xml>
to org.apache.axis/bidbuy-sample/1.4.1-SNAPSHOT/bidbuy-sample-1.4.1-SNAPSHOT.pom
[JENKINS] Archiving <https://builds.apache.org/job/axis-trunk/ws/axis/axis-rt-transport-mail/pom.xml>
to org.apache.axis/axis-rt-transport-mail/1.4.1-SNAPSHOT/axis-rt-transport-mail-1.4.1-SNAPSHOT.pom
[JENKINS] Archiving <https://builds.apache.org/job/axis-trunk/ws/axis/samples/encoding-sample/pom.xml>
to org.apache.axis/encoding-sample/1.4.1-SNAPSHOT/encoding-sample-1.4.1-SNAPSHOT.pom
[JENKINS] Archiving <https://builds.apache.org/job/axis-trunk/ws/axis/axis-rt-compat/pom.xml>
to org.apache.axis/axis-rt-compat/1.4.1-SNAPSHOT/axis-rt-compat-1.4.1-SNAPSHOT.pom
[JENKINS] Archiving <https://builds.apache.org/job/axis-trunk/ws/axis/axis-rt-transport-jms/pom.xml>
to org.apache.axis/axis-rt-transport-jms/1.4.1-SNAPSHOT/axis-rt-transport-jms-1.4.1-SNAPSHOT.pom
[JENKINS] Archiving <https://builds.apache.org/job/axis-trunk/ws/axis/maven/maven-java2wsdl-plugin/pom.xml>
to org.apache.axis/maven-java2wsdl-plugin/1.4.1-SNAPSHOT/maven-java2wsdl-plugin-1.4.1-SNAPSHOT.pom
[JENKINS] Archiving <https://builds.apache.org/job/axis-trunk/ws/axis/axis-rt-jws/pom.xml>
to org.apache.axis/axis-rt-jws/1.4.1-SNAPSHOT/axis-rt-jws-1.4.1-SNAPSHOT.pom
[JENKINS] Archiving <https://builds.apache.org/job/axis-trunk/ws/axis/maven/maven-wsdd-plugin/pom.xml>
to org.apache.axis/maven-wsdd-plugin/1.4.1-SNAPSHOT/maven-wsdd-plugin-1.4.1-SNAPSHOT.pom
[JENKINS] Archiving <https://builds.apache.org/job/axis-trunk/ws/axis/interop-mock/pom.xml>
to org.apache.axis/interop-mock/1.4.1-SNAPSHOT/interop-mock-1.4.1-SNAPSHOT.pom
[JENKINS] Archiving <https://builds.apache.org/job/axis-trunk/ws/axis/axis-saaj/pom.xml>
to org.apache.axis/axis-saaj/1.4.1-SNAPSHOT/axis-saaj-1.4.1-SNAPSHOT.pom
[JENKINS] Archiving <https://builds.apache.org/job/axis-trunk/ws/axis/axis-saaj/target/axis-saaj-1.4.1-SNAPSHOT.jar>
to org.apache.axis/axis-saaj/1.4.1-20140205.135730-239/axis-saaj-1.4.1-20140205.135730-239.jar
[JENKINS] Archiving <https://builds.apache.org/job/axis-trunk/ws/axis/axis-saaj/target/axis-saaj-1.4.1-SNAPSHOT-sources.jar>
to org.apache.axis/axis-saaj/1.4.1-20140205.135730-239/axis-saaj-1.4.1-20140205.135730-239-sources.jar
[JENKINS] Archiving <https://builds.apache.org/job/axis-trunk/ws/axis/axis-saaj/target/axis-saaj-1.4.1-SNAPSHOT-javadoc.jar>
to org.apache.axis/axis-saaj/1.4.1-20140205.135730-239/axis-saaj-1.4.1-20140205.135730-239-javadoc.jar
[JENKINS] Archiving <https://builds.apache.org/job/axis-trunk/ws/axis/tests/interop-tests/pom.xml>
to org.apache.axis/interop-tests/1.4.1-SNAPSHOT/interop-tests-1.4.1-SNAPSHOT.pom
[JENKINS] Archiving <https://builds.apache.org/job/axis-trunk/ws/axis/integration/pom.xml>
to org.apache.axis/integration/1.4.1-SNAPSHOT/integration-1.4.1-SNAPSHOT.pom
[JENKINS] Archiving <https://builds.apache.org/job/axis-trunk/ws/axis/samples/jaxrpc-sample/pom.xml>
to org.apache.axis/jaxrpc-sample/1.4.1-SNAPSHOT/jaxrpc-sample-1.4.1-SNAPSHOT.pom
[JENKINS] Archiving <https://builds.apache.org/job/axis-trunk/ws/axis/axis-tools/pom.xml>
to org.apache.axis/axis-tools/1.4.1-SNAPSHOT/axis-tools-1.4.1-SNAPSHOT.pom
[JENKINS] Archiving <https://builds.apache.org/job/axis-trunk/ws/axis/axis/pom.xml>
to org.apache.axis/axis/1.4.1-SNAPSHOT/axis-1.4.1-SNAPSHOT.pom
[JENKINS] Archiving <https://builds.apache.org/job/axis-trunk/ws/axis/maven/pom.xml>
to org.apache.axis/maven/1.4.1-SNAPSHOT/maven-1.4.1-SNAPSHOT.pom
[JENKINS] Archiving <https://builds.apache.org/job/axis-trunk/ws/axis/samples/integrationguide-sample/pom.xml>
to org.apache.axis/integrationguide-sample/1.4.1-SNAPSHOT/integrationguide-sample-1.4.1-SNAPSHOT.pom
[JENKINS] Archiving <https://builds.apache.org/job/axis-trunk/ws/axis/axis-ant/pom.xml>
to org.apache.axis/axis-ant/1.4.1-SNAPSHOT/axis-ant-1.4.1-SNAPSHOT.pom
Sending e-mails to: java-dev@axis.apache.org
channel stopped

---------------------------------------------------------------------
To unsubscribe, e-mail: java-dev-unsubscribe@axis.apache.org
For additional commands, e-mail: java-dev-help@axis.apache.org


Mime
View raw message