axis-java-dev mailing list archives

Site index · List index
Message view « Date » · « Thread »
Top « Date » · « Thread »
From Apache Jenkins Server <jenk...@builds.apache.org>
Subject Build failed in Jenkins: Rampart #2105
Date Sat, 16 Jan 2016 19:45:42 GMT
See <https://builds.apache.org/job/Rampart/2105/>

------------------------------------------
[...truncated 1488 lines...]
Downloading: http://repo1.maven.org/maven2/org/codehaus/mojo/animal-sniffer/1.14/animal-sniffer-1.14.pom
Downloaded: http://repo1.maven.org/maven2/org/codehaus/mojo/animal-sniffer/1.14/animal-sniffer-1.14.pom
(3 KB at 46.6 KB/sec)
Downloading: http://repo1.maven.org/maven2/org/ow2/asm/asm-all/5.0.3/asm-all-5.0.3.pom
Downloaded: http://repo1.maven.org/maven2/org/ow2/asm/asm-all/5.0.3/asm-all-5.0.3.pom (2 KB
at 38.5 KB/sec)
Downloading: http://repo1.maven.org/maven2/org/ow2/asm/asm-parent/5.0.3/asm-parent-5.0.3.pom
Downloaded: http://repo1.maven.org/maven2/org/ow2/asm/asm-parent/5.0.3/asm-parent-5.0.3.pom
(6 KB at 109.5 KB/sec)
Downloading: http://repo1.maven.org/maven2/org/codehaus/mojo/java-boot-classpath-detector/1.14/java-boot-classpath-detector-1.14.pom
Downloaded: http://repo1.maven.org/maven2/org/codehaus/mojo/java-boot-classpath-detector/1.14/java-boot-classpath-detector-1.14.pom
(3 KB at 48.6 KB/sec)
Downloading: http://repo1.maven.org/maven2/org/apache/maven/maven-plugin-api/2.0.1/maven-plugin-api-2.0.1.pom
Downloaded: http://repo1.maven.org/maven2/org/apache/maven/maven-plugin-api/2.0.1/maven-plugin-api-2.0.1.pom
(643 B at 12.8 KB/sec)
Downloading: http://repo1.maven.org/maven2/org/apache/maven/maven/2.0.1/maven-2.0.1.pom
Downloaded: http://repo1.maven.org/maven2/org/apache/maven/maven/2.0.1/maven-2.0.1.pom (12
KB at 229.2 KB/sec)
Downloading: http://repo1.maven.org/maven2/org/apache/maven/maven-core/2.0.1/maven-core-2.0.1.pom
Downloaded: http://repo1.maven.org/maven2/org/apache/maven/maven-core/2.0.1/maven-core-2.0.1.pom
(6 KB at 101.9 KB/sec)
Downloading: http://repo1.maven.org/maven2/org/apache/maven/maven-settings/2.0.1/maven-settings-2.0.1.pom
Downloaded: http://repo1.maven.org/maven2/org/apache/maven/maven-settings/2.0.1/maven-settings-2.0.1.pom
(2 KB at 28.8 KB/sec)
Downloading: http://repo1.maven.org/maven2/org/apache/maven/maven-model/2.0.1/maven-model-2.0.1.pom
Downloaded: http://repo1.maven.org/maven2/org/apache/maven/maven-model/2.0.1/maven-model-2.0.1.pom
(3 KB at 50.6 KB/sec)
Downloading: http://repo1.maven.org/maven2/org/codehaus/plexus/plexus-utils/1.0.5/plexus-utils-1.0.5.pom
Downloaded: http://repo1.maven.org/maven2/org/codehaus/plexus/plexus-utils/1.0.5/plexus-utils-1.0.5.pom
(918 B at 18.3 KB/sec)
Downloading: http://repo1.maven.org/maven2/junit/junit/4.11/junit-4.11.pom
Downloaded: http://repo1.maven.org/maven2/junit/junit/4.11/junit-4.11.pom (3 KB at 46.7 KB/sec)
Downloading: http://repo1.maven.org/maven2/org/hamcrest/hamcrest-core/1.3/hamcrest-core-1.3.pom
Downloaded: http://repo1.maven.org/maven2/org/hamcrest/hamcrest-core/1.3/hamcrest-core-1.3.pom
(766 B at 15.3 KB/sec)
Downloading: http://repo1.maven.org/maven2/org/hamcrest/hamcrest-parent/1.3/hamcrest-parent-1.3.pom
Downloaded: http://repo1.maven.org/maven2/org/hamcrest/hamcrest-parent/1.3/hamcrest-parent-1.3.pom
(2 KB at 40.1 KB/sec)
Downloading: http://repo1.maven.org/maven2/org/apache/maven/maven-plugin-parameter-documenter/2.0.1/maven-plugin-parameter-documenter-2.0.1.pom
Downloaded: http://repo1.maven.org/maven2/org/apache/maven/maven-plugin-parameter-documenter/2.0.1/maven-plugin-parameter-documenter-2.0.1.pom
(2 KB at 31.4 KB/sec)
Downloading: http://repo1.maven.org/maven2/org/apache/maven/reporting/maven-reporting-api/2.0.1/maven-reporting-api-2.0.1.pom
Downloaded: http://repo1.maven.org/maven2/org/apache/maven/reporting/maven-reporting-api/2.0.1/maven-reporting-api-2.0.1.pom
(902 B at 17.6 KB/sec)
Downloading: http://repo1.maven.org/maven2/org/apache/maven/reporting/maven-reporting/2.0.1/maven-reporting-2.0.1.pom
Downloaded: http://repo1.maven.org/maven2/org/apache/maven/reporting/maven-reporting/2.0.1/maven-reporting-2.0.1.pom
(546 B at 10.7 KB/sec)
Downloading: http://repo1.maven.org/maven2/org/apache/maven/doxia/doxia-sink-api/1.0-alpha-6/doxia-sink-api-1.0-alpha-6.pom
Downloaded: http://repo1.maven.org/maven2/org/apache/maven/doxia/doxia-sink-api/1.0-alpha-6/doxia-sink-api-1.0-alpha-6.pom
(386 B at 7.5 KB/sec)
Downloading: http://repo1.maven.org/maven2/org/apache/maven/doxia/doxia/1.0-alpha-6/doxia-1.0-alpha-6.pom
Downloaded: http://repo1.maven.org/maven2/org/apache/maven/doxia/doxia/1.0-alpha-6/doxia-1.0-alpha-6.pom
(4 KB at 74.7 KB/sec)
Downloading: http://repo1.maven.org/maven2/org/apache/maven/maven-profile/2.0.1/maven-profile-2.0.1.pom
Downloaded: http://repo1.maven.org/maven2/org/apache/maven/maven-profile/2.0.1/maven-profile-2.0.1.pom
(2 KB at 28.4 KB/sec)
Downloading: http://repo1.maven.org/maven2/org/apache/maven/maven-artifact/2.0.1/maven-artifact-2.0.1.pom
Downloaded: http://repo1.maven.org/maven2/org/apache/maven/maven-artifact/2.0.1/maven-artifact-2.0.1.pom
(765 B at 15.2 KB/sec)
Downloading: http://repo1.maven.org/maven2/org/apache/maven/maven-repository-metadata/2.0.1/maven-repository-metadata-2.0.1.pom
Downloaded: http://repo1.maven.org/maven2/org/apache/maven/maven-repository-metadata/2.0.1/maven-repository-metadata-2.0.1.pom
(2 KB at 25.5 KB/sec)
Downloading: http://repo1.maven.org/maven2/org/apache/maven/maven-error-diagnostics/2.0.1/maven-error-diagnostics-2.0.1.pom
Downloaded: http://repo1.maven.org/maven2/org/apache/maven/maven-error-diagnostics/2.0.1/maven-error-diagnostics-2.0.1.pom
(854 B at 16.7 KB/sec)
Downloading: http://repo1.maven.org/maven2/org/apache/maven/maven-project/2.0.1/maven-project-2.0.1.pom
Downloaded: http://repo1.maven.org/maven2/org/apache/maven/maven-project/2.0.1/maven-project-2.0.1.pom
(2 KB at 33.0 KB/sec)
Downloading: http://repo1.maven.org/maven2/org/apache/maven/maven-artifact-manager/2.0.1/maven-artifact-manager-2.0.1.pom
Downloaded: http://repo1.maven.org/maven2/org/apache/maven/maven-artifact-manager/2.0.1/maven-artifact-manager-2.0.1.pom
(2 KB at 26.7 KB/sec)
Downloading: http://repo1.maven.org/maven2/org/apache/maven/maven-plugin-registry/2.0.1/maven-plugin-registry-2.0.1.pom
Downloaded: http://repo1.maven.org/maven2/org/apache/maven/maven-plugin-registry/2.0.1/maven-plugin-registry-2.0.1.pom
(2 KB at 26.7 KB/sec)
Downloading: http://repo1.maven.org/maven2/org/apache/maven/maven-plugin-descriptor/2.0.1/maven-plugin-descriptor-2.0.1.pom
Downloaded: http://repo1.maven.org/maven2/org/apache/maven/maven-plugin-descriptor/2.0.1/maven-plugin-descriptor-2.0.1.pom
(2 KB at 30.2 KB/sec)
Downloading: http://repo1.maven.org/maven2/org/apache/maven/maven-monitor/2.0.1/maven-monitor-2.0.1.pom
Downloaded: http://repo1.maven.org/maven2/org/apache/maven/maven-monitor/2.0.1/maven-monitor-2.0.1.pom
(442 B at 8.6 KB/sec)
Downloading: http://repo1.maven.org/maven2/org/codehaus/mojo/animal-sniffer/1.14/animal-sniffer-1.14.jar
Downloading: http://repo1.maven.org/maven2/org/ow2/asm/asm-all/5.0.3/asm-all-5.0.3.jar
Downloading: http://repo1.maven.org/maven2/org/codehaus/mojo/java-boot-classpath-detector/1.14/java-boot-classpath-detector-1.14.jar
Downloading: http://repo1.maven.org/maven2/org/apache/maven/reporting/maven-reporting-api/2.0.1/maven-reporting-api-2.0.1.jar
Downloading: http://repo1.maven.org/maven2/org/apache/maven/doxia/doxia-sink-api/1.0-alpha-6/doxia-sink-api-1.0-alpha-6.jar
Downloaded: http://repo1.maven.org/maven2/org/codehaus/mojo/java-boot-classpath-detector/1.14/java-boot-classpath-detector-1.14.jar
(5 KB at 99.2 KB/sec)
Downloaded: http://repo1.maven.org/maven2/org/apache/maven/reporting/maven-reporting-api/2.0.1/maven-reporting-api-2.0.1.jar
(6 KB at 107.7 KB/sec)
Downloaded: http://repo1.maven.org/maven2/org/codehaus/mojo/animal-sniffer/1.14/animal-sniffer-1.14.jar
(33 KB at 646.1 KB/sec)
Downloaded: http://repo1.maven.org/maven2/org/apache/maven/doxia/doxia-sink-api/1.0-alpha-6/doxia-sink-api-1.0-alpha-6.jar
(4 KB at 77.5 KB/sec)
Downloaded: http://repo1.maven.org/maven2/org/ow2/asm/asm-all/5.0.3/asm-all-5.0.3.jar (236
KB at 4213.8 KB/sec)
[INFO] Checking unresolved references to org.codehaus.mojo.signature:java15:1.0
Downloading: http://repo1.maven.org/maven2/org/codehaus/mojo/signature/java15/1.0/java15-1.0.signature
Downloaded: http://repo1.maven.org/maven2/org/codehaus/mojo/signature/java15/1.0/java15-1.0.signature
(506 KB at 6562.7 KB/sec)
[INFO] 
[INFO] --- maven-gpg-plugin:1.5:sign (default) @ rampart-project ---
[INFO] 
[INFO] --- maven-install-plugin:2.5.2:install (default-install) @ rampart-project ---
Downloading: http://repo1.maven.org/maven2/org/apache/maven/shared/maven-shared-utils/0.4/maven-shared-utils-0.4.pom
Downloaded: http://repo1.maven.org/maven2/org/apache/maven/shared/maven-shared-utils/0.4/maven-shared-utils-0.4.pom
(4 KB at 79.0 KB/sec)
Downloading: http://repo1.maven.org/maven2/org/apache/maven/shared/maven-shared-utils/0.4/maven-shared-utils-0.4.jar
Downloaded: http://repo1.maven.org/maven2/org/apache/maven/shared/maven-shared-utils/0.4/maven-shared-utils-0.4.jar
(152 KB at 2811.3 KB/sec)
[INFO] Installing <https://builds.apache.org/job/Rampart/ws/trunk/pom.xml> to <https://builds.apache.org/job/Rampart/ws/.repository/org/apache/rampart/rampart-project/1.7.0-SNAPSHOT/rampart-project-1.7.0-SNAPSHOT.pom>
[INFO] Installing <https://builds.apache.org/job/Rampart/ws/trunk/target/rampart-project-1.7.0-SNAPSHOT-site.xml>
to <https://builds.apache.org/job/Rampart/ws/.repository/org/apache/rampart/rampart-project/1.7.0-SNAPSHOT/rampart-project-1.7.0-SNAPSHOT-site.xml>
[INFO] 
[INFO] --- maven-deploy-plugin:2.8.2:deploy (default-deploy) @ rampart-project ---
Downloading: https://repository.apache.org/content/repositories/snapshots/org/apache/rampart/rampart-project/1.7.0-SNAPSHOT/maven-metadata.xml
Downloaded: https://repository.apache.org/content/repositories/snapshots/org/apache/rampart/rampart-project/1.7.0-SNAPSHOT/maven-metadata.xml
(830 B at 0.4 KB/sec)
Uploading: https://repository.apache.org/content/repositories/snapshots/org/apache/rampart/rampart-project/1.7.0-SNAPSHOT/rampart-project-1.7.0-20160116.194527-1676.pom
Uploaded: https://repository.apache.org/content/repositories/snapshots/org/apache/rampart/rampart-project/1.7.0-SNAPSHOT/rampart-project-1.7.0-20160116.194527-1676.pom
(26 KB at 20.5 KB/sec)
Downloading: https://repository.apache.org/content/repositories/snapshots/org/apache/rampart/rampart-project/maven-metadata.xml
Downloaded: https://repository.apache.org/content/repositories/snapshots/org/apache/rampart/rampart-project/maven-metadata.xml
(393 B at 0.1 KB/sec)
Uploading: https://repository.apache.org/content/repositories/snapshots/org/apache/rampart/rampart-project/1.7.0-SNAPSHOT/maven-metadata.xml
Uploaded: https://repository.apache.org/content/repositories/snapshots/org/apache/rampart/rampart-project/1.7.0-SNAPSHOT/maven-metadata.xml
(830 B at 3.6 KB/sec)
Uploading: https://repository.apache.org/content/repositories/snapshots/org/apache/rampart/rampart-project/maven-metadata.xml
Uploaded: https://repository.apache.org/content/repositories/snapshots/org/apache/rampart/rampart-project/maven-metadata.xml
(393 B at 2.0 KB/sec)
Uploading: https://repository.apache.org/content/repositories/snapshots/org/apache/rampart/rampart-project/1.7.0-SNAPSHOT/rampart-project-1.7.0-20160116.194527-1676-site.xml
Uploaded: https://repository.apache.org/content/repositories/snapshots/org/apache/rampart/rampart-project/1.7.0-SNAPSHOT/rampart-project-1.7.0-20160116.194527-1676-site.xml
(4 KB at 75.0 KB/sec)
Uploading: https://repository.apache.org/content/repositories/snapshots/org/apache/rampart/rampart-project/1.7.0-SNAPSHOT/maven-metadata.xml
Uploaded: https://repository.apache.org/content/repositories/snapshots/org/apache/rampart/rampart-project/1.7.0-SNAPSHOT/maven-metadata.xml
(830 B at 9.5 KB/sec)
[INFO]                                                                         
[INFO] ------------------------------------------------------------------------
[INFO] Building Rampart - Policy 1.7.0-SNAPSHOT
[INFO] ------------------------------------------------------------------------
Downloading: http://repo1.maven.org/maven2/org/apache/maven/plugins/maven-resources-plugin/2.7/maven-resources-plugin-2.7.pom
Downloaded: http://repo1.maven.org/maven2/org/apache/maven/plugins/maven-resources-plugin/2.7/maven-resources-plugin-2.7.pom
(8 KB at 101.7 KB/sec)
Downloading: http://repo1.maven.org/maven2/org/apache/maven/plugins/maven-resources-plugin/2.7/maven-resources-plugin-2.7.jar
Downloaded: http://repo1.maven.org/maven2/org/apache/maven/plugins/maven-resources-plugin/2.7/maven-resources-plugin-2.7.jar
(31 KB at 409.7 KB/sec)
Downloading: http://repo1.maven.org/maven2/org/apache/maven/plugins/maven-compiler-plugin/2.0/maven-compiler-plugin-2.0.pom
Downloaded: http://repo1.maven.org/maven2/org/apache/maven/plugins/maven-compiler-plugin/2.0/maven-compiler-plugin-2.0.pom
(2 KB at 22.7 KB/sec)
Downloading: http://repo1.maven.org/maven2/org/apache/maven/plugins/maven-plugin-parent/2.0/maven-plugin-parent-2.0.pom
Downloaded: http://repo1.maven.org/maven2/org/apache/maven/plugins/maven-plugin-parent/2.0/maven-plugin-parent-2.0.pom
(7 KB at 128.2 KB/sec)
Downloading: http://repo1.maven.org/maven2/org/apache/maven/plugins/maven-compiler-plugin/2.0/maven-compiler-plugin-2.0.jar
Downloaded: http://repo1.maven.org/maven2/org/apache/maven/plugins/maven-compiler-plugin/2.0/maven-compiler-plugin-2.0.jar
(14 KB at 267.2 KB/sec)
Downloading: http://repo1.maven.org/maven2/org/apache/maven/plugins/maven-surefire-plugin/2.10/maven-surefire-plugin-2.10.pom
Downloaded: http://repo1.maven.org/maven2/org/apache/maven/plugins/maven-surefire-plugin/2.10/maven-surefire-plugin-2.10.pom
(11 KB at 210.6 KB/sec)
Downloading: http://repo1.maven.org/maven2/org/apache/maven/surefire/surefire/2.10/surefire-2.10.pom
Downloaded: http://repo1.maven.org/maven2/org/apache/maven/surefire/surefire/2.10/surefire-2.10.pom
(12 KB at 228.3 KB/sec)
Downloading: http://repo1.maven.org/maven2/org/apache/maven/plugins/maven-surefire-plugin/2.10/maven-surefire-plugin-2.10.jar
Downloaded: http://repo1.maven.org/maven2/org/apache/maven/plugins/maven-surefire-plugin/2.10/maven-surefire-plugin-2.10.jar
(30 KB at 576.2 KB/sec)
Downloading: http://repo1.maven.org/maven2/org/apache/maven/plugins/maven-jar-plugin/2.5/maven-jar-plugin-2.5.pom
Downloaded: http://repo1.maven.org/maven2/org/apache/maven/plugins/maven-jar-plugin/2.5/maven-jar-plugin-2.5.pom
(8 KB at 143.9 KB/sec)
Downloading: http://repo1.maven.org/maven2/org/apache/maven/plugins/maven-jar-plugin/2.5/maven-jar-plugin-2.5.jar
Downloaded: http://repo1.maven.org/maven2/org/apache/maven/plugins/maven-jar-plugin/2.5/maven-jar-plugin-2.5.jar
(25 KB at 476.3 KB/sec)
Downloading: http://repository.apache.org/snapshots/org/apache/axis2/axis2-kernel/1.7.0-SNAPSHOT/maven-metadata.xml
Downloaded: http://repository.apache.org/snapshots/org/apache/axis2/axis2-kernel/1.7.0-SNAPSHOT/maven-metadata.xml
(2 KB at 31.0 KB/sec)
Downloading: http://repository.apache.org/snapshots/org/apache/axis2/axis2-kernel/1.7.0-SNAPSHOT/axis2-kernel-1.7.0-20160116.190342-2414.pom
Downloaded: http://repository.apache.org/snapshots/org/apache/axis2/axis2-kernel/1.7.0-SNAPSHOT/axis2-kernel-1.7.0-20160116.190342-2414.pom
(11 KB at 336.7 KB/sec)
Downloading: http://repository.apache.org/snapshots/org/apache/ws/commons/axiom/axiom-api/1.2.17-SNAPSHOT/maven-metadata.xml
Downloading: http://repository.apache.org/snapshots/org/apache/ws/commons/axiom/axiom-api/1.2.17-SNAPSHOT/maven-metadata.xml
Downloading: http://repository.apache.org/snapshots/org/apache/ws/commons/axiom/axiom-api/1.2.17-SNAPSHOT/axiom-api-1.2.17-SNAPSHOT.pom
[WARNING] The POM for org.apache.ws.commons.axiom:axiom-api:jar:1.2.17-SNAPSHOT is missing,
no dependency information available
Downloading: http://repository.apache.org/snapshots/org/apache/ws/commons/axiom/axiom-impl/1.2.17-SNAPSHOT/maven-metadata.xml
Downloading: http://repository.apache.org/snapshots/org/apache/ws/commons/axiom/axiom-impl/1.2.17-SNAPSHOT/maven-metadata.xml
Downloading: http://repository.apache.org/snapshots/org/apache/ws/commons/axiom/axiom-impl/1.2.17-SNAPSHOT/axiom-impl-1.2.17-SNAPSHOT.pom
[WARNING] The POM for org.apache.ws.commons.axiom:axiom-impl:jar:1.2.17-SNAPSHOT is missing,
no dependency information available
Downloading: http://repo1.maven.org/maven2/org/apache/geronimo/specs/geronimo-ws-metadata_2.0_spec/1.1.2/geronimo-ws-metadata_2.0_spec-1.1.2.pom
Downloaded: http://repo1.maven.org/maven2/org/apache/geronimo/specs/geronimo-ws-metadata_2.0_spec/1.1.2/geronimo-ws-metadata_2.0_spec-1.1.2.pom
(3 KB at 42.2 KB/sec)
Downloading: http://repo1.maven.org/maven2/org/apache/geronimo/specs/specs/1.4/specs-1.4.pom
Downloaded: http://repo1.maven.org/maven2/org/apache/geronimo/specs/specs/1.4/specs-1.4.pom
(12 KB at 234.4 KB/sec)
Downloading: http://repo1.maven.org/maven2/org/apache/geronimo/genesis/config/project-config/1.2/project-config-1.2.pom
Downloaded: http://repo1.maven.org/maven2/org/apache/geronimo/genesis/config/project-config/1.2/project-config-1.2.pom
(22 KB at 425.6 KB/sec)
Downloading: http://repo1.maven.org/maven2/org/apache/geronimo/genesis/config/config/1.2/config-1.2.pom
Downloaded: http://repo1.maven.org/maven2/org/apache/geronimo/genesis/config/config/1.2/config-1.2.pom
(2 KB at 34.7 KB/sec)
Downloading: http://repo1.maven.org/maven2/org/apache/geronimo/genesis/genesis/1.2/genesis-1.2.pom
Downloaded: http://repo1.maven.org/maven2/org/apache/geronimo/genesis/genesis/1.2/genesis-1.2.pom
(11 KB at 221.2 KB/sec)
Downloading: http://repo1.maven.org/maven2/org/apache/geronimo/specs/geronimo-jta_1.1_spec/1.1/geronimo-jta_1.1_spec-1.1.pom
Downloaded: http://repo1.maven.org/maven2/org/apache/geronimo/specs/geronimo-jta_1.1_spec/1.1/geronimo-jta_1.1_spec-1.1.pom
(2 KB at 29.3 KB/sec)
Downloading: http://repo1.maven.org/maven2/org/apache/geronimo/specs/specs/1.2/specs-1.2.pom
Downloaded: http://repo1.maven.org/maven2/org/apache/geronimo/specs/specs/1.2/specs-1.2.pom
(3 KB at 52.7 KB/sec)
Downloading: http://repo1.maven.org/maven2/org/apache/geronimo/genesis/config/project-config/1.1/project-config-1.1.pom
Downloaded: http://repo1.maven.org/maven2/org/apache/geronimo/genesis/config/project-config/1.1/project-config-1.1.pom
(15 KB at 280.2 KB/sec)
Downloading: http://repo1.maven.org/maven2/org/apache/geronimo/genesis/config/config/1.1/config-1.1.pom
Downloaded: http://repo1.maven.org/maven2/org/apache/geronimo/genesis/config/config/1.1/config-1.1.pom
(670 B at 13.1 KB/sec)
Downloading: http://repo1.maven.org/maven2/org/apache/geronimo/genesis/genesis/1.1/genesis-1.1.pom
Downloaded: http://repo1.maven.org/maven2/org/apache/geronimo/genesis/genesis/1.1/genesis-1.1.pom
(7 KB at 132.2 KB/sec)
Downloading: http://repo1.maven.org/maven2/commons-fileupload/commons-fileupload/1.3.1/commons-fileupload-1.3.1.pom
Downloaded: http://repo1.maven.org/maven2/commons-fileupload/commons-fileupload/1.3.1/commons-fileupload-1.3.1.pom
(10 KB at 198.5 KB/sec)
Downloading: http://repo1.maven.org/maven2/org/apache/commons/commons-parent/32/commons-parent-32.pom
Downloaded: http://repo1.maven.org/maven2/org/apache/commons/commons-parent/32/commons-parent-32.pom
(52 KB at 696.6 KB/sec)
Downloading: http://repo1.maven.org/maven2/wsdl4j/wsdl4j/1.6.2/wsdl4j-1.6.2.pom
Downloaded: http://repo1.maven.org/maven2/wsdl4j/wsdl4j/1.6.2/wsdl4j-1.6.2.pom (939 B at 18.3
KB/sec)
Downloading: http://repo1.maven.org/maven2/org/apache/ws/xmlschema/xmlschema-core/2.2.1/xmlschema-core-2.2.1.pom
Downloaded: http://repo1.maven.org/maven2/org/apache/ws/xmlschema/xmlschema-core/2.2.1/xmlschema-core-2.2.1.pom
(7 KB at 132.9 KB/sec)
Downloading: http://repo1.maven.org/maven2/org/apache/ws/xmlschema/xmlschema/2.2.1/xmlschema-2.2.1.pom
Downloaded: http://repo1.maven.org/maven2/org/apache/ws/xmlschema/xmlschema/2.2.1/xmlschema-2.2.1.pom
(33 KB at 628.6 KB/sec)
Downloading: http://repo1.maven.org/maven2/org/apache/neethi/neethi/3.0.3/neethi-3.0.3.pom
Downloaded: http://repo1.maven.org/maven2/org/apache/neethi/neethi/3.0.3/neethi-3.0.3.pom
(13 KB at 242.5 KB/sec)
Downloading: http://repository.apache.org/snapshots/org/apache/woden/woden-core/1.0M11-SNAPSHOT/maven-metadata.xml
Downloaded: http://repository.apache.org/snapshots/org/apache/woden/woden-core/1.0M11-SNAPSHOT/maven-metadata.xml
(2 KB at 34.7 KB/sec)
Downloading: http://repository.apache.org/snapshots/org/apache/woden/woden-core/1.0M11-SNAPSHOT/woden-core-1.0M11-20150912.103838-4.pom
Downloaded: http://repository.apache.org/snapshots/org/apache/woden/woden-core/1.0M11-SNAPSHOT/woden-core-1.0M11-20150912.103838-4.pom
(5 KB at 267.8 KB/sec)
Downloading: http://repository.apache.org/snapshots/org/apache/woden/woden/1.0M11-SNAPSHOT/maven-metadata.xml
Downloaded: http://repository.apache.org/snapshots/org/apache/woden/woden/1.0M11-SNAPSHOT/maven-metadata.xml
(812 B at 13.4 KB/sec)
Downloading: http://repository.apache.org/snapshots/org/apache/woden/woden/1.0M11-SNAPSHOT/woden-1.0M11-20150912.103731-4.pom
Downloaded: http://repository.apache.org/snapshots/org/apache/woden/woden/1.0M11-SNAPSHOT/woden-1.0M11-20150912.103731-4.pom
(12 KB at 131.3 KB/sec)
Downloading: http://repo1.maven.org/maven2/org/apache/ws/ws-parent/1/ws-parent-1.pom
Downloaded: http://repo1.maven.org/maven2/org/apache/ws/ws-parent/1/ws-parent-1.pom (5 KB
at 88.3 KB/sec)
Downloading: http://repo1.maven.org/maven2/javax/ws/rs/jsr311-api/1.1.1/jsr311-api-1.1.1.pom
Downloaded: http://repo1.maven.org/maven2/javax/ws/rs/jsr311-api/1.1.1/jsr311-api-1.1.1.pom
(6 KB at 106.8 KB/sec)
Downloading: http://repo1.maven.org/maven2/commons-io/commons-io/2.1/commons-io-2.1.pom
Downloaded: http://repo1.maven.org/maven2/commons-io/commons-io/2.1/commons-io-2.1.pom (11
KB at 207.7 KB/sec)
Downloading: http://repository.apache.org/snapshots/org/apache/axis2/axis2-kernel/1.7.0-SNAPSHOT/axis2-kernel-1.7.0-20160116.190342-2414.jar
Downloading: http://repository.apache.org/snapshots/org/apache/ws/commons/axiom/axiom-impl/1.2.17-SNAPSHOT/axiom-impl-1.2.17-SNAPSHOT.jar
Downloading: http://repository.apache.org/snapshots/org/apache/woden/woden-core/1.0M11-SNAPSHOT/woden-core-1.0M11-20150912.103838-4.jar
Downloading: http://repository.apache.org/snapshots/org/apache/ws/commons/axiom/axiom-api/1.2.17-SNAPSHOT/axiom-api-1.2.17-SNAPSHOT.jar
Downloaded: http://repository.apache.org/snapshots/org/apache/woden/woden-core/1.0M11-SNAPSHOT/woden-core-1.0M11-20150912.103838-4.jar
(366 KB at 6640.8 KB/sec)
Downloaded: http://repository.apache.org/snapshots/org/apache/axis2/axis2-kernel/1.7.0-SNAPSHOT/axis2-kernel-1.7.0-20160116.190342-2414.jar
(1032 KB at 7421.9 KB/sec)
Downloading: http://repo1.maven.org/maven2/org/apache/geronimo/specs/geronimo-ws-metadata_2.0_spec/1.1.2/geronimo-ws-metadata_2.0_spec-1.1.2.jar
Downloading: http://repo1.maven.org/maven2/org/apache/geronimo/specs/geronimo-jta_1.1_spec/1.1/geronimo-jta_1.1_spec-1.1.jar
Downloading: http://repo1.maven.org/maven2/javax/servlet/servlet-api/2.3/servlet-api-2.3.jar
Downloading: http://repo1.maven.org/maven2/commons-fileupload/commons-fileupload/1.3.1/commons-fileupload-1.3.1.jar
Downloading: http://repo1.maven.org/maven2/wsdl4j/wsdl4j/1.6.2/wsdl4j-1.6.2.jar
Downloaded: http://repo1.maven.org/maven2/org/apache/geronimo/specs/geronimo-ws-metadata_2.0_spec/1.1.2/geronimo-ws-metadata_2.0_spec-1.1.2.jar
(15 KB at 230.1 KB/sec)
Downloading: http://repo1.maven.org/maven2/org/apache/ws/xmlschema/xmlschema-core/2.2.1/xmlschema-core-2.2.1.jar
Downloaded: http://repo1.maven.org/maven2/org/apache/geronimo/specs/geronimo-jta_1.1_spec/1.1/geronimo-jta_1.1_spec-1.1.jar
(16 KB at 145.5 KB/sec)
Downloading: http://repo1.maven.org/maven2/org/apache/neethi/neethi/3.0.3/neethi-3.0.3.jar
Downloaded: http://repo1.maven.org/maven2/commons-fileupload/commons-fileupload/1.3.1/commons-fileupload-1.3.1.jar
(68 KB at 552.3 KB/sec)
Downloading: http://repo1.maven.org/maven2/javax/ws/rs/jsr311-api/1.1.1/jsr311-api-1.1.1.jar
Downloaded: http://repo1.maven.org/maven2/javax/servlet/servlet-api/2.3/servlet-api-2.3.jar
(77 KB at 532.5 KB/sec)
Downloading: http://repo1.maven.org/maven2/commons-io/commons-io/2.1/commons-io-2.1.jar
Downloaded: http://repo1.maven.org/maven2/org/apache/ws/xmlschema/xmlschema-core/2.2.1/xmlschema-core-2.2.1.jar
(168 KB at 1696.5 KB/sec)
Downloaded: http://repo1.maven.org/maven2/wsdl4j/wsdl4j/1.6.2/wsdl4j-1.6.2.jar (145 KB at
857.7 KB/sec)
Downloaded: http://repo1.maven.org/maven2/javax/ws/rs/jsr311-api/1.1.1/jsr311-api-1.1.1.jar
(46 KB at 611.9 KB/sec)
Downloaded: http://repo1.maven.org/maven2/org/apache/neethi/neethi/3.0.3/neethi-3.0.3.jar
(70 KB at 727.2 KB/sec)
Downloaded: http://repo1.maven.org/maven2/commons-io/commons-io/2.1/commons-io-2.1.jar (160
KB at 1642.5 KB/sec)
[INFO] ------------------------------------------------------------------------
[INFO] Reactor Summary:
[INFO] 
[INFO] Apache Rampart .................................... SUCCESS [54.906s]
[INFO] Rampart - Policy .................................. FAILURE [2.402s]
[INFO] Rampart - Trust ................................... SKIPPED
[INFO] Rampart - Core .................................... SKIPPED
[INFO] Javadoc ........................................... SKIPPED
[INFO] Rampart - Test Suite .............................. SKIPPED
[INFO] Rampart - Mar ..................................... SKIPPED
[INFO] Rampart - Trust-Mar ............................... SKIPPED
[INFO] Rampart - Integration ............................. SKIPPED
[INFO] Rampart - Samples ................................. SKIPPED
[INFO] Rampart - Distribution ............................ SKIPPED
[INFO] Code Coverage Report .............................. SKIPPED
[INFO] ------------------------------------------------------------------------
[INFO] BUILD FAILURE
[INFO] ------------------------------------------------------------------------
[INFO] Total time: 1:07.129s
[INFO] Finished at: Sat Jan 16 19:45:35 UTC 2016
[INFO] Final Memory: 27M/242M
[INFO] ------------------------------------------------------------------------
Waiting for Jenkins to finish collecting data
[ERROR] Failed to execute goal on project rampart-policy: Could not resolve dependencies for
project org.apache.rampart:rampart-policy:jar:1.7.0-SNAPSHOT: The following artifacts could
not be resolved: org.apache.ws.commons.axiom:axiom-impl:jar:1.2.17-SNAPSHOT, org.apache.ws.commons.axiom:axiom-api:jar:1.2.17-SNAPSHOT:
Could not find artifact org.apache.ws.commons.axiom:axiom-impl:jar:1.2.17-SNAPSHOT in Nexus
(http://repository.apache.org/snapshots) -> [Help 1]
[ERROR] 
[ERROR] To see the full stack trace of the errors, re-run Maven with the -e switch.
[ERROR] Re-run Maven using the -X switch to enable full debug logging.
[ERROR] 
[ERROR] For more information about the errors and possible solutions, please read the following
articles:
[ERROR] [Help 1] http://cwiki.apache.org/confluence/display/MAVEN/DependencyResolutionException
[ERROR] 
[ERROR] After correcting the problems, you can resume the build with the command
[ERROR]   mvn <goals> -rf :rampart-policy
[JENKINS] Archiving <https://builds.apache.org/job/Rampart/ws/trunk/modules/rampart-trust-mar/pom.xml>
to org.apache.rampart/rahas/1.7.0-SNAPSHOT/rahas-1.7.0-SNAPSHOT.pom
[JENKINS] Archiving <https://builds.apache.org/job/Rampart/ws/trunk/modules/rampart-core/pom.xml>
to org.apache.rampart/rampart-core/1.7.0-SNAPSHOT/rampart-core-1.7.0-SNAPSHOT.pom
[JENKINS] Archiving <https://builds.apache.org/job/Rampart/ws/trunk/modules/rampart-samples/pom.xml>
to org.apache.rampart/rampart-sample/1.7.0-SNAPSHOT/rampart-sample-1.7.0-SNAPSHOT.pom
[JENKINS] Archiving <https://builds.apache.org/job/Rampart/ws/trunk/modules/rampart-trust/pom.xml>
to org.apache.rampart/rampart-trust/1.7.0-SNAPSHOT/rampart-trust-1.7.0-SNAPSHOT.pom
[JENKINS] Archiving <https://builds.apache.org/job/Rampart/ws/trunk/modules/rampart-policy/pom.xml>
to org.apache.rampart/rampart-policy/1.7.0-SNAPSHOT/rampart-policy-1.7.0-SNAPSHOT.pom
[JENKINS] Archiving <https://builds.apache.org/job/Rampart/ws/trunk/modules/rampart-mar/pom.xml>
to org.apache.rampart/rampart/1.7.0-SNAPSHOT/rampart-1.7.0-SNAPSHOT.pom
[JENKINS] Archiving <https://builds.apache.org/job/Rampart/ws/trunk/apidocs/pom.xml>
to org.apache.rampart/apidocs/1.7.0-SNAPSHOT/apidocs-1.7.0-SNAPSHOT.pom
[JENKINS] Archiving <https://builds.apache.org/job/Rampart/ws/trunk/modules/rampart-integration/pom.xml>
to org.apache.rampart/rampart-integration/1.7.0-SNAPSHOT/rampart-integration-1.7.0-SNAPSHOT.pom
[JENKINS] Archiving <https://builds.apache.org/job/Rampart/ws/trunk/pom.xml> to org.apache.rampart/rampart-project/1.7.0-SNAPSHOT/rampart-project-1.7.0-SNAPSHOT.pom
[JENKINS] Archiving <https://builds.apache.org/job/Rampart/ws/trunk/target/rampart-project-1.7.0-SNAPSHOT-site.xml>
to org.apache.rampart/rampart-project/1.7.0-20160116.194527-1676/rampart-project-1.7.0-20160116.194527-1676-site.xml
[JENKINS] Archiving <https://builds.apache.org/job/Rampart/ws/trunk/modules/distribution/pom.xml>
to org.apache.rampart/rampart-dist/1.7.0-SNAPSHOT/rampart-dist-1.7.0-SNAPSHOT.pom
[JENKINS] Archiving <https://builds.apache.org/job/Rampart/ws/trunk/modules/rampart-tests/pom.xml>
to org.apache.rampart/rampart-tests/1.7.0-SNAPSHOT/rampart-tests-1.7.0-SNAPSHOT.pom
[JENKINS] Archiving <https://builds.apache.org/job/Rampart/ws/trunk/code-coverage/pom.xml>
to org.apache.rampart/code-coverage/1.7.0-SNAPSHOT/code-coverage-1.7.0-SNAPSHOT.pom
Sending e-mails to: java-dev@axis.apache.org
[locks-and-latches] Releasing all the locks
[locks-and-latches] All the locks released
channel stopped

---------------------------------------------------------------------
To unsubscribe, e-mail: java-dev-unsubscribe@axis.apache.org
For additional commands, e-mail: java-dev-help@axis.apache.org


Mime
View raw message