axis-java-dev mailing list archives

Site index · List index
Message view « Date » · « Thread »
Top « Date » · « Thread »
From Apache Jenkins Server <jenk...@builds.apache.org>
Subject Build failed in Jenkins: Rampart #2113
Date Mon, 18 Jan 2016 23:08:54 GMT
See <https://builds.apache.org/job/Rampart/2113/changes>

Changes:

[veithen] [maven-release-plugin] prepare for next development iteration

[veithen] [maven-release-plugin] prepare release v1.7.0

[veithen] Switch dependencies to release versions.

------------------------------------------
Started by an SCM change
[EnvInject] - Loading node environment variables.
Building remotely on ubuntu3 (Ubuntu ubuntu legacy-ubuntu) in workspace <https://builds.apache.org/job/Rampart/ws/>
Updating http://svn.apache.org/repos/asf/axis/axis2/java/rampart/trunk at revision '2016-01-18T23:07:50.708
+0000'
U         modules/distribution/pom.xml
U         modules/rampart-trust-mar/pom.xml
U         modules/rampart-mar/pom.xml
U         modules/rampart-policy/pom.xml
U         modules/rampart-trust/pom.xml
U         modules/rampart-tests/pom.xml
U         modules/rampart-integration/pom.xml
U         modules/rampart-samples/pom.xml
U         modules/rampart-core/pom.xml
U         pom.xml
U         apidocs/pom.xml
U         code-coverage/pom.xml
At revision 1725382
[locks-and-latches] Checking to see if we really have the locks
[locks-and-latches] Have all the locks, build can start
Parsing POMs
Modules changed, recalculating dependency graph
Established TCP socket on 50737
maven3-agent.jar already up to date
maven3-interceptor.jar already up to date
maven3-interceptor-commons.jar already up to date
[trunk] $ /home/jenkins/tools/java/jdk1.7.0_79-unlimited-security/bin/java -Xmx2g -Xms256m
-XX:MaxPermSize=512m -cp /home/jenkins/jenkins-slave/maven3-agent.jar:/home/jenkins/jenkins-slave/tools/hudson.tasks.Maven_MavenInstallation/Maven_3.0.3/boot/plexus-classworlds-2.4.jar
org.jvnet.hudson.maven3.agent.Maven3Main /home/jenkins/jenkins-slave/tools/hudson.tasks.Maven_MavenInstallation/Maven_3.0.3
/x1/jenkins/jenkins-slave/slave.jar /home/jenkins/jenkins-slave/maven3-interceptor.jar /home/jenkins/jenkins-slave/maven3-interceptor-commons.jar
50737
<===[JENKINS REMOTING CAPACITY]===>   channel started
Executing Maven:  -B -f <https://builds.apache.org/job/Rampart/ws/trunk/pom.xml> -Dmaven.repo.local=<https://builds.apache.org/job/Rampart/ws/.repository>
-U clean deploy -Papache-release -Dgpg.skip=true
[INFO] Scanning for projects...
Downloading: http://repo1.maven.org/maven2/org/apache/axis2/axis2-mar-maven-plugin/1.7.0/axis2-mar-maven-plugin-1.7.0.pom
[WARNING] The POM for org.apache.axis2:axis2-mar-maven-plugin:jar:1.7.0 is missing, no dependency
information available
Downloading: http://repo1.maven.org/maven2/org/apache/axis2/axis2-mar-maven-plugin/1.7.0/axis2-mar-maven-plugin-1.7.0.jar
Downloading: http://repo1.maven.org/maven2/org/codehaus/plexus/plexus-utils/1.1/plexus-utils-1.1.jar
Downloaded: http://repo1.maven.org/maven2/org/codehaus/plexus/plexus-utils/1.1/plexus-utils-1.1.jar
(165 KB at 919.6 KB/sec)
[ERROR] The build could not read 2 projects -> [Help 1]
[ERROR]   
[ERROR]   The project org.apache.rampart:rampart:1.8.0-SNAPSHOT (<https://builds.apache.org/job/Rampart/ws/trunk/modules/rampart-mar/pom.xml)>
has 2 errors
[ERROR]     Unresolveable build extension: Plugin org.apache.axis2:axis2-mar-maven-plugin:1.7.0
or one of its dependencies could not be resolved: Could not find artifact org.apache.axis2:axis2-mar-maven-plugin:jar:1.7.0
in central (http://repo1.maven.org/maven2) -> [Help 2]
[ERROR]     Unknown packaging: mar @ line 34, column 16
[ERROR]   
[ERROR]   The project org.apache.rampart:rahas:1.8.0-SNAPSHOT (<https://builds.apache.org/job/Rampart/ws/trunk/modules/rampart-trust-mar/pom.xml)>
has 2 errors
[ERROR]     Unresolveable build extension: Plugin org.apache.axis2:axis2-mar-maven-plugin:1.7.0
or one of its dependencies could not be resolved: Could not find artifact org.apache.axis2:axis2-mar-maven-plugin:jar:1.7.0
in central (http://repo1.maven.org/maven2) -> [Help 2]
[ERROR]     Unknown packaging: mar @ line 35, column 16
[ERROR] 
[ERROR] To see the full stack trace of the errors, re-run Maven with the -e switch.
[ERROR] Re-run Maven using the -X switch to enable full debug logging.
[ERROR] 
[ERROR] For more information about the errors and possible solutions, please read the following
articles:
[ERROR] [Help 1] http://cwiki.apache.org/confluence/display/MAVEN/ProjectBuildingException
[ERROR] [Help 2] http://cwiki.apache.org/confluence/display/MAVEN/PluginResolutionException
[locks-and-latches] Releasing all the locks
[locks-and-latches] All the locks released
channel stopped

---------------------------------------------------------------------
To unsubscribe, e-mail: java-dev-unsubscribe@axis.apache.org
For additional commands, e-mail: java-dev-help@axis.apache.org


Mime
View raw message