axis-java-dev mailing list archives

Site index · List index
Message view « Date » · « Thread »
Top « Date » · « Thread »
From Apache Jenkins Server <jenk...@builds.apache.org>
Subject Build failed in Jenkins: axis2-1.7 » Apache Axis2 - Transport - testkit #49
Date Fri, 15 Apr 2016 20:32:52 GMT
See <https://builds.apache.org/job/axis2-1.7/org.apache.axis2$axis2-transport-testkit/49/>

------------------------------------------
[...truncated 506 lines...]
Generating <https://builds.apache.org/job/axis2-1.7/org.apache.axis2$axis2-transport-testkit/ws/target/apidocs/org/apache/axis2/transport/testkit/doclet/class-use/TestkitJavadocDoclet.html...>
Generating <https://builds.apache.org/job/axis2-1.7/org.apache.axis2$axis2-transport-testkit/ws/target/apidocs/org/apache/axis2/transport/testkit/doclet/class-use/Resource.html...>
Generating <https://builds.apache.org/job/axis2-1.7/org.apache.axis2$axis2-transport-testkit/ws/target/apidocs/org/apache/axis2/transport/testkit/doclet/class-use/Dependency.html...>
Generating <https://builds.apache.org/job/axis2-1.7/org.apache.axis2$axis2-transport-testkit/ws/target/apidocs/org/apache/axis2/transport/testkit/doclet/class-use/ResourceInfoDoclet.html...>
Generating <https://builds.apache.org/job/axis2-1.7/org.apache.axis2$axis2-transport-testkit/ws/target/apidocs/org/apache/axis2/transport/testkit/tests/class-use/Setup.html...>
Generating <https://builds.apache.org/job/axis2-1.7/org.apache.axis2$axis2-transport-testkit/ws/target/apidocs/org/apache/axis2/transport/testkit/tests/class-use/TestResourceSet.html...>
Generating <https://builds.apache.org/job/axis2-1.7/org.apache.axis2$axis2-transport-testkit/ws/target/apidocs/org/apache/axis2/transport/testkit/tests/class-use/ManagedTestCase.html...>
Generating <https://builds.apache.org/job/axis2-1.7/org.apache.axis2$axis2-transport-testkit/ws/target/apidocs/org/apache/axis2/transport/testkit/tests/class-use/TestResourceSetTransition.html...>
Generating <https://builds.apache.org/job/axis2-1.7/org.apache.axis2$axis2-transport-testkit/ws/target/apidocs/org/apache/axis2/transport/testkit/tests/class-use/Transient.html...>
Generating <https://builds.apache.org/job/axis2-1.7/org.apache.axis2$axis2-transport-testkit/ws/target/apidocs/org/apache/axis2/transport/testkit/tests/class-use/TestResource.html...>
Generating <https://builds.apache.org/job/axis2-1.7/org.apache.axis2$axis2-transport-testkit/ws/target/apidocs/org/apache/axis2/transport/testkit/tests/class-use/TearDown.html...>
Generating <https://builds.apache.org/job/axis2-1.7/org.apache.axis2$axis2-transport-testkit/ws/target/apidocs/org/apache/axis2/transport/testkit/tests/class-use/MessageTestCase.html...>
Generating <https://builds.apache.org/job/axis2-1.7/org.apache.axis2$axis2-transport-testkit/ws/target/apidocs/org/apache/axis2/transport/testkit/tests/async/class-use/BinaryTestCase.html...>
Generating <https://builds.apache.org/job/axis2-1.7/org.apache.axis2$axis2-transport-testkit/ws/target/apidocs/org/apache/axis2/transport/testkit/tests/async/class-use/TextPlainTestCase.html...>
Generating <https://builds.apache.org/job/axis2-1.7/org.apache.axis2$axis2-transport-testkit/ws/target/apidocs/org/apache/axis2/transport/testkit/tests/async/class-use/AsyncMessageTestCase.html...>
Generating <https://builds.apache.org/job/axis2-1.7/org.apache.axis2$axis2-transport-testkit/ws/target/apidocs/org/apache/axis2/transport/testkit/tests/async/class-use/XMLAsyncMessageTestCase.html...>
Generating <https://builds.apache.org/job/axis2-1.7/org.apache.axis2$axis2-transport-testkit/ws/target/apidocs/org/apache/axis2/transport/testkit/tests/async/class-use/LargeSOAPAsyncMessageTestCase.html...>
Generating <https://builds.apache.org/job/axis2-1.7/org.apache.axis2$axis2-transport-testkit/ws/target/apidocs/org/apache/axis2/transport/testkit/tests/async/class-use/RESTTestCase.html...>
Generating <https://builds.apache.org/job/axis2-1.7/org.apache.axis2$axis2-transport-testkit/ws/target/apidocs/org/apache/axis2/transport/testkit/tests/async/class-use/SwATestCase.html...>
Generating <https://builds.apache.org/job/axis2-1.7/org.apache.axis2$axis2-transport-testkit/ws/target/apidocs/org/apache/axis2/transport/testkit/tests/echo/class-use/RequestResponseMessageTestCase.html...>
Generating <https://builds.apache.org/job/axis2-1.7/org.apache.axis2$axis2-transport-testkit/ws/target/apidocs/org/apache/axis2/transport/testkit/tests/echo/class-use/XMLRequestResponseMessageTestCase.html...>
Generating <https://builds.apache.org/job/axis2-1.7/org.apache.axis2$axis2-transport-testkit/ws/target/apidocs/org/apache/axis2/transport/testkit/tests/echo/class-use/InterruptingEndpointErrorListener.html...>
Generating <https://builds.apache.org/job/axis2-1.7/org.apache.axis2$axis2-transport-testkit/ws/target/apidocs/org/apache/axis2/transport/testkit/tests/misc/class-use/MinConcurrencyTest.html...>
Generating <https://builds.apache.org/job/axis2-1.7/org.apache.axis2$axis2-transport-testkit/ws/target/apidocs/org/apache/axis2/transport/testkit/name/class-use/Key.html...>
Generating <https://builds.apache.org/job/axis2-1.7/org.apache.axis2$axis2-transport-testkit/ws/target/apidocs/org/apache/axis2/transport/testkit/name/class-use/Named.html...>
Generating <https://builds.apache.org/job/axis2-1.7/org.apache.axis2$axis2-transport-testkit/ws/target/apidocs/org/apache/axis2/transport/testkit/name/class-use/NameUtils.html...>
Generating <https://builds.apache.org/job/axis2-1.7/org.apache.axis2$axis2-transport-testkit/ws/target/apidocs/org/apache/axis2/transport/testkit/name/class-use/Name.html...>
Generating <https://builds.apache.org/job/axis2-1.7/org.apache.axis2$axis2-transport-testkit/ws/target/apidocs/org/apache/axis2/transport/testkit/util/class-use/PortAllocator.html...>
Generating <https://builds.apache.org/job/axis2-1.7/org.apache.axis2$axis2-transport-testkit/ws/target/apidocs/org/apache/axis2/transport/testkit/util/class-use/LifecycleFixTransportListenerProxy.html...>
Generating <https://builds.apache.org/job/axis2-1.7/org.apache.axis2$axis2-transport-testkit/ws/target/apidocs/org/apache/axis2/transport/testkit/util/class-use/ContentTypeUtil.html...>
Generating <https://builds.apache.org/job/axis2-1.7/org.apache.axis2$axis2-transport-testkit/ws/target/apidocs/org/apache/axis2/transport/testkit/util/class-use/ServerUtil.html...>
Generating <https://builds.apache.org/job/axis2-1.7/org.apache.axis2$axis2-transport-testkit/ws/target/apidocs/org/apache/axis2/transport/testkit/util/class-use/LogManager.html...>
Generating <https://builds.apache.org/job/axis2-1.7/org.apache.axis2$axis2-transport-testkit/ws/target/apidocs/org/apache/axis2/transport/testkit/util/tcpmon/class-use/Tunnel.html...>
Generating <https://builds.apache.org/job/axis2-1.7/org.apache.axis2$axis2-transport-testkit/ws/target/apidocs/org/apache/axis2/transport/testkit/client/class-use/AsyncTestClientAdapter.html...>
Generating <https://builds.apache.org/job/axis2-1.7/org.apache.axis2$axis2-transport-testkit/ws/target/apidocs/org/apache/axis2/transport/testkit/client/class-use/ClientOptions.html...>
Generating <https://builds.apache.org/job/axis2-1.7/org.apache.axis2$axis2-transport-testkit/ws/target/apidocs/org/apache/axis2/transport/testkit/client/class-use/AsyncTestClient.html...>
Generating <https://builds.apache.org/job/axis2-1.7/org.apache.axis2$axis2-transport-testkit/ws/target/apidocs/org/apache/axis2/transport/testkit/client/class-use/RequestResponseTestClientAdapter.html...>
Generating <https://builds.apache.org/job/axis2-1.7/org.apache.axis2$axis2-transport-testkit/ws/target/apidocs/org/apache/axis2/transport/testkit/client/class-use/RequestResponseTestClient.html...>
Generating <https://builds.apache.org/job/axis2-1.7/org.apache.axis2$axis2-transport-testkit/ws/target/apidocs/org/apache/axis2/transport/testkit/client/class-use/TestClient.html...>
Generating <https://builds.apache.org/job/axis2-1.7/org.apache.axis2$axis2-transport-testkit/ws/target/apidocs/org/apache/axis2/transport/testkit/channel/class-use/RequestResponseChannel.html...>
Generating <https://builds.apache.org/job/axis2-1.7/org.apache.axis2$axis2-transport-testkit/ws/target/apidocs/org/apache/axis2/transport/testkit/channel/class-use/Channel.html...>
Generating <https://builds.apache.org/job/axis2-1.7/org.apache.axis2$axis2-transport-testkit/ws/target/apidocs/org/apache/axis2/transport/testkit/channel/class-use/AsyncChannel.html...>
Generating <https://builds.apache.org/job/axis2-1.7/org.apache.axis2$axis2-transport-testkit/ws/target/apidocs/org/apache/axis2/transport/class-use/AbstractTransportTest.html...>
Generating <https://builds.apache.org/job/axis2-1.7/org.apache.axis2$axis2-transport-testkit/ws/target/apidocs/org/apache/axis2/transport/class-use/UtilsTransportServer.html...>
Generating <https://builds.apache.org/job/axis2-1.7/org.apache.axis2$axis2-transport-testkit/ws/target/apidocs/org/apache/axis2/transport/class-use/CustomAxisConfigurator.html...>
Generating <https://builds.apache.org/job/axis2-1.7/org.apache.axis2$axis2-transport-testkit/ws/target/apidocs/org/apache/axis2/transport/class-use/Echo.html...>
Generating <https://builds.apache.org/job/axis2-1.7/org.apache.axis2$axis2-transport-testkit/ws/target/apidocs/org/apache/axis2/transport/package-use.html...>
Generating <https://builds.apache.org/job/axis2-1.7/org.apache.axis2$axis2-transport-testkit/ws/target/apidocs/org/apache/axis2/transport/testkit/package-use.html...>
Generating <https://builds.apache.org/job/axis2-1.7/org.apache.axis2$axis2-transport-testkit/ws/target/apidocs/org/apache/axis2/transport/testkit/axis2/package-use.html...>
Generating <https://builds.apache.org/job/axis2-1.7/org.apache.axis2$axis2-transport-testkit/ws/target/apidocs/org/apache/axis2/transport/testkit/axis2/client/package-use.html...>
Generating <https://builds.apache.org/job/axis2-1.7/org.apache.axis2$axis2-transport-testkit/ws/target/apidocs/org/apache/axis2/transport/testkit/axis2/endpoint/package-use.html...>
Generating <https://builds.apache.org/job/axis2-1.7/org.apache.axis2$axis2-transport-testkit/ws/target/apidocs/org/apache/axis2/transport/testkit/axis2/util/package-use.html...>
Generating <https://builds.apache.org/job/axis2-1.7/org.apache.axis2$axis2-transport-testkit/ws/target/apidocs/org/apache/axis2/transport/testkit/channel/package-use.html...>
Generating <https://builds.apache.org/job/axis2-1.7/org.apache.axis2$axis2-transport-testkit/ws/target/apidocs/org/apache/axis2/transport/testkit/client/package-use.html...>
Generating <https://builds.apache.org/job/axis2-1.7/org.apache.axis2$axis2-transport-testkit/ws/target/apidocs/org/apache/axis2/transport/testkit/doclet/package-use.html...>
Generating <https://builds.apache.org/job/axis2-1.7/org.apache.axis2$axis2-transport-testkit/ws/target/apidocs/org/apache/axis2/transport/testkit/endpoint/package-use.html...>
Generating <https://builds.apache.org/job/axis2-1.7/org.apache.axis2$axis2-transport-testkit/ws/target/apidocs/org/apache/axis2/transport/testkit/filter/package-use.html...>
Generating <https://builds.apache.org/job/axis2-1.7/org.apache.axis2$axis2-transport-testkit/ws/target/apidocs/org/apache/axis2/transport/testkit/http/package-use.html...>
Generating <https://builds.apache.org/job/axis2-1.7/org.apache.axis2$axis2-transport-testkit/ws/target/apidocs/org/apache/axis2/transport/testkit/message/package-use.html...>
Generating <https://builds.apache.org/job/axis2-1.7/org.apache.axis2$axis2-transport-testkit/ws/target/apidocs/org/apache/axis2/transport/testkit/name/package-use.html...>
Generating <https://builds.apache.org/job/axis2-1.7/org.apache.axis2$axis2-transport-testkit/ws/target/apidocs/org/apache/axis2/transport/testkit/tests/package-use.html...>
Generating <https://builds.apache.org/job/axis2-1.7/org.apache.axis2$axis2-transport-testkit/ws/target/apidocs/org/apache/axis2/transport/testkit/tests/async/package-use.html...>
Generating <https://builds.apache.org/job/axis2-1.7/org.apache.axis2$axis2-transport-testkit/ws/target/apidocs/org/apache/axis2/transport/testkit/tests/echo/package-use.html...>
Generating <https://builds.apache.org/job/axis2-1.7/org.apache.axis2$axis2-transport-testkit/ws/target/apidocs/org/apache/axis2/transport/testkit/tests/misc/package-use.html...>
Generating <https://builds.apache.org/job/axis2-1.7/org.apache.axis2$axis2-transport-testkit/ws/target/apidocs/org/apache/axis2/transport/testkit/util/package-use.html...>
Generating <https://builds.apache.org/job/axis2-1.7/org.apache.axis2$axis2-transport-testkit/ws/target/apidocs/org/apache/axis2/transport/testkit/util/tcpmon/package-use.html...>
Building index for all the packages and classes...
Generating <https://builds.apache.org/job/axis2-1.7/org.apache.axis2$axis2-transport-testkit/ws/target/apidocs/overview-tree.html...>
Generating <https://builds.apache.org/job/axis2-1.7/org.apache.axis2$axis2-transport-testkit/ws/target/apidocs/index-all.html...>
Generating <https://builds.apache.org/job/axis2-1.7/org.apache.axis2$axis2-transport-testkit/ws/target/apidocs/deprecated-list.html...>
Building index for all classes...
Generating <https://builds.apache.org/job/axis2-1.7/org.apache.axis2$axis2-transport-testkit/ws/target/apidocs/allclasses-frame.html...>
Generating <https://builds.apache.org/job/axis2-1.7/org.apache.axis2$axis2-transport-testkit/ws/target/apidocs/allclasses-noframe.html...>
Generating <https://builds.apache.org/job/axis2-1.7/org.apache.axis2$axis2-transport-testkit/ws/target/apidocs/index.html...>
Generating <https://builds.apache.org/job/axis2-1.7/org.apache.axis2$axis2-transport-testkit/ws/target/apidocs/overview-summary.html...>
Generating <https://builds.apache.org/job/axis2-1.7/org.apache.axis2$axis2-transport-testkit/ws/target/apidocs/help-doc.html...>
5 warnings
[WARNING] Javadoc Warnings
[WARNING] <https://builds.apache.org/job/axis2-1.7/org.apache.axis2$axis2-transport-testkit/ws/src/main/java/org/apache/axis2/transport/testkit/message/AxisMessage.java>:35:
warning - Tag @link: reference not found: MockMessageReceiver
[WARNING] <https://builds.apache.org/job/axis2-1.7/org.apache.axis2$axis2-transport-testkit/ws/src/main/java/org/apache/axis2/transport/AbstractTransportTest.java>:62:
warning - @return tag has no arguments.
[WARNING] <https://builds.apache.org/job/axis2-1.7/org.apache.axis2$axis2-transport-testkit/ws/src/main/java/org/apache/axis2/transport/AbstractTransportTest.java>:105:
warning - @return tag has no arguments.
[WARNING] <https://builds.apache.org/job/axis2-1.7/org.apache.axis2$axis2-transport-testkit/ws/src/main/java/org/apache/axis2/transport/testkit/package-info.java>:293:
warning - Tag @link: reference not found: junit.framework.TestCase.TestCase
[WARNING] <https://builds.apache.org/job/axis2-1.7/org.apache.axis2$axis2-transport-testkit/ws/src/main/java/org/apache/axis2/transport/testkit/endpoint/package-info.java>:41:
warning - Tag @link: reference not found: org.apache.axis2.transport.testkit.endpoint.InOnlyEndpoint
[INFO] Building jar: <https://builds.apache.org/job/axis2-1.7/org.apache.axis2$axis2-transport-testkit/ws/target/axis2-transport-testkit-1.7.2-SNAPSHOT-javadoc.jar>
[INFO] 
[INFO] --- animal-sniffer-maven-plugin:1.14:check (check) @ axis2-transport-testkit ---
[INFO] Checking unresolved references to org.codehaus.mojo.signature:java15:1.0
[INFO] 
[INFO] --- maven-gpg-plugin:1.5:sign (default) @ axis2-transport-testkit ---
[INFO] 
[INFO] --- maven-install-plugin:2.2:install (default-install) @ axis2-transport-testkit ---
[INFO] Installing <https://builds.apache.org/job/axis2-1.7/org.apache.axis2$axis2-transport-testkit/ws/target/axis2-transport-testkit-1.7.2-SNAPSHOT.jar>
to /home/jenkins/jenkins-slave/workspace/axis2-1.7/.repository/org/apache/axis2/axis2-transport-testkit/1.7.2-SNAPSHOT/axis2-transport-testkit-1.7.2-SNAPSHOT.jar
[INFO] Installing <https://builds.apache.org/job/axis2-1.7/org.apache.axis2$axis2-transport-testkit/ws/pom.xml>
to /home/jenkins/jenkins-slave/workspace/axis2-1.7/.repository/org/apache/axis2/axis2-transport-testkit/1.7.2-SNAPSHOT/axis2-transport-testkit-1.7.2-SNAPSHOT.pom
[INFO] Installing <https://builds.apache.org/job/axis2-1.7/org.apache.axis2$axis2-transport-testkit/ws/target/axis2-transport-testkit-1.7.2-SNAPSHOT-sources.jar>
to /home/jenkins/jenkins-slave/workspace/axis2-1.7/.repository/org/apache/axis2/axis2-transport-testkit/1.7.2-SNAPSHOT/axis2-transport-testkit-1.7.2-SNAPSHOT-sources.jar
[INFO] Installing <https://builds.apache.org/job/axis2-1.7/org.apache.axis2$axis2-transport-testkit/ws/target/axis2-transport-testkit-1.7.2-SNAPSHOT-javadoc.jar>
to /home/jenkins/jenkins-slave/workspace/axis2-1.7/.repository/org/apache/axis2/axis2-transport-testkit/1.7.2-SNAPSHOT/axis2-transport-testkit-1.7.2-SNAPSHOT-javadoc.jar
[INFO] 
[INFO] --- maven-deploy-plugin:2.8.2:deploy (default-deploy) @ axis2-transport-testkit ---
Downloading: https://repository.apache.org/content/repositories/snapshots/org/apache/axis2/axis2-transport-testkit/1.7.2-SNAPSHOT/maven-metadata.xml
Downloaded: https://repository.apache.org/content/repositories/snapshots/org/apache/axis2/axis2-transport-testkit/1.7.2-SNAPSHOT/maven-metadata.xml
(2 KB at 1.9 KB/sec)
Uploading: https://repository.apache.org/content/repositories/snapshots/org/apache/axis2/axis2-transport-testkit/1.7.2-SNAPSHOT/axis2-transport-testkit-1.7.2-20160415.195818-28.jar
[WARNING] Failed to upload SHA-1 checksum for <https://builds.apache.org/job/axis2-1.7/org.apache.axis2$axis2-transport-testkit/ws/target/axis2-transport-testkit-1.7.2-SNAPSHOT.jar>:
Read timed out
org.apache.maven.wagon.TransferFailedException: Read timed out
	at org.apache.maven.wagon.shared.http4.AbstractHttpClientWagon.put(AbstractHttpClientWagon.java:580)
	at org.apache.maven.wagon.shared.http4.AbstractHttpClientWagon.put(AbstractHttpClientWagon.java:524)
	at org.apache.maven.wagon.shared.http4.AbstractHttpClientWagon.put(AbstractHttpClientWagon.java:505)
	at org.apache.maven.wagon.shared.http4.AbstractHttpClientWagon.putFromStream(AbstractHttpClientWagon.java:499)
	at org.sonatype.aether.connector.wagon.WagonRepositoryConnector$PutTask.uploadChecksum(WagonRepositoryConnector.java:886)
	at org.sonatype.aether.connector.wagon.WagonRepositoryConnector$PutTask.uploadChecksums(WagonRepositoryConnector.java:861)
	at org.sonatype.aether.connector.wagon.WagonRepositoryConnector$PutTask.run(WagonRepositoryConnector.java:818)
	at org.sonatype.aether.connector.wagon.WagonRepositoryConnector.put(WagonRepositoryConnector.java:467)
	at org.sonatype.aether.impl.internal.DefaultDeployer.deploy(DefaultDeployer.java:274)
	at org.sonatype.aether.impl.internal.DefaultDeployer.deploy(DefaultDeployer.java:211)
	at org.sonatype.aether.impl.internal.DefaultRepositorySystem.deploy(DefaultRepositorySystem.java:443)
	at org.apache.maven.artifact.deployer.DefaultArtifactDeployer.deploy(DefaultArtifactDeployer.java:137)
	at org.apache.maven.plugin.deploy.AbstractDeployMojo.deploy(AbstractDeployMojo.java:171)
	at org.apache.maven.plugin.deploy.DeployMojo.deployProject(DeployMojo.java:250)
	at org.apache.maven.plugin.deploy.DeployMojo.execute(DeployMojo.java:169)
	at org.apache.maven.plugin.DefaultBuildPluginManager.executeMojo(DefaultBuildPluginManager.java:101)
	at org.apache.maven.lifecycle.internal.MojoExecutor.execute(MojoExecutor.java:209)
	at org.apache.maven.lifecycle.internal.MojoExecutor.execute(MojoExecutor.java:153)
	at org.apache.maven.lifecycle.internal.MojoExecutor.execute(MojoExecutor.java:145)
	at org.apache.maven.lifecycle.internal.LifecycleModuleBuilder.buildProject(LifecycleModuleBuilder.java:84)
	at org.apache.maven.lifecycle.internal.LifecycleModuleBuilder.buildProject(LifecycleModuleBuilder.java:59)
	at org.apache.maven.lifecycle.internal.LifecycleStarter.singleThreadedBuild(LifecycleStarter.java:183)
	at org.apache.maven.lifecycle.internal.LifecycleStarter.execute(LifecycleStarter.java:161)
	at org.apache.maven.DefaultMaven.doExecute(DefaultMaven.java:320)
	at org.apache.maven.DefaultMaven.execute(DefaultMaven.java:156)
	at org.jvnet.hudson.maven3.launcher.Maven3Launcher.main(Maven3Launcher.java:117)
	at sun.reflect.NativeMethodAccessorImpl.invoke0(Native Method)
	at sun.reflect.NativeMethodAccessorImpl.invoke(NativeMethodAccessorImpl.java:57)
	at sun.reflect.DelegatingMethodAccessorImpl.invoke(DelegatingMethodAccessorImpl.java:43)
	at java.lang.reflect.Method.invoke(Method.java:606)
	at org.codehaus.plexus.classworlds.launcher.Launcher.launchStandard(Launcher.java:329)
	at org.codehaus.plexus.classworlds.launcher.Launcher.launch(Launcher.java:239)
	at org.jvnet.hudson.maven3.agent.Maven3Main.launch(Maven3Main.java:181)
	at sun.reflect.NativeMethodAccessorImpl.invoke0(Native Method)
	at sun.reflect.NativeMethodAccessorImpl.invoke(NativeMethodAccessorImpl.java:57)
	at sun.reflect.DelegatingMethodAccessorImpl.invoke(DelegatingMethodAccessorImpl.java:43)
	at java.lang.reflect.Method.invoke(Method.java:606)
	at hudson.maven.Maven3Builder.call(Maven3Builder.java:136)
	at hudson.maven.Maven3Builder.call(Maven3Builder.java:71)
	at hudson.remoting.UserRequest.perform(UserRequest.java:120)
	at hudson.remoting.UserRequest.perform(UserRequest.java:48)
	at hudson.remoting.Request$2.run(Request.java:326)
	at hudson.remoting.InterceptingExecutorService$1.call(InterceptingExecutorService.java:68)
	at java.util.concurrent.FutureTask.run(FutureTask.java:262)
	at java.util.concurrent.ThreadPoolExecutor.runWorker(ThreadPoolExecutor.java:1145)
	at java.util.concurrent.ThreadPoolExecutor$Worker.run(ThreadPoolExecutor.java:615)
	at java.lang.Thread.run(Thread.java:745)
Caused by: java.net.SocketTimeoutException: Read timed out
	at java.net.SocketInputStream.socketRead0(Native Method)
	at java.net.SocketInputStream.read(SocketInputStream.java:152)
	at java.net.SocketInputStream.read(SocketInputStream.java:122)
	at sun.security.ssl.InputRecord.readFully(InputRecord.java:442)
	at sun.security.ssl.InputRecord.read(InputRecord.java:480)
	at sun.security.ssl.SSLSocketImpl.readRecord(SSLSocketImpl.java:934)
	at sun.security.ssl.SSLSocketImpl.readDataRecord(SSLSocketImpl.java:891)
	at sun.security.ssl.AppInputStream.read(AppInputStream.java:102)
	at org.apache.maven.wagon.providers.http.httpclient.impl.io.AbstractSessionInputBuffer.fillBuffer(AbstractSessionInputBuffer.java:166)
	at org.apache.maven.wagon.providers.http.httpclient.impl.io.SocketInputBuffer.fillBuffer(SocketInputBuffer.java:90)
	at org.apache.maven.wagon.providers.http.httpclient.impl.io.AbstractSessionInputBuffer.readLine(AbstractSessionInputBuffer.java:281)
	at org.apache.maven.wagon.providers.http.httpclient.impl.conn.DefaultHttpResponseParser.parseHead(DefaultHttpResponseParser.java:92)
	at org.apache.maven.wagon.providers.http.httpclient.impl.conn.DefaultHttpResponseParser.parseHead(DefaultHttpResponseParser.java:62)
	at org.apache.maven.wagon.providers.http.httpclient.impl.io.AbstractMessageParser.parse(AbstractMessageParser.java:254)
	at org.apache.maven.wagon.providers.http.httpclient.impl.AbstractHttpClientConnection.receiveResponseHeader(AbstractHttpClientConnection.java:289)
	at org.apache.maven.wagon.providers.http.httpclient.impl.conn.DefaultClientConnection.receiveResponseHeader(DefaultClientConnection.java:252)
	at org.apache.maven.wagon.providers.http.httpclient.impl.conn.ManagedClientConnectionImpl.receiveResponseHeader(ManagedClientConnectionImpl.java:191)
	at org.apache.maven.wagon.providers.http.httpclient.protocol.HttpRequestExecutor.doReceiveResponse(HttpRequestExecutor.java:300)
	at org.apache.maven.wagon.providers.http.httpclient.protocol.HttpRequestExecutor.execute(HttpRequestExecutor.java:127)
	at org.apache.maven.wagon.providers.http.httpclient.impl.client.DefaultRequestDirector.tryExecute(DefaultRequestDirector.java:717)
	at org.apache.maven.wagon.providers.http.httpclient.impl.client.DefaultRequestDirector.execute(DefaultRequestDirector.java:522)
	at org.apache.maven.wagon.providers.http.httpclient.impl.client.AbstractHttpClient.execute(AbstractHttpClient.java:906)
	at org.apache.maven.wagon.providers.http.httpclient.impl.client.AbstractHttpClient.execute(AbstractHttpClient.java:805)
	at org.apache.maven.wagon.shared.http4.AbstractHttpClientWagon.execute(AbstractHttpClientWagon.java:746)
	at org.apache.maven.wagon.shared.http4.AbstractHttpClientWagon.put(AbstractHttpClientWagon.java:574)
	... 46 more
[WARNING] Failed to upload MD5 checksum for <https://builds.apache.org/job/axis2-1.7/org.apache.axis2$axis2-transport-testkit/ws/target/axis2-transport-testkit-1.7.2-SNAPSHOT.jar>:
Connection to https://repository.apache.org refused
org.apache.maven.wagon.TransferFailedException: Connection to https://repository.apache.org
refused
	at org.apache.maven.wagon.shared.http4.AbstractHttpClientWagon.put(AbstractHttpClientWagon.java:580)
	at org.apache.maven.wagon.shared.http4.AbstractHttpClientWagon.put(AbstractHttpClientWagon.java:524)
	at org.apache.maven.wagon.shared.http4.AbstractHttpClientWagon.put(AbstractHttpClientWagon.java:505)
	at org.apache.maven.wagon.shared.http4.AbstractHttpClientWagon.putFromStream(AbstractHttpClientWagon.java:499)
	at org.sonatype.aether.connector.wagon.WagonRepositoryConnector$PutTask.uploadChecksum(WagonRepositoryConnector.java:886)
	at org.sonatype.aether.connector.wagon.WagonRepositoryConnector$PutTask.uploadChecksums(WagonRepositoryConnector.java:861)
	at org.sonatype.aether.connector.wagon.WagonRepositoryConnector$PutTask.run(WagonRepositoryConnector.java:818)
	at org.sonatype.aether.connector.wagon.WagonRepositoryConnector.put(WagonRepositoryConnector.java:467)
	at org.sonatype.aether.impl.internal.DefaultDeployer.deploy(DefaultDeployer.java:274)
	at org.sonatype.aether.impl.internal.DefaultDeployer.deploy(DefaultDeployer.java:211)
	at org.sonatype.aether.impl.internal.DefaultRepositorySystem.deploy(DefaultRepositorySystem.java:443)
	at org.apache.maven.artifact.deployer.DefaultArtifactDeployer.deploy(DefaultArtifactDeployer.java:137)
	at org.apache.maven.plugin.deploy.AbstractDeployMojo.deploy(AbstractDeployMojo.java:171)
	at org.apache.maven.plugin.deploy.DeployMojo.deployProject(DeployMojo.java:250)
	at org.apache.maven.plugin.deploy.DeployMojo.execute(DeployMojo.java:169)
	at org.apache.maven.plugin.DefaultBuildPluginManager.executeMojo(DefaultBuildPluginManager.java:101)
	at org.apache.maven.lifecycle.internal.MojoExecutor.execute(MojoExecutor.java:209)
	at org.apache.maven.lifecycle.internal.MojoExecutor.execute(MojoExecutor.java:153)
	at org.apache.maven.lifecycle.internal.MojoExecutor.execute(MojoExecutor.java:145)
	at org.apache.maven.lifecycle.internal.LifecycleModuleBuilder.buildProject(LifecycleModuleBuilder.java:84)
	at org.apache.maven.lifecycle.internal.LifecycleModuleBuilder.buildProject(LifecycleModuleBuilder.java:59)
	at org.apache.maven.lifecycle.internal.LifecycleStarter.singleThreadedBuild(LifecycleStarter.java:183)
	at org.apache.maven.lifecycle.internal.LifecycleStarter.execute(LifecycleStarter.java:161)
	at org.apache.maven.DefaultMaven.doExecute(DefaultMaven.java:320)
	at org.apache.maven.DefaultMaven.execute(DefaultMaven.java:156)
	at org.jvnet.hudson.maven3.launcher.Maven3Launcher.main(Maven3Launcher.java:117)
	at sun.reflect.NativeMethodAccessorImpl.invoke0(Native Method)
	at sun.reflect.NativeMethodAccessorImpl.invoke(NativeMethodAccessorImpl.java:57)
	at sun.reflect.DelegatingMethodAccessorImpl.invoke(DelegatingMethodAccessorImpl.java:43)
	at java.lang.reflect.Method.invoke(Method.java:606)
	at org.codehaus.plexus.classworlds.launcher.Launcher.launchStandard(Launcher.java:329)
	at org.codehaus.plexus.classworlds.launcher.Launcher.launch(Launcher.java:239)
	at org.jvnet.hudson.maven3.agent.Maven3Main.launch(Maven3Main.java:181)
	at sun.reflect.NativeMethodAccessorImpl.invoke0(Native Method)
	at sun.reflect.NativeMethodAccessorImpl.invoke(NativeMethodAccessorImpl.java:57)
	at sun.reflect.DelegatingMethodAccessorImpl.invoke(DelegatingMethodAccessorImpl.java:43)
	at java.lang.reflect.Method.invoke(Method.java:606)
	at hudson.maven.Maven3Builder.call(Maven3Builder.java:136)
	at hudson.maven.Maven3Builder.call(Maven3Builder.java:71)
	at hudson.remoting.UserRequest.perform(UserRequest.java:120)
	at hudson.remoting.UserRequest.perform(UserRequest.java:48)
	at hudson.remoting.Request$2.run(Request.java:326)
	at hudson.remoting.InterceptingExecutorService$1.call(InterceptingExecutorService.java:68)
	at java.util.concurrent.FutureTask.run(FutureTask.java:262)
	at java.util.concurrent.ThreadPoolExecutor.runWorker(ThreadPoolExecutor.java:1145)
	at java.util.concurrent.ThreadPoolExecutor$Worker.run(ThreadPoolExecutor.java:615)
	at java.lang.Thread.run(Thread.java:745)
Caused by: org.apache.maven.wagon.providers.http.httpclient.conn.HttpHostConnectException:
Connection to https://repository.apache.org refused
	at org.apache.maven.wagon.providers.http.httpclient.impl.conn.DefaultClientConnectionOperator.openConnection(DefaultClientConnectionOperator.java:190)
	at org.apache.maven.wagon.providers.http.httpclient.impl.conn.ManagedClientConnectionImpl.open(ManagedClientConnectionImpl.java:294)
	at org.apache.maven.wagon.providers.http.httpclient.impl.client.DefaultRequestDirector.tryConnect(DefaultRequestDirector.java:645)
	at org.apache.maven.wagon.providers.http.httpclient.impl.client.DefaultRequestDirector.execute(DefaultRequestDirector.java:480)
	at org.apache.maven.wagon.providers.http.httpclient.impl.client.AbstractHttpClient.execute(AbstractHttpClient.java:906)
	at org.apache.maven.wagon.providers.http.httpclient.impl.client.AbstractHttpClient.execute(AbstractHttpClient.java:805)
	at org.apache.maven.wagon.shared.http4.AbstractHttpClientWagon.execute(AbstractHttpClientWagon.java:746)
	at org.apache.maven.wagon.shared.http4.AbstractHttpClientWagon.put(AbstractHttpClientWagon.java:574)
	... 46 more
Caused by: java.net.ConnectException: Connection timed out
	at java.net.PlainSocketImpl.socketConnect(Native Method)
	at java.net.AbstractPlainSocketImpl.doConnect(AbstractPlainSocketImpl.java:339)
	at java.net.AbstractPlainSocketImpl.connectToAddress(AbstractPlainSocketImpl.java:200)
	at java.net.AbstractPlainSocketImpl.connect(AbstractPlainSocketImpl.java:182)
	at java.net.SocksSocketImpl.connect(SocksSocketImpl.java:392)
	at java.net.Socket.connect(Socket.java:579)
	at sun.security.ssl.SSLSocketImpl.connect(SSLSocketImpl.java:625)
	at org.apache.maven.wagon.providers.http.httpclient.conn.ssl.SSLSocketFactory.connectSocket(SSLSocketFactory.java:549)
	at org.apache.maven.wagon.shared.http4.ConfigurableSSLSocketFactoryDecorator.connectSocket(ConfigurableSSLSocketFactoryDecorator.java:64)
	at org.apache.maven.wagon.providers.http.httpclient.impl.conn.DefaultClientConnectionOperator.openConnection(DefaultClientConnectionOperator.java:180)
	... 53 more
Uploaded: https://repository.apache.org/content/repositories/snapshots/org/apache/axis2/axis2-transport-testkit/1.7.2-SNAPSHOT/axis2-transport-testkit-1.7.2-20160415.195818-28.jar
(203 KB at 0.1 KB/sec)
Uploading: https://repository.apache.org/content/repositories/snapshots/org/apache/axis2/axis2-transport-testkit/1.7.2-SNAPSHOT/axis2-transport-testkit-1.7.2-20160415.195818-28.pom

---------------------------------------------------------------------
To unsubscribe, e-mail: java-dev-unsubscribe@axis.apache.org
For additional commands, e-mail: java-dev-help@axis.apache.org


Mime
View raw message