axis-java-dev mailing list archives

Site index · List index
Message view « Date » · « Thread »
Top « Date » · « Thread »
From Apache Jenkins Server <jenk...@builds.apache.org>
Subject Build failed in Jenkins: Rampart #2222
Date Fri, 15 Apr 2016 20:36:31 GMT
See <https://builds.apache.org/job/Rampart/2222/>

------------------------------------------
Started by upstream project "Axis2" build number 3432
originally caused by:
 Started by user veithen
[EnvInject] - Loading node environment variables.
Building remotely on ubuntu3 (Ubuntu ubuntu legacy-ubuntu) in workspace <https://builds.apache.org/job/Rampart/ws/>
Updating http://svn.apache.org/repos/asf/axis/axis2/java/rampart/trunk at revision '2016-04-15T20:32:56.273
+0000'
At revision 1739362
no change for http://svn.apache.org/repos/asf/axis/axis2/java/rampart/trunk since the previous
build
[locks-and-latches] Checking to see if we really have the locks
[locks-and-latches] Have all the locks, build can start
Parsing POMs
Established TCP socket on 55103
maven3-agent.jar already up to date
maven3-interceptor.jar already up to date
maven3-interceptor-commons.jar already up to date
[trunk] $ /home/jenkins/tools/java/jdk1.7.0_79-unlimited-security/bin/java -Xmx2g -Xms256m
-XX:MaxPermSize=512m -cp /home/jenkins/jenkins-slave/maven3-agent.jar:/home/jenkins/jenkins-slave/tools/hudson.tasks.Maven_MavenInstallation/Maven_3.0.3/boot/plexus-classworlds-2.4.jar
org.jvnet.hudson.maven3.agent.Maven3Main /home/jenkins/jenkins-slave/tools/hudson.tasks.Maven_MavenInstallation/Maven_3.0.3
/x1/jenkins/jenkins-slave/slave.jar /home/jenkins/jenkins-slave/maven3-interceptor.jar /home/jenkins/jenkins-slave/maven3-interceptor-commons.jar
55103
<===[JENKINS REMOTING CAPACITY]===>   channel started
Executing Maven:  -B -f <https://builds.apache.org/job/Rampart/ws/trunk/pom.xml> -Dmaven.repo.local=<https://builds.apache.org/job/Rampart/ws/.repository>
-U clean deploy -Papache-release -Dgpg.skip=true
[INFO] Scanning for projects...
Downloading: http://repository.apache.org/snapshots/org/apache/axis2/axis2-mar-maven-plugin/1.8.0-SNAPSHOT/maven-metadata.xml
[WARNING] Could not transfer metadata org.apache.axis2:axis2-mar-maven-plugin:1.8.0-SNAPSHOT/maven-metadata.xml
from/to Nexus (http://repository.apache.org/snapshots): Error transferring file: Connection
timed out
Downloading: http://repository.apache.org/snapshots/org/apache/axis2/axis2/1.8.0-SNAPSHOT/maven-metadata.xml
[WARNING] Could not transfer metadata org.apache.axis2:axis2:1.8.0-SNAPSHOT/maven-metadata.xml
from/to Nexus (http://repository.apache.org/snapshots): Error transferring file: Connection
timed out
[INFO] ------------------------------------------------------------------------
[INFO] Reactor Build Order:
[INFO] 
[INFO] Apache Rampart
[INFO] Rampart - Policy
[INFO] Rampart - Trust
[INFO] Rampart - Core
[INFO] Javadoc
[INFO] Rampart - Test Suite
[INFO] Rampart - Mar
[INFO] Rampart - Trust-Mar
[INFO] Rampart - Integration
[INFO] Rampart - Samples
[INFO] Rampart - Distribution
[INFO] Code Coverage Report
[INFO]                                                                         
[INFO] ------------------------------------------------------------------------
[INFO] Building Apache Rampart 1.8.0-SNAPSHOT
[INFO] ------------------------------------------------------------------------
[INFO] 
[INFO] --- maven-clean-plugin:2.5:clean (default-clean) @ rampart-project ---
[INFO] Deleting <https://builds.apache.org/job/Rampart/ws/trunk/target>
[INFO] 
[INFO] --- maven-enforcer-plugin:1.1:enforce (default) @ rampart-project ---
[INFO] 
[INFO] --- gmavenplus-plugin:1.5:execute (initialize) @ rampart-project ---
[INFO] Using Groovy 2.4.4 to perform execute.
[INFO] 
[INFO] --- jacoco-maven-plugin:0.7.5.201505241946:prepare-agent (prepare-agent-for-surefire)
@ rampart-project ---
[INFO] Skipping JaCoCo execution because property jacoco.skip is set.
[INFO] jacoco.surefireArgLine set to empty
[INFO] 
[INFO] --- maven-remote-resources-plugin:1.5:process (default) @ rampart-project ---
[INFO] 
[INFO] --- build-helper-maven-plugin:1.7:attach-artifact (attach-jacoco-exec) @ rampart-project
---
[INFO] Skip attaching artifacts
[INFO] 
[INFO] --- maven-site-plugin:3.4:attach-descriptor (attach-descriptor) @ rampart-project ---
[INFO] 
[INFO] --- maven-assembly-plugin:2.6:single (source-release-assembly) @ rampart-project ---
[INFO] Assemblies have been skipped per configuration of the skipAssembly parameter.
[INFO] 
[INFO] --- maven-source-plugin:2.4:jar-no-fork (source-jars) @ rampart-project ---
[INFO] 
[INFO] --- maven-javadoc-plugin:2.10.3:jar (attach-javadocs) @ rampart-project ---
[INFO] Not executing Javadoc as the project is not a Java classpath-capable package
[INFO] 
[INFO] --- animal-sniffer-maven-plugin:1.14:check (check) @ rampart-project ---
[INFO] Checking unresolved references to org.codehaus.mojo.signature:java16:1.1
[INFO] 
[INFO] --- maven-gpg-plugin:1.5:sign (default) @ rampart-project ---
[INFO] 
[INFO] --- maven-install-plugin:2.5.2:install (default-install) @ rampart-project ---
[INFO] Installing <https://builds.apache.org/job/Rampart/ws/trunk/pom.xml> to <https://builds.apache.org/job/Rampart/ws/.repository/org/apache/rampart/rampart-project/1.8.0-SNAPSHOT/rampart-project-1.8.0-SNAPSHOT.pom>
[INFO] Installing <https://builds.apache.org/job/Rampart/ws/trunk/target/rampart-project-1.8.0-SNAPSHOT-site.xml>
to <https://builds.apache.org/job/Rampart/ws/.repository/org/apache/rampart/rampart-project/1.8.0-SNAPSHOT/rampart-project-1.8.0-SNAPSHOT-site.xml>
[INFO] 
[INFO] --- maven-deploy-plugin:2.8.2:deploy (default-deploy) @ rampart-project ---
Downloading: https://repository.apache.org/content/repositories/snapshots/org/apache/rampart/rampart-project/1.8.0-SNAPSHOT/maven-metadata.xml
[WARNING] Could not transfer metadata org.apache.rampart:rampart-project:1.8.0-SNAPSHOT/maven-metadata.xml
from/to apache.snapshots.https (https://repository.apache.org/content/repositories/snapshots):
Error transferring file: Connection timed out
[INFO] ------------------------------------------------------------------------
[INFO] Reactor Summary:
[INFO] 
[INFO] Apache Rampart .................................... FAILURE [1:12.336s]
[INFO] Rampart - Policy .................................. SKIPPED
[INFO] Rampart - Trust ................................... SKIPPED
[INFO] Rampart - Core .................................... SKIPPED
[INFO] Javadoc ........................................... SKIPPED
[INFO] Rampart - Test Suite .............................. SKIPPED
[INFO] Rampart - Mar ..................................... SKIPPED
[INFO] Rampart - Trust-Mar ............................... SKIPPED
[INFO] Rampart - Integration ............................. SKIPPED
[INFO] Rampart - Samples ................................. SKIPPED
[INFO] Rampart - Distribution ............................ SKIPPED
[INFO] Code Coverage Report .............................. SKIPPED
[INFO] ------------------------------------------------------------------------
[INFO] BUILD FAILURE
[INFO] ------------------------------------------------------------------------
[INFO] Total time: 3:21.319s
[INFO] Finished at: Fri Apr 15 20:36:35 UTC 2016
[INFO] Final Memory: 27M/249M
[INFO] ------------------------------------------------------------------------
Waiting for Jenkins to finish collecting data
[ERROR] Failed to execute goal org.apache.maven.plugins:maven-deploy-plugin:2.8.2:deploy (default-deploy)
on project rampart-project: Failed to retrieve remote metadata org.apache.rampart:rampart-project:1.8.0-SNAPSHOT/maven-metadata.xml:
Could not transfer metadata org.apache.rampart:rampart-project:1.8.0-SNAPSHOT/maven-metadata.xml
from/to apache.snapshots.https (https://repository.apache.org/content/repositories/snapshots):
Error transferring file: Connection timed out -> [Help 1]
[ERROR] 
[ERROR] To see the full stack trace of the errors, re-run Maven with the -e switch.
[ERROR] Re-run Maven using the -X switch to enable full debug logging.
[ERROR] 
[ERROR] For more information about the errors and possible solutions, please read the following
articles:
[ERROR] [Help 1] http://cwiki.apache.org/confluence/display/MAVEN/MojoExecutionException
[JENKINS] Archiving <https://builds.apache.org/job/Rampart/ws/trunk/modules/rampart-trust-mar/pom.xml>
to org.apache.rampart/rahas/1.8.0-SNAPSHOT/rahas-1.8.0-SNAPSHOT.pom
[JENKINS] Archiving <https://builds.apache.org/job/Rampart/ws/trunk/modules/rampart-core/pom.xml>
to org.apache.rampart/rampart-core/1.8.0-SNAPSHOT/rampart-core-1.8.0-SNAPSHOT.pom
[JENKINS] Archiving <https://builds.apache.org/job/Rampart/ws/trunk/modules/rampart-samples/pom.xml>
to org.apache.rampart/rampart-sample/1.8.0-SNAPSHOT/rampart-sample-1.8.0-SNAPSHOT.pom
[JENKINS] Archiving <https://builds.apache.org/job/Rampart/ws/trunk/modules/rampart-trust/pom.xml>
to org.apache.rampart/rampart-trust/1.8.0-SNAPSHOT/rampart-trust-1.8.0-SNAPSHOT.pom
[JENKINS] Archiving <https://builds.apache.org/job/Rampart/ws/trunk/modules/rampart-policy/pom.xml>
to org.apache.rampart/rampart-policy/1.8.0-SNAPSHOT/rampart-policy-1.8.0-SNAPSHOT.pom
[JENKINS] Archiving <https://builds.apache.org/job/Rampart/ws/trunk/modules/rampart-mar/pom.xml>
to org.apache.rampart/rampart/1.8.0-SNAPSHOT/rampart-1.8.0-SNAPSHOT.pom
[JENKINS] Archiving <https://builds.apache.org/job/Rampart/ws/trunk/apidocs/pom.xml>
to org.apache.rampart/apidocs/1.8.0-SNAPSHOT/apidocs-1.8.0-SNAPSHOT.pom
[JENKINS] Archiving <https://builds.apache.org/job/Rampart/ws/trunk/modules/rampart-integration/pom.xml>
to org.apache.rampart/rampart-integration/1.8.0-SNAPSHOT/rampart-integration-1.8.0-SNAPSHOT.pom
[JENKINS] Archiving <https://builds.apache.org/job/Rampart/ws/trunk/pom.xml> to org.apache.rampart/rampart-project/1.8.0-SNAPSHOT/rampart-project-1.8.0-SNAPSHOT.pom
[JENKINS] Archiving <https://builds.apache.org/job/Rampart/ws/trunk/target/rampart-project-1.8.0-SNAPSHOT-site.xml>
to org.apache.rampart/rampart-project/1.8.0-SNAPSHOT/rampart-project-1.8.0-SNAPSHOT-site.xml
[JENKINS] Archiving <https://builds.apache.org/job/Rampart/ws/trunk/modules/distribution/pom.xml>
to org.apache.rampart/rampart-dist/1.8.0-SNAPSHOT/rampart-dist-1.8.0-SNAPSHOT.pom
[JENKINS] Archiving <https://builds.apache.org/job/Rampart/ws/trunk/modules/rampart-tests/pom.xml>
to org.apache.rampart/rampart-tests/1.8.0-SNAPSHOT/rampart-tests-1.8.0-SNAPSHOT.pom
[JENKINS] Archiving <https://builds.apache.org/job/Rampart/ws/trunk/code-coverage/pom.xml>
to org.apache.rampart/code-coverage/1.8.0-SNAPSHOT/code-coverage-1.8.0-SNAPSHOT.pom
Sending e-mails to: java-dev@axis.apache.org
[locks-and-latches] Releasing all the locks
[locks-and-latches] All the locks released
channel stopped

---------------------------------------------------------------------
To unsubscribe, e-mail: java-dev-unsubscribe@axis.apache.org
For additional commands, e-mail: java-dev-help@axis.apache.org


Mime
View raw message