axis-java-dev mailing list archives

Site index · List index
Message view « Date » · « Thread »
Top « Date » · « Thread »
From Apache Jenkins Server <jenk...@builds.apache.org>
Subject Build failed in Jenkins: Axis2 » Apache Axis2 - SAAJ #3716
Date Sat, 13 May 2017 15:49:14 GMT
See <https://builds.apache.org/job/Axis2/org.apache.axis2$axis2-saaj/3716/display/redirect?page=changes>

Changes:

[veithen] Eliminate usages of deprecated Axiom APIs.

------------------------------------------
[INFO]                                                                         
[INFO] ------------------------------------------------------------------------
[INFO] Building Apache Axis2 - SAAJ 1.8.0-SNAPSHOT
[INFO] ------------------------------------------------------------------------
[INFO] Downloading: http://repository.apache.org/snapshots/org/apache/ws/commons/axiom/saaj-testsuite/1.3.0-SNAPSHOT/maven-metadata.xml
[INFO] Downloaded: http://repository.apache.org/snapshots/org/apache/ws/commons/axiom/saaj-testsuite/1.3.0-SNAPSHOT/maven-metadata.xml
(2 KB at 3.5 KB/sec)
[INFO] Downloading: http://repository.apache.org/snapshots/org/apache/ws/commons/axiom/saaj-testsuite/1.3.0-SNAPSHOT/saaj-testsuite-1.3.0-20170513.152848-352.pom
[INFO] Downloaded: http://repository.apache.org/snapshots/org/apache/ws/commons/axiom/saaj-testsuite/1.3.0-SNAPSHOT/saaj-testsuite-1.3.0-20170513.152848-352.pom
(3 KB at 5.3 KB/sec)
[INFO] Downloading: http://repository.apache.org/snapshots/org/apache/ws/commons/axiom/testutils/1.3.0-SNAPSHOT/maven-metadata.xml
[INFO] Downloaded: http://repository.apache.org/snapshots/org/apache/ws/commons/axiom/testutils/1.3.0-SNAPSHOT/maven-metadata.xml
(2 KB at 3.6 KB/sec)
[INFO] Downloading: http://repository.apache.org/snapshots/org/apache/ws/commons/axiom/testutils/1.3.0-SNAPSHOT/testutils-1.3.0-20170513.145648-374.pom
[INFO] Downloaded: http://repository.apache.org/snapshots/org/apache/ws/commons/axiom/testutils/1.3.0-SNAPSHOT/testutils-1.3.0-20170513.145648-374.pom
(3 KB at 5.4 KB/sec)
[INFO] Downloading: http://repository.apache.org/snapshots/org/apache/ws/commons/axiom/soap-testsuite/1.3.0-SNAPSHOT/maven-metadata.xml
[INFO] Downloaded: http://repository.apache.org/snapshots/org/apache/ws/commons/axiom/soap-testsuite/1.3.0-SNAPSHOT/maven-metadata.xml
(2 KB at 3.5 KB/sec)
[INFO] Downloading: http://repository.apache.org/snapshots/org/apache/ws/commons/axiom/soap-testsuite/1.3.0-SNAPSHOT/soap-testsuite-1.3.0-20170513.145924-373.pom
[INFO] Downloaded: http://repository.apache.org/snapshots/org/apache/ws/commons/axiom/soap-testsuite/1.3.0-SNAPSHOT/soap-testsuite-1.3.0-20170513.145924-373.pom
(4 KB at 8.3 KB/sec)
[INFO] Downloading: http://repository.apache.org/snapshots/org/apache/ws/commons/axiom/xml-testsuite/1.3.0-SNAPSHOT/maven-metadata.xml
[INFO] Downloaded: http://repository.apache.org/snapshots/org/apache/ws/commons/axiom/xml-testsuite/1.3.0-SNAPSHOT/maven-metadata.xml
(2 KB at 2.9 KB/sec)
[INFO] Downloading: http://repository.apache.org/snapshots/org/apache/ws/commons/axiom/xml-testsuite/1.3.0-SNAPSHOT/xml-testsuite-1.3.0-20170513.145716-374.pom
[INFO] Downloaded: http://repository.apache.org/snapshots/org/apache/ws/commons/axiom/xml-testsuite/1.3.0-SNAPSHOT/xml-testsuite-1.3.0-20170513.145716-374.pom
(5 KB at 13.0 KB/sec)
[INFO] Downloading: http://repository.apache.org/snapshots/org/apache/ws/commons/axiom/multiton/1.3.0-SNAPSHOT/maven-metadata.xml
[INFO] Downloaded: http://repository.apache.org/snapshots/org/apache/ws/commons/axiom/multiton/1.3.0-SNAPSHOT/maven-metadata.xml
(2 KB at 3.1 KB/sec)
[INFO] Downloading: http://repository.apache.org/snapshots/org/apache/ws/commons/axiom/multiton/1.3.0-SNAPSHOT/multiton-1.3.0-20170513.145518-374.pom
[INFO] Downloaded: http://repository.apache.org/snapshots/org/apache/ws/commons/axiom/multiton/1.3.0-SNAPSHOT/multiton-1.3.0-20170513.145518-374.pom
(2 KB at 3.8 KB/sec)
[INFO] Downloading: http://repository.apache.org/snapshots/org/apache/ws/commons/axiom/xml-utils/1.3.0-SNAPSHOT/maven-metadata.xml
[INFO] Downloaded: http://repository.apache.org/snapshots/org/apache/ws/commons/axiom/xml-utils/1.3.0-SNAPSHOT/maven-metadata.xml
(2 KB at 3.6 KB/sec)
[INFO] Downloading: http://repository.apache.org/snapshots/org/apache/ws/commons/axiom/xml-utils/1.3.0-SNAPSHOT/xml-utils-1.3.0-20170513.145855-373.pom
[INFO] Downloaded: http://repository.apache.org/snapshots/org/apache/ws/commons/axiom/xml-utils/1.3.0-SNAPSHOT/xml-utils-1.3.0-20170513.145855-373.pom
(2 KB at 4.7 KB/sec)
[INFO] Downloading: http://repository.apache.org/snapshots/org/apache/ws/commons/axiom/components/1.3.0-SNAPSHOT/maven-metadata.xml
[INFO] Downloaded: http://repository.apache.org/snapshots/org/apache/ws/commons/axiom/components/1.3.0-SNAPSHOT/maven-metadata.xml
(618 B at 1.5 KB/sec)
[INFO] Downloading: http://repository.apache.org/snapshots/org/apache/ws/commons/axiom/components/1.3.0-SNAPSHOT/components-1.3.0-20170513.145831-373.pom
[INFO] Downloaded: http://repository.apache.org/snapshots/org/apache/ws/commons/axiom/components/1.3.0-SNAPSHOT/components-1.3.0-20170513.145831-373.pom
(2 KB at 3.4 KB/sec)
[INFO] Downloading: http://repository.apache.org/snapshots/org/apache/ws/commons/axiom/saaj-testsuite/1.3.0-SNAPSHOT/saaj-testsuite-1.3.0-20170513.152848-352.jar
[INFO] Downloading: http://repository.apache.org/snapshots/org/apache/ws/commons/axiom/soap-testsuite/1.3.0-SNAPSHOT/soap-testsuite-1.3.0-20170513.145924-373.jar
[INFO] Downloading: http://repository.apache.org/snapshots/org/apache/ws/commons/axiom/testutils/1.3.0-SNAPSHOT/testutils-1.3.0-20170513.145648-374.jar
[INFO] Downloading: http://repository.apache.org/snapshots/org/apache/ws/commons/axiom/multiton/1.3.0-SNAPSHOT/multiton-1.3.0-20170513.145518-374.jar
[INFO] Downloading: http://repository.apache.org/snapshots/org/apache/ws/commons/axiom/xml-testsuite/1.3.0-SNAPSHOT/xml-testsuite-1.3.0-20170513.145716-374.jar
[INFO] Downloaded: http://repository.apache.org/snapshots/org/apache/ws/commons/axiom/multiton/1.3.0-SNAPSHOT/multiton-1.3.0-20170513.145518-374.jar
(14 KB at 33.8 KB/sec)
[INFO] Downloading: http://repository.apache.org/snapshots/org/apache/ws/commons/axiom/xml-utils/1.3.0-SNAPSHOT/xml-utils-1.3.0-20170513.145855-373.jar
[INFO] Downloaded: http://repository.apache.org/snapshots/org/apache/ws/commons/axiom/saaj-testsuite/1.3.0-SNAPSHOT/saaj-testsuite-1.3.0-20170513.152848-352.jar
(20 KB at 40.5 KB/sec)
[INFO] Downloaded: http://repository.apache.org/snapshots/org/apache/ws/commons/axiom/xml-testsuite/1.3.0-SNAPSHOT/xml-testsuite-1.3.0-20170513.145716-374.jar
(42 KB at 86.3 KB/sec)
[INFO] Downloaded: http://repository.apache.org/snapshots/org/apache/ws/commons/axiom/testutils/1.3.0-SNAPSHOT/testutils-1.3.0-20170513.145648-374.jar
(50 KB at 86.3 KB/sec)
[INFO] Downloaded: http://repository.apache.org/snapshots/org/apache/ws/commons/axiom/soap-testsuite/1.3.0-SNAPSHOT/soap-testsuite-1.3.0-20170513.145924-373.jar
(168 KB at 256.0 KB/sec)
[INFO] Downloaded: http://repository.apache.org/snapshots/org/apache/ws/commons/axiom/xml-utils/1.3.0-SNAPSHOT/xml-utils-1.3.0-20170513.145855-373.jar
(14 KB at 17.7 KB/sec)
[INFO] 
[INFO] --- maven-clean-plugin:2.2:clean (default-clean) @ axis2-saaj ---
[INFO] Deleting directory <https://builds.apache.org/job/Axis2/org.apache.axis2$axis2-saaj/ws/target>
[INFO] 
[INFO] --- maven-enforcer-plugin:1.1:enforce (default) @ axis2-saaj ---
[INFO] 
[INFO] --- gmavenplus-plugin:1.5:execute (create-tmp-directory) @ axis2-saaj ---
[INFO] Using Groovy 2.4.4 to perform execute.
[INFO] 
[INFO] --- alta-maven-plugin:0.5:generate-properties (default) @ axis2-saaj ---
[INFO] 
[INFO] --- maven-remote-resources-plugin:1.5:process (process-resource-bundles) @ axis2-saaj
---
[INFO] 
[INFO] --- maven-remote-resources-plugin:1.5:process (default) @ axis2-saaj ---
[INFO] 
[INFO] --- maven-resources-plugin:2.4.2:resources (default-resources) @ axis2-saaj ---
[INFO] Using 'UTF-8' encoding to copy filtered resources.
[INFO] Copying 4 resources
[INFO] Copying 3 resources
[INFO] Copying 3 resources
[INFO] 
[INFO] --- maven-compiler-plugin:3.5.1:compile (default-compile) @ axis2-saaj ---
[INFO] Changes detected - recompiling the module!
[INFO] Compiling 29 source files to <https://builds.apache.org/job/Axis2/org.apache.axis2$axis2-saaj/ws/target/classes>
[INFO] <https://builds.apache.org/job/Axis2/org.apache.axis2$axis2-saaj/ws/src/org/apache/axis2/saaj/AttachmentPartImpl.java>:
Some input files use or override a deprecated API.
[INFO] <https://builds.apache.org/job/Axis2/org.apache.axis2$axis2-saaj/ws/src/org/apache/axis2/saaj/AttachmentPartImpl.java>:
Recompile with -Xlint:deprecation for details.
[INFO] <https://builds.apache.org/job/Axis2/org.apache.axis2$axis2-saaj/ws/src/org/apache/axis2/saaj/util/SAAJDataSource.java>:
Some input files use unchecked or unsafe operations.
[INFO] <https://builds.apache.org/job/Axis2/org.apache.axis2$axis2-saaj/ws/src/org/apache/axis2/saaj/util/SAAJDataSource.java>:
Recompile with -Xlint:unchecked for details.
[INFO] -------------------------------------------------------------
[ERROR] COMPILATION ERROR : 
[INFO] -------------------------------------------------------------
[ERROR] <https://builds.apache.org/job/Axis2/org.apache.axis2$axis2-saaj/ws/src/org/apache/axis2/saaj/SOAPElementImpl.java>:[507,88]
cannot find symbol
  symbol:   variable SOAP11
  location: interface org.apache.axiom.soap.SOAPVersion
[ERROR] <https://builds.apache.org/job/Axis2/org.apache.axis2$axis2-saaj/ws/src/org/apache/axis2/saaj/SOAPElementImpl.java>:[521,95]
cannot find symbol
  symbol:   variable SOAP12
  location: interface org.apache.axiom.soap.SOAPVersion
[ERROR] <https://builds.apache.org/job/Axis2/org.apache.axis2$axis2-saaj/ws/src/org/apache/axis2/saaj/SOAPHeaderElementImpl.java>:[99,88]
cannot find symbol
  symbol:   variable SOAP11
  location: interface org.apache.axiom.soap.SOAPVersion
[ERROR] <https://builds.apache.org/job/Axis2/org.apache.axis2$axis2-saaj/ws/src/org/apache/axis2/saaj/SOAPHeaderElementImpl.java>:[107,88]
cannot find symbol
  symbol:   variable SOAP11
  location: interface org.apache.axiom.soap.SOAPVersion
[ERROR] <https://builds.apache.org/job/Axis2/org.apache.axis2$axis2-saaj/ws/src/org/apache/axis2/saaj/SOAPHeaderElementImpl.java>:[128,88]
cannot find symbol
  symbol:   variable SOAP11
  location: interface org.apache.axiom.soap.SOAPVersion
[ERROR] <https://builds.apache.org/job/Axis2/org.apache.axis2$axis2-saaj/ws/src/org/apache/axis2/saaj/SOAPHeaderElementImpl.java>:[136,88]
cannot find symbol
  symbol:   variable SOAP11
  location: interface org.apache.axiom.soap.SOAPVersion
[ERROR] <https://builds.apache.org/job/Axis2/org.apache.axis2$axis2-saaj/ws/src/org/apache/axis2/saaj/SOAPEnvelopeImpl.java>:[185,88]
cannot find symbol
  symbol:   variable SOAP12
  location: interface org.apache.axiom.soap.SOAPVersion
[ERROR] <https://builds.apache.org/job/Axis2/org.apache.axis2$axis2-saaj/ws/src/org/apache/axis2/saaj/SOAPEnvelopeImpl.java>:[200,88]
cannot find symbol
  symbol:   variable SOAP12
  location: interface org.apache.axiom.soap.SOAPVersion
[ERROR] <https://builds.apache.org/job/Axis2/org.apache.axis2$axis2-saaj/ws/src/org/apache/axis2/saaj/SOAPEnvelopeImpl.java>:[202,95]
cannot find symbol
  symbol:   variable SOAP11
  location: interface org.apache.axiom.soap.SOAPVersion
[ERROR] <https://builds.apache.org/job/Axis2/org.apache.axis2$axis2-saaj/ws/src/org/apache/axis2/saaj/SOAPMessageImpl.java>:[396,148]
cannot find symbol
  symbol:   variable SOAP11
  location: interface org.apache.axiom.soap.SOAPVersion
[ERROR] <https://builds.apache.org/job/Axis2/org.apache.axis2$axis2-saaj/ws/src/org/apache/axis2/saaj/SOAPHeaderImpl.java>:[262,88]
cannot find symbol
  symbol:   variable SOAP11
  location: interface org.apache.axiom.soap.SOAPVersion
[ERROR] <https://builds.apache.org/job/Axis2/org.apache.axis2$axis2-saaj/ws/src/org/apache/axis2/saaj/SOAPHeaderImpl.java>:[327,88]
cannot find symbol
  symbol:   variable SOAP11
  location: interface org.apache.axiom.soap.SOAPVersion
[ERROR] <https://builds.apache.org/job/Axis2/org.apache.axis2$axis2-saaj/ws/src/org/apache/axis2/saaj/SOAPHeaderImpl.java>:[329,95]
cannot find symbol
  symbol:   variable SOAP12
  location: interface org.apache.axiom.soap.SOAPVersion
[ERROR] <https://builds.apache.org/job/Axis2/org.apache.axis2$axis2-saaj/ws/src/org/apache/axis2/saaj/SOAPFaultImpl.java>:[65,88]
cannot find symbol
  symbol:   variable SOAP11
  location: interface org.apache.axiom.soap.SOAPVersion
[ERROR] <https://builds.apache.org/job/Axis2/org.apache.axis2$axis2-saaj/ws/src/org/apache/axis2/saaj/SOAPFaultImpl.java>:[113,88]
cannot find symbol
  symbol:   variable SOAP11
  location: interface org.apache.axiom.soap.SOAPVersion
[ERROR] <https://builds.apache.org/job/Axis2/org.apache.axis2$axis2-saaj/ws/src/org/apache/axis2/saaj/SOAPFaultImpl.java>:[117,95]
cannot find symbol
  symbol:   variable SOAP12
  location: interface org.apache.axiom.soap.SOAPVersion
[ERROR] <https://builds.apache.org/job/Axis2/org.apache.axis2$axis2-saaj/ws/src/org/apache/axis2/saaj/SOAPFaultImpl.java>:[136,92]
cannot find symbol
  symbol:   variable SOAP11
  location: interface org.apache.axiom.soap.SOAPVersion
[ERROR] <https://builds.apache.org/job/Axis2/org.apache.axis2$axis2-saaj/ws/src/org/apache/axis2/saaj/SOAPFaultImpl.java>:[138,99]
cannot find symbol
  symbol:   variable SOAP12
  location: interface org.apache.axiom.soap.SOAPVersion
[ERROR] <https://builds.apache.org/job/Axis2/org.apache.axis2$axis2-saaj/ws/src/org/apache/axis2/saaj/SOAPFaultImpl.java>:[190,88]
cannot find symbol
  symbol:   variable SOAP11
  location: interface org.apache.axiom.soap.SOAPVersion
[ERROR] <https://builds.apache.org/job/Axis2/org.apache.axis2$axis2-saaj/ws/src/org/apache/axis2/saaj/SOAPFaultImpl.java>:[192,95]
cannot find symbol
  symbol:   variable SOAP12
  location: interface org.apache.axiom.soap.SOAPVersion
[ERROR] <https://builds.apache.org/job/Axis2/org.apache.axis2$axis2-saaj/ws/src/org/apache/axis2/saaj/SOAPFaultImpl.java>:[290,92]
cannot find symbol
  symbol:   variable SOAP11
  location: interface org.apache.axiom.soap.SOAPVersion
[ERROR] <https://builds.apache.org/job/Axis2/org.apache.axis2$axis2-saaj/ws/src/org/apache/axis2/saaj/SOAPFaultImpl.java>:[292,99]
cannot find symbol
  symbol:   variable SOAP12
  location: interface org.apache.axiom.soap.SOAPVersion
[ERROR] <https://builds.apache.org/job/Axis2/org.apache.axis2$axis2-saaj/ws/src/org/apache/axis2/saaj/SOAPFaultImpl.java>:[296,92]
cannot find symbol
  symbol:   variable SOAP11
  location: interface org.apache.axiom.soap.SOAPVersion
[ERROR] <https://builds.apache.org/job/Axis2/org.apache.axis2$axis2-saaj/ws/src/org/apache/axis2/saaj/SOAPFaultImpl.java>:[300,99]
cannot find symbol
  symbol:   variable SOAP12
  location: interface org.apache.axiom.soap.SOAPVersion
[ERROR] <https://builds.apache.org/job/Axis2/org.apache.axis2$axis2-saaj/ws/src/org/apache/axis2/saaj/SOAPFaultImpl.java>:[320,88]
cannot find symbol
  symbol:   variable SOAP11
  location: interface org.apache.axiom.soap.SOAPVersion
[ERROR] <https://builds.apache.org/job/Axis2/org.apache.axis2$axis2-saaj/ws/src/org/apache/axis2/saaj/SOAPFaultImpl.java>:[322,95]
cannot find symbol
  symbol:   variable SOAP12
  location: interface org.apache.axiom.soap.SOAPVersion
[ERROR] <https://builds.apache.org/job/Axis2/org.apache.axis2$axis2-saaj/ws/src/org/apache/axis2/saaj/SOAPFaultImpl.java>:[355,88]
cannot find symbol
  symbol:   variable SOAP11
  location: interface org.apache.axiom.soap.SOAPVersion
[ERROR] <https://builds.apache.org/job/Axis2/org.apache.axis2$axis2-saaj/ws/src/org/apache/axis2/saaj/SOAPFaultImpl.java>:[357,95]
cannot find symbol
  symbol:   variable SOAP12
  location: interface org.apache.axiom.soap.SOAPVersion
[ERROR] <https://builds.apache.org/job/Axis2/org.apache.axis2$axis2-saaj/ws/src/org/apache/axis2/saaj/SOAPFaultImpl.java>:[407,88]
cannot find symbol
  symbol:   variable SOAP11
  location: interface org.apache.axiom.soap.SOAPVersion
[ERROR] <https://builds.apache.org/job/Axis2/org.apache.axis2$axis2-saaj/ws/src/org/apache/axis2/saaj/SOAPFaultImpl.java>:[460,88]
cannot find symbol
  symbol:   variable SOAP11
  location: interface org.apache.axiom.soap.SOAPVersion
[ERROR] <https://builds.apache.org/job/Axis2/org.apache.axis2$axis2-saaj/ws/src/org/apache/axis2/saaj/SOAPFaultImpl.java>:[485,88]
cannot find symbol
  symbol:   variable SOAP11
  location: interface org.apache.axiom.soap.SOAPVersion
[ERROR] <https://builds.apache.org/job/Axis2/org.apache.axis2$axis2-saaj/ws/src/org/apache/axis2/saaj/SOAPFaultImpl.java>:[525,88]
cannot find symbol
  symbol:   variable SOAP11
  location: interface org.apache.axiom.soap.SOAPVersion
[ERROR] <https://builds.apache.org/job/Axis2/org.apache.axis2$axis2-saaj/ws/src/org/apache/axis2/saaj/SOAPFaultImpl.java>:[557,88]
cannot find symbol
  symbol:   variable SOAP11
  location: interface org.apache.axiom.soap.SOAPVersion
[ERROR] <https://builds.apache.org/job/Axis2/org.apache.axis2$axis2-saaj/ws/src/org/apache/axis2/saaj/SOAPFaultImpl.java>:[580,88]
cannot find symbol
  symbol:   variable SOAP11
  location: interface org.apache.axiom.soap.SOAPVersion
[ERROR] <https://builds.apache.org/job/Axis2/org.apache.axis2$axis2-saaj/ws/src/org/apache/axis2/saaj/SOAPFaultImpl.java>:[602,88]
cannot find symbol
  symbol:   variable SOAP11
  location: interface org.apache.axiom.soap.SOAPVersion
[ERROR] <https://builds.apache.org/job/Axis2/org.apache.axis2$axis2-saaj/ws/src/org/apache/axis2/saaj/SOAPFaultImpl.java>:[632,88]
cannot find symbol
  symbol:   variable SOAP11
  location: interface org.apache.axiom.soap.SOAPVersion
[ERROR] <https://builds.apache.org/job/Axis2/org.apache.axis2$axis2-saaj/ws/src/org/apache/axis2/saaj/SOAPFaultImpl.java>:[658,88]
cannot find symbol
  symbol:   variable SOAP11
  location: interface org.apache.axiom.soap.SOAPVersion
[ERROR] <https://builds.apache.org/job/Axis2/org.apache.axis2$axis2-saaj/ws/src/org/apache/axis2/saaj/SOAPFaultImpl.java>:[660,95]
cannot find symbol
  symbol:   variable SOAP12
  location: interface org.apache.axiom.soap.SOAPVersion
[ERROR] <https://builds.apache.org/job/Axis2/org.apache.axis2$axis2-saaj/ws/src/org/apache/axis2/saaj/SOAPFaultImpl.java>:[677,67]
cannot find symbol
  symbol:   variable SOAP11
  location: interface org.apache.axiom.soap.SOAPVersion
[ERROR] <https://builds.apache.org/job/Axis2/org.apache.axis2$axis2-saaj/ws/src/org/apache/axis2/saaj/SOAPFaultImpl.java>:[682,74]
cannot find symbol
  symbol:   variable SOAP12
  location: interface org.apache.axiom.soap.SOAPVersion
[ERROR] <https://builds.apache.org/job/Axis2/org.apache.axis2$axis2-saaj/ws/src/org/apache/axis2/saaj/SOAPFaultImpl.java>:[707,88]
cannot find symbol
  symbol:   variable SOAP11
  location: interface org.apache.axiom.soap.SOAPVersion
[ERROR] <https://builds.apache.org/job/Axis2/org.apache.axis2$axis2-saaj/ws/src/org/apache/axis2/saaj/SOAPFaultImpl.java>:[727,88]
cannot find symbol
  symbol:   variable SOAP11
  location: interface org.apache.axiom.soap.SOAPVersion
[ERROR] <https://builds.apache.org/job/Axis2/org.apache.axis2$axis2-saaj/ws/src/org/apache/axis2/saaj/SOAPBodyImpl.java>:[518,88]
cannot find symbol
  symbol:   variable SOAP11
  location: interface org.apache.axiom.soap.SOAPVersion
[ERROR] <https://builds.apache.org/job/Axis2/org.apache.axis2$axis2-saaj/ws/src/org/apache/axis2/saaj/SOAPBodyImpl.java>:[520,95]
cannot find symbol
  symbol:   variable SOAP12
  location: interface org.apache.axiom.soap.SOAPVersion
[INFO] 44 errors 
[INFO] -------------------------------------------------------------

---------------------------------------------------------------------
To unsubscribe, e-mail: java-dev-unsubscribe@axis.apache.org
For additional commands, e-mail: java-dev-help@axis.apache.org


Mime
View raw message