beam-builds mailing list archives

Site index · List index
Message view « Date » · « Thread »
Top « Date » · « Thread »
From Apache Jenkins Server <jenk...@builds.apache.org>
Subject Build failed in Jenkins: beam_Release_NightlySnapshot #305
Date Thu, 17 Jan 2019 08:19:26 GMT
See <https://builds.apache.org/job/beam_Release_NightlySnapshot/305/display/redirect?page=changes>

Changes:

[github] Fix equality comparison to be against method invocation, not method

[klk] Turn off spotless paddedCell

[robertwb] Revert "Move Python Validates Runner Flink test to PreCommit."

[echauchot] [BEAM-6279] Increasing ES restClient socket and retry timeout from 90s

[echauchot] [BEAM-6279] Force embedded ES cluster to have only one node

[relax] Fix nested collections.

[relax] Fix CheckStyle.

[markliu] [BEAM-6454] Fix dict_values error in DataflowRunner

[migryz] Update syncjenkins shema

[relax] Add back newline.

[github] [BEAM-6405] Disable parallel test execution of Java

[kenn] Move the contribution testing guide to the confluence wiki (#7486)

------------------------------------------
[...truncated 2.87 MB...]
adding 'apache-beam-2.11.0.dev0/apache_beam.egg-info/PKG-INFO'
adding 'apache-beam-2.11.0.dev0/apache_beam.egg-info/requires.txt'
adding 'apache-beam-2.11.0.dev0/apache_beam.egg-info/not-zip-safe'
adding 'apache-beam-2.11.0.dev0/apache_beam.egg-info/top_level.txt'
Creating tar archive
removing 'apache-beam-2.11.0.dev0' (and everything under it)
sdist archive name: <https://builds.apache.org/job/beam_Release_NightlySnapshot/ws/src/sdks/python/precommit/dataflow/build/apache-beam-2.11.0.dev0.tar.gz>

> Task :beam-sdks-python-precommit-dataflow:assemble
> Task :beam-sdks-python-precommit-dataflow:test UP-TO-DATE
> Task :beam-sdks-python-precommit-dataflow:check UP-TO-DATE
> Task :beam-sdks-python-precommit-dataflow:build
> Task :beam-test-infra-metrics:compileJava NO-SOURCE
> Task :beam-test-infra-metrics:compileGroovy NO-SOURCE
> Task :beam-test-infra-metrics:processResources NO-SOURCE
> Task :beam-test-infra-metrics:classes UP-TO-DATE
> Task :beam-test-infra-metrics:jar
> Task :beam-test-infra-metrics:assemble
> Task :beam-test-infra-metrics:spotlessGroovy
> Task :beam-test-infra-metrics:spotlessGroovyCheck
> Task :beam-test-infra-metrics:spotlessGroovyGradle
> Task :beam-test-infra-metrics:spotlessGroovyGradleCheck
> Task :beam-test-infra-metrics:spotlessCheck
> Task :beam-test-infra-metrics:compileTestJava NO-SOURCE
> Task :beam-test-infra-metrics:compileTestGroovy FROM-CACHE
> Task :beam-test-infra-metrics:processTestResources NO-SOURCE
> Task :beam-test-infra-metrics:testClasses UP-TO-DATE
> Task :beam-test-infra-metrics:test FROM-CACHE
> Task :beam-test-infra-metrics:check
> Task :beam-test-infra-metrics:build
> Task :beam-vendor-grpc-1_13_1:compileJava NO-SOURCE
> Task :beam-vendor-grpc-1_13_1:processResources NO-SOURCE
> Task :beam-vendor-grpc-1_13_1:classes UP-TO-DATE
> Task :beam-vendor-grpc-1_13_1:jar SKIPPED
> Task :beam-vendor-grpc-1_13_1:shadowJar
> Task :beam-vendor-grpc-1_13_1:assemble
> Task :beam-vendor-grpc-1_13_1:compileTestJava NO-SOURCE
> Task :beam-vendor-grpc-1_13_1:processTestResources NO-SOURCE
> Task :beam-vendor-grpc-1_13_1:testClasses UP-TO-DATE
> Task :beam-vendor-grpc-1_13_1:test NO-SOURCE
> Task :beam-vendor-grpc-1_13_1:validateVendoring
> Task :beam-vendor-grpc-1_13_1:check
> Task :beam-vendor-grpc-1_13_1:build
> Task :beam-vendor-guava-20_0:compileJava NO-SOURCE
> Task :beam-vendor-guava-20_0:processResources NO-SOURCE
> Task :beam-vendor-guava-20_0:classes UP-TO-DATE
> Task :beam-vendor-guava-20_0:jar SKIPPED
> Task :beam-vendor-guava-20_0:shadowJar
> Task :beam-vendor-guava-20_0:assemble
> Task :beam-vendor-guava-20_0:compileTestJava NO-SOURCE
> Task :beam-vendor-guava-20_0:processTestResources NO-SOURCE
> Task :beam-vendor-guava-20_0:testClasses UP-TO-DATE
> Task :beam-vendor-guava-20_0:test NO-SOURCE
> Task :beam-vendor-guava-20_0:validateVendoring
> Task :beam-vendor-guava-20_0:check
> Task :beam-vendor-guava-20_0:build
> Task :beam-vendor-sdks-java-extensions-protobuf:jar
> Task :beam-vendor-sdks-java-extensions-protobuf:compileTestJava NO-SOURCE
> Task :beam-vendor-sdks-java-extensions-protobuf:processTestResources NO-SOURCE
> Task :beam-vendor-sdks-java-extensions-protobuf:testClasses UP-TO-DATE
> Task :beam-vendor-sdks-java-extensions-protobuf:packageTests
> Task :beam-vendor-sdks-java-extensions-protobuf:assemble
> Task :beam-vendor-sdks-java-extensions-protobuf:checkstyleMain NO-SOURCE
> Task :beam-vendor-sdks-java-extensions-protobuf:checkstyleTest NO-SOURCE
> Task :beam-vendor-sdks-java-extensions-protobuf:findbugsMain
> Task :beam-vendor-sdks-java-extensions-protobuf:javadoc NO-SOURCE
> Task :beam-vendor-sdks-java-extensions-protobuf:spotlessJava
> Task :beam-vendor-sdks-java-extensions-protobuf:spotlessJavaCheck
> Task :beam-vendor-sdks-java-extensions-protobuf:spotlessCheck
> Task :beam-vendor-sdks-java-extensions-protobuf:test NO-SOURCE
> Task :beam-vendor-sdks-java-extensions-protobuf:validateShadedJarDoesntLeakNonProjectClasses
> Task :beam-vendor-sdks-java-extensions-protobuf:check
> Task :beam-vendor-sdks-java-extensions-protobuf:build
> Task :beam-website:assemble UP-TO-DATE
> Task :beam-website:setupBuildDir

> Task :beam-website:buildDockerImage
Sending build context to Docker daemon   26.4MB
Step 1/7 : FROM ruby:2.5
 ---> 60c3a1518797
Step 2/7 : WORKDIR /ruby
 ---> Using cache
 ---> 85a18ce2b17c
Step 3/7 : RUN gem install bundler
 ---> Using cache
 ---> aabe80d01895
Step 4/7 : ADD Gemfile Gemfile.lock /ruby/
 ---> Using cache
 ---> 018edbfa16e6
Step 5/7 : RUN bundle install --deployment --path $GEM_HOME
 ---> Using cache
 ---> 78b5e64a0b7b
Step 6/7 : ENV LC_ALL C.UTF-8
 ---> Using cache
 ---> c56981647dc7
Step 7/7 : CMD sleep 3600
 ---> Using cache
 ---> db6e73d98240
Successfully built db6e73d98240
Successfully tagged beam-website:latest

> Task :beam-website:createDockerContainer

> Task :beam-website:startDockerContainer
4c72720074c6422a608cff6260a3b7349c170bca42fe876ffd6112d0858f2f53

> Task :beam-website:buildLocalWebsite
`/` is not writable.
Bundler will use `/tmp/bundler/home/unknown' as your home directory temporarily.
Configuration file: /repo/website/_config.yml
Configuration file: /repo/website/_config_test.yml
            Source: /repo/website/src
       Destination: generated-local-content
 Incremental build: enabled
      Generating... 
                    done in 11.246 seconds.
 Auto-regeneration: disabled. Use --watch to enable.

> Task :beam-website:testWebsite
`/` is not writable.
Bundler will use `/tmp/bundler/home/unknown' as your home directory temporarily.
Running ["LinkCheck", "ImageCheck", "ScriptCheck", "HtmlCheck"] on ["./generated-local-content"]
on *.html... 


Checking 864 external links...
Ran on 189 files!


HTML-Proofer finished successfully.

> Task :beam-website:stopAndRemoveDockerContainer
4c72720074c6422a608cff6260a3b7349c170bca42fe876ffd6112d0858f2f53

> Task :beam-website:buildWebsite
> Task :beam-website:check
> Task :beam-website:build
> Task :release:compileJava NO-SOURCE
> Task :release:compileGroovy FROM-CACHE
> Task :release:processResources NO-SOURCE
> Task :release:classes UP-TO-DATE
> Task :release:jar
> Task :release:assemble
> Task :release:compileTestJava NO-SOURCE
> Task :release:compileTestGroovy NO-SOURCE
> Task :release:processTestResources NO-SOURCE
> Task :release:testClasses UP-TO-DATE
> Task :release:test NO-SOURCE
> Task :release:check UP-TO-DATE
> Task :release:build

FAILURE: Build completed with 2 failures.

1: Task failed with an exception.
-----------
* What went wrong:
Execution failed for task ':beam-sdks-java-core:spotlessJava'.
> The following files had format violations:
      sdks/java/core/build/generated-src/antlr/main/java/org/apache/beam/sdk/schemas/parser/generated/FieldSpecifierNotationVisitor.java
          @@ -1,5 +1,3 @@
          -//·Generated·from·java/org/apache/beam/sdk/schemas/parser/generated/FieldSpecifierNotation.g4·by·ANTLR·4.7
          -
           /*
           ·*·Licensed·to·the·Apache·Software·Foundation·(ASF)·under·one
           ·*·or·more·contributor·license·agreements.··See·the·NOTICE·file
          @@ -22,76 +20,86 @@
           import·org.antlr.v4.runtime.tree.ParseTreeVisitor;
           
           /**
          -·*·This·interface·defines·a·complete·generic·visitor·for·a·parse·tree·produced
          -·*·by·{@link·FieldSpecifierNotationParser}.
          +·*·This·interface·defines·a·complete·generic·visitor·for·a·parse·tree·produced·by·{@link
          +·*·FieldSpecifierNotationParser}.
           ·*
          -·*·@param·<T>·The·return·type·of·the·visit·operation.·Use·{@link·Void}·for
          -·*·operations·with·no·return·type.
          +·*·@param·<T>·The·return·type·of·the·visit·operation.·Use·{@link·Void}·for·operations·with·no·return
          +·*·····type.
           ·*/
           public·interface·FieldSpecifierNotationVisitor<T>·extends·ParseTreeVisitor<T>·{
          -\t/**
          -\t·*·Visit·a·parse·tree·produced·by·{@link·FieldSpecifierNotationParser#fieldSpecifier}.
          -\t·*·@param·ctx·the·parse·tree
          -\t·*·@return·the·visitor·result
          -\t·*/
          -\tT·visitFieldSpecifier(FieldSpecifierNotationParser.FieldSpecifierContext·ctx);
          -\t/**
          -\t·*·Visit·a·parse·tree·produced·by·{@link·FieldSpecifierNotationParser#dotExpression}.
          -\t·*·@param·ctx·the·parse·tree
          -\t·*·@return·the·visitor·result
          -\t·*/
          -\tT·visitDotExpression(FieldSpecifierNotationParser.DotExpressionContext·ctx);
          -\t/**
          -\t·*·Visit·a·parse·tree·produced·by·the·{@code·qualifyComponent}
          -\t·*·labeled·alternative·in·{@link·FieldSpecifierNotationParser#dotExpressionComponent}.
          -\t·*·@param·ctx·the·parse·tree
          -\t·*·@return·the·visitor·result
          -\t·*/
          -\tT·visitQualifyComponent(FieldSpecifierNotationParser.QualifyComponentContext·ctx);
          -\t/**
          -\t·*·Visit·a·parse·tree·produced·by·the·{@code·simpleIdentifier}
          -\t·*·labeled·alternative·in·{@link·FieldSpecifierNotationParser#dotExpressionComponent}.
          -\t·*·@param·ctx·the·parse·tree
          -\t·*·@return·the·visitor·result
          -\t·*/
          -\tT·visitSimpleIdentifier(FieldSpecifierNotationParser.SimpleIdentifierContext·ctx);
          -\t/**
          -\t·*·Visit·a·parse·tree·produced·by·the·{@code·wildcard}
      ... (114 more lines that didn't fit)
  Violations also present in:
      sdks/java/core/build/generated-src/antlr/main/java/org/apache/beam/sdk/schemas/parser/generated/FieldSpecifierNotationListener.java
      sdks/java/core/build/generated-src/antlr/main/java/org/apache/beam/sdk/schemas/parser/generated/FieldSpecifierNotationBaseListener.java
      sdks/java/core/build/generated-src/antlr/main/java/org/apache/beam/sdk/schemas/parser/generated/FieldSpecifierNotationParser.java
      sdks/java/core/build/generated-src/antlr/main/java/org/apache/beam/sdk/schemas/parser/generated/FieldSpecifierNotationBaseVisitor.java
      sdks/java/core/build/generated-src/antlr/main/java/org/apache/beam/sdk/schemas/parser/generated/FieldSpecifierNotationLexer.java
      sdks/java/core/src/test/java/org/apache/beam/sdk/schemas/utils/TestPOJOs.java
      sdks/java/core/src/test/java/org/apache/beam/sdk/schemas/JavaFieldSchemaTest.java
  Run 'gradlew spotlessApply' to fix these violations.

* Try:
Run with --stacktrace option to get the stack trace. Run with --info or --debug option to
get more log output. Run with --scan to get full insights.
==============================================================================

2: Task failed with an exception.
-----------
* Where:
Build file '<https://builds.apache.org/job/beam_Release_NightlySnapshot/ws/src/sdks/python/build.gradle'>
line: 60

* What went wrong:
Execution failed for task ':beam-sdks-python:testPython3'.
> Process 'command 'sh'' finished with non-zero exit value 1

* Try:
Run with --stacktrace option to get the stack trace. Run with --info or --debug option to
get more log output. Run with --scan to get full insights.
==============================================================================

* Get more help at https://help.gradle.org

Deprecated Gradle features were used in this build, making it incompatible with Gradle 5.0.
Use '--warning-mode all' to show the individual deprecation warnings.
See https://docs.gradle.org/4.10.3/userguide/command_line_interface.html#sec:command_line_warnings

BUILD FAILED in 1h 18m 41s
995 actionable tasks: 983 executed, 10 from cache, 2 up-to-date

Publishing build scan...
https://gradle.com/s/vx4thzuh7wd3c

Build step 'Invoke Gradle script' changed build result to FAILURE
Build step 'Invoke Gradle script' marked build as failure

---------------------------------------------------------------------
To unsubscribe, e-mail: builds-unsubscribe@beam.apache.org
For additional commands, e-mail: builds-help@beam.apache.org


Mime
View raw message